{"text_format":"1","workbook":"xlsx","n_sheets":10,"sheets":["Start","Print Results","FullDetails","Results","Output","Database","Indoor","Translation","Lists","Conditions"],"not_rendered":{"charts":2,"images":13,"macros":1,"external_links":0,"defined_names":0,"comments":0,"pivot_tables":0},"unopened":[],"bounds":{"document_bytes":16777216,"sheet_cells":100000,"rows_first":2000,"rows_last":500,"rows_between":2000,"halvings":0,"cell_chars":16384,"cell_head_chars":4096},"cells_cut":0,"cells_raw":0,"read":"whole","date_system":"1900"}

{"sheet":"Start","index":0,"n_rows":2,"n_cols":4,"rows_kept":2,"cut":false,"hidden":false,"merged":[[1,3,1,13]]}
[]
[null,null,null,{"$f":"VLOOKUP(Output!J2,Translation!A2:BE6,57,FALSE)","v":"Press \"Start\" to begin your new project. Note: you'll lose all the information related to your last selection."}]

{"sheet":"Print Results","index":1,"n_rows":142,"n_cols":11,"rows_kept":142,"cut":false,"hidden":false,"merged":[[19,0,20,5],[106,10,108,10],[108,4,108,5],[115,1,117,3],[115,4,116,6],[115,7,117,7],[115,8,117,8],[115,9,117,9],[115,10,117,10],[117,4,117,5],[111,4,111,5],[112,4,112,5],[113,4,113,5],[114,4,114,5],[109,1,114,3],[106,1,108,3],[106,4,107,6],[106,7,108,7],[106,8,108,8],[106,9,108,9],[109,4,109,5],[110,4,110,5],[0,6,2,10],[19,10,21,10],[19,9,21,9],[19,8,21,8],[19,7,21,7],[4,0,4,10],[97,1,99,3],[97,4,98,6],[97,7,99,7],[97,8,99,8],[97,9,99,9],[97,10,99,10],[99,4,99,5],[55,4,55,5],[56,4,56,5],[57,4,57,5],[58,4,58,5],[59,4,59,5],[60,4,60,5],[22,0,22,6],[23,0,23,6],[24,0,24,6],[64,4,64,5],[43,3,43,4],[41,0,41,10],[54,4,54,5],[52,4,53,6],[52,1,54,3],[50,1,50,10],[46,7,46,8],[52,7,54,7],[52,8,54,8],[52,9,54,9],[52,10,54,10],[45,3,45,4],[46,3,46,4],[45,7,45,8],[44,3,44,4],[43,7,43,8],[44,7,44,8],[126,4,126,5],[133,4,134,6],[135,4,135,5],[84,4,84,5],[85,4,85,5],[86,4,86,5],[87,4,87,5],[100,4,100,5],[101,4,101,5],[102,4,102,5],[103,4,103,5],[104,4,104,5],[91,4,91,5],[92,4,92,5],[93,4,93,5],[94,4,94,5],[95,4,95,5],[96,4,96,5],[118,1,123,3],[127,1,132,3],[136,1,141,3],[127,4,127,5],[128,4,128,5],[129,4,129,5],[130,4,130,5],[131,4,131,5],[118,4,118,5],[119,4,119,5],[120,4,120,5],[121,4,121,5],[122,4,122,5],[123,4,123,5],[124,1,126,3],[133,1,135,3],[141,4,141,5],[132,4,132,5],[136,4,136,5],[137,4,137,5],[138,4,138,5],[139,4,139,5],[140,4,140,5],[124,4,125,6],[55,7,60,7],[55,8,60,8],[55,9,60,9],[55,10,60,10],[64,7,69,7],[64,8,69,8],[64,9,69,9],[64,10,69,10],[73,7,78,7],[70,7,72,7],[70,8,72,8],[70,9,72,9],[70,10,72,10],[91,7,96,7],[91,8,96,8],[91,9,96,9],[91,10,96,10],[100,7,105,7],[100,8,105,8],[100,9,105,9],[100,10,105,10],[73,8,78,8],[73,9,78,9],[73,10,78,10],[82,7,87,7],[82,8,87,8],[82,9,87,9],[82,10,87,10],[136,7,141,7],[136,8,141,8],[136,9,141,9],[136,10,141,10],[109,7,114,7],[109,8,114,8],[109,9,114,9],[109,10,114,10],[118,7,123,7],[118,8,123,8],[118,9,123,9],[118,10,123,10],[124,7,126,7],[124,8,126,8],[124,9,126,9],[124,10,126,10],[133,7,135,7],[133,8,135,8],[133,9,135,9],[133,10,135,10],[127,7,132,7],[127,8,132,8],[127,9,132,9],[127,10,132,10],[77,4,77,5],[78,4,78,5],[55,1,60,3],[64,1,69,3],[73,1,78,3],[82,1,87,3],[91,1,96,3],[100,1,105,3],[61,1,63,3],[70,1,72,3],[79,1,81,3],[88,1,90,3],[105,4,105,5],[65,4,65,5],[66,4,66,5],[67,4,67,5],[68,4,68,5],[69,4,69,5],[70,4,71,6],[72,4,72,5],[82,4,82,5],[83,4,83,5],[3,0,3,10],[48,0,48,10],[61,4,62,6],[61,7,63,7],[61,8,63,8],[61,9,63,9],[61,10,63,10],[63,4,63,5],[88,4,89,6],[88,7,90,7],[88,8,90,8],[88,9,90,9],[88,10,90,10],[90,4,90,5],[79,4,80,6],[79,7,81,7],[79,8,81,8],[79,9,81,9],[79,10,81,10],[81,4,81,5],[73,4,73,5],[74,4,74,5],[75,4,75,5],[76,4,76,5]]}
[null,null,null,null,null,null,"VRV-Q Replacement"]
[]
[]
["R22 Replacement Technology - Energy simulation and running costs evaluation"]
[{"$f":"Results!B4","v":"Project Name"}]
[]
[]
[]
[]
[]
[]
[]
[]
[]
[]
[]
[]
[]
[]
["Note: the following results are based on nominal conditions for UK climate",null,null,null,null,null,null,{"$f":"Results!E6","v":"Existing Installation"},{"$f":"Results!I6","v":"VRVQ + Old IDUs"},{"$f":"Results!M6","v":"VRVQ + New IDUs"},"Based on the latest VRV Systems"]
[]
[]
["Annual Running Costs",null,null,null,null,null,null,{"$f":"CONCATENATE(Output!A32,\" \",Results!E8)","v":"€ 638.55"},{"$f":"IF(Results!I8=0,\"N/A\",CONCATENATE(Output!A32,\" \",Results!I8))","v":"€ 370.26"},{"$f":"CONCATENATE(Output!A32,\" \",Results!M8)","v":"€ 358.82"},{"$f":"CONCATENATE(Output!A32,\" \",Results!Q8)","v":"€ 358.82"}]
["Annual Energy Savings (compared to existing installation)",null,null,null,null,null,null,null,{"$f":"IF(Results!I8=0,\"N/A\",Results!J8)","v":0.4201550387596899},{"$f":"Results!N8","v":0.43807062876830316},{"$f":"Results!R8","v":0.43807062876830316}]
["Annual CO2 Emissions (Tonnes)",null,null,null,null,null,null,{"$f":"Results!G8","v":"3 T"},{"$f":"IF(Results!I8=0,\"N/A\",Results!K8)","v":"1.7 T"},{"$f":"Results!O8","v":"1.7 T"},{"$f":"Results!S8","v":"1.7 T"}]
[]
[]
[]
[]
[]
[]
[]
[]
[]
[]
[]
[]
[]
[]
[]
[]
["Working Conditions"]
[]
[null,null,null,{"$f":"Output!B1","v":"hours/day"},null,{"$f":"Output!B3","v":7},null,{"$f":"Output!F1","v":"heating weeks"},null,{"$f":"Output!F3","v":15}]
[null,null,null,{"$f":"Output!C1","v":"days/week"},null,{"$f":"Output!C3","v":5},null,{"$f":"Output!G1","v":"intermediate weeks"},null,{"$f":"Output!G3","v":22}]
[null,null,null,{"$f":"Output!D1","v":"weeks/year"},null,{"$f":"Output!D3","v":51},null,{"$f":"CONCATENATE(Output!A32,\"/kWh\")","v":"€/kWh"},null,{"$f":"Output!H3","v":0.11}]
[null,null,null,{"$f":"Output!E1","v":"cooling weeks"},null,{"$f":"Output!E3","v":14},null,{"$f":"LOWER(Output!I1)","v":"carbon equivalent"},null,{"$f":"Output!I3","v":0.52700000000000002}]
[]
["We have included a minimal Variable Refrigerant Temperature effect in these calculations. In real running conditions the VRV IV performance could be better than shown."]
[]
[null,"Original Equipment List"]
[]
[{"$f":"IF($B$56=\"Select Outdoor Unit\",0,1)","v":1},"Outdoor Unit",null,null,"Indoor Units",null,null,{"$f":"CONCATENATE($H$20,\" (kWh)\")","v":"Existing Installation (kWh)"},{"$f":"CONCATENATE($I$20,\" (kWh)\")","v":"VRVQ + Old IDUs (kWh)"},{"$f":"CONCATENATE($J$20,\" (kWh)\")","v":"VRVQ + New IDUs (kWh)"},{"$f":"IF(LEFT(B56,3)=\"RXY\",\"VRV IV with Variable Refrigerant Temperature\",IF(LEFT(B56,3)=\"REY\",\"Heat Recovery VRV III\",IF(LEFT(B56,4)=\"RSXY\",\"VRV IV with Variable Refrigerant Temperature\",IF(LEFT(B56,4)=\"RSEY\",\"Heat Recovery VRV III\",0))))","v":"VRV IV with Variable Refrigerant Temperature"}]
[{"$f":"IF($B$56=\"Select Outdoor Unit\",0,1)","v":1}]
[1,null,null,null,"Type",null,"Qty"]
[{"$f":"IF(Output!$D$5=\"Select Outdoor Unit\",0,IF(G56>0,1,0))","v":0},{"$f":"Results!C29","v":"RSXY8K7"},null,null,{"$f":"Results!H29","v":"Wall Mounted"},null,{"$f":"Results!L29","v":0},{"$f":"Results!M29","v":5805},{"$f":"Results!P29","v":3366},{"$f":"Results!R29","v":3262},{"$f":"Results!T29","v":3262}]
[{"$f":"IF(Output!$D$5=\"Select Outdoor Unit\",0,IF(G57>0,1,0))","v":0},null,null,null,{"$f":"Results!H30","v":"Ceiling Mounted Cassette"},null,{"$f":"Results!L30","v":0}]
[{"$f":"IF(Output!$D$5=\"Select Outdoor Unit\",0,IF(G58>0,1,0))","v":1},null,null,null,{"$f":"Results!H31","v":"Horizontal Ducted"},null,{"$f":"Results!L31","v":1}]
[{"$f":"IF(Output!$D$5=\"Select Outdoor Unit\",0,IF(G59>0,1,0))","v":1},null,null,null,{"$f":"Results!H32","v":"Ceiling Suspended"},null,{"$f":"Results!L32","v":2}]
[{"$f":"IF(Output!$D$5=\"Select Outdoor Unit\",0,IF(G60>0,1,0))","v":0},null,null,null,{"$f":"Results!H33","v":"Floor Standing"},null,{"$f":"Results!L33","v":0}]
[{"$f":"IF(Output!$D$5=\"Select Outdoor Unit\",0,IF(G61>0,1,0))","v":0},null,null,null,{"$f":"Results!H34","v":"Concealed Floor"},null,{"$f":"Results!L34","v":0}]
[{"$f":"IF($B$65=\"Select Outdoor Unit\",0,1)","v":0},"Outdoor Unit",null,null,"Indoor Units",null,null,{"$f":"CONCATENATE($H$20,\" (kWh)\")","v":"Existing Installation (kWh)"},{"$f":"CONCATENATE($I$20,\" (kWh)\")","v":"VRVQ + Old IDUs (kWh)"},{"$f":"CONCATENATE($J$20,\" (kWh)\")","v":"VRVQ + New IDUs (kWh)"},{"$f":"IF(LEFT(B65,3)=\"RXY\",\"VRV IV with Variable Refrigerant Temperature\",IF(LEFT(B65,3)=\"REY\",\"Heat Recovery VRV III\",IF(LEFT(B65,4)=\"RSXY\",\"VRV IV with Variable Refrigerant Temperature\",IF(LEFT(B65,4)=\"RSEY\",\"Heat Recovery VRV III\",0))))","v":0}]
[{"$f":"IF($B$65=\"Select Outdoor Unit\",0,1)","v":0}]
[0,null,null,null,"Type",null,"Qty"]
[{"$f":"IF(Output!$F$5=\"Select Outdoor Unit\",0,IF(G65>0,1,0))","v":0},{"$f":"Results!C36","v":"Select Outdoor Unit"},null,null,{"$f":"E56","v":"Wall Mounted"},null,{"$f":"Results!L36","v":0},{"$f":"Results!M36","v":0},{"$f":"Results!P36","v":0},{"$f":"Results!R36","v":0},{"$f":"Results!T36","v":0}]
[{"$f":"IF(Output!$F$5=\"Select Outdoor Unit\",0,IF(G66>0,1,0))","v":0},null,null,null,"Ceiling Mounted Cassette",null,{"$f":"Results!L37","v":0}]
[{"$f":"IF(Output!$F$5=\"Select Outdoor Unit\",0,IF(G67>0,1,0))","v":0},null,null,null,"Horizontal Ducted",null,{"$f":"Results!L38","v":0}]
[{"$f":"IF(Output!$F$5=\"Select Outdoor Unit\",0,IF(G68>0,1,0))","v":0},null,null,null,"Ceiling Suspended",null,{"$f":"Results!L39","v":0}]
[{"$f":"IF(Output!$F$5=\"Select Outdoor Unit\",0,IF(G69>0,1,0))","v":0},null,null,null,"Floor Standing",null,{"$f":"Results!L40","v":0}]
[{"$f":"IF(Output!$F$5=\"Select Outdoor Unit\",0,IF(G70>0,1,0))","v":0},null,null,null,"Concealed Floor",null,{"$f":"Results!L41","v":0}]
[{"$f":"IF($B$74=\"Select Outdoor Unit\",0,1)","v":0},"Outdoor Unit",null,null,"Indoor Units",null,null,{"$f":"CONCATENATE($H$20,\" (kWh)\")","v":"Existing Installation (kWh)"},{"$f":"CONCATENATE($I$20,\" (kWh)\")","v":"VRVQ + Old IDUs (kWh)"},{"$f":"CONCATENATE($J$20,\" (kWh)\")","v":"VRVQ + New IDUs (kWh)"},{"$f":"IF(LEFT(B74,3)=\"RXY\",\"VRV IV with Variable Refrigerant Temperature\",IF(LEFT(B74,3)=\"REY\",\"Heat Recovery VRV III\",IF(LEFT(B74,4)=\"RSXY\",\"VRV IV with Variable Refrigerant Temperature\",IF(LEFT(B74,4)=\"RSEY\",\"Heat Recovery VRV III\",0))))","v":0}]
[{"$f":"IF($B$74=\"Select Outdoor Unit\",0,1)","v":0}]
[0,null,null,null,"Type",null,"Qty"]
[{"$f":"IF(Output!$H$5=\"Select Outdoor Unit\",0,IF(G74>0,1,0))","v":0},{"$f":"Results!C50","v":"Select Outdoor Unit"},null,null,{"$f":"E65","v":"Wall Mounted"},null,{"$f":"Results!L50","v":0},{"$f":"Results!M50","v":0},{"$f":"Results!P50","v":0},{"$f":"Results!R50","v":0},{"$f":"Results!T50","v":0}]
[{"$f":"IF(Output!$H$5=\"Select Outdoor Unit\",0,IF(G75>0,1,0))","v":0},null,null,null,"Ceiling Mounted Cassette",null,{"$f":"Results!L51","v":0}]
[{"$f":"IF(Output!$H$5=\"Select Outdoor Unit\",0,IF(G76>0,1,0))","v":0},null,null,null,"Horizontal Ducted",null,{"$f":"Results!L52","v":0}]
[{"$f":"IF(Output!$H$5=\"Select Outdoor Unit\",0,IF(G77>0,1,0))","v":0},null,null,null,"Ceiling Suspended",null,{"$f":"Results!L53","v":0}]
[{"$f":"IF(Output!$H$5=\"Select Outdoor Unit\",0,IF(G78>0,1,0))","v":0},null,null,null,"Floor Standing",null,{"$f":"Results!L54","v":0}]
[{"$f":"IF(Output!$H$5=\"Select Outdoor Unit\",0,IF(G79>0,1,0))","v":0},null,null,null,"Concealed Floor",null,{"$f":"Results!L55","v":0}]
[{"$f":"IF($B$83=\"Select Outdoor Unit\",0,1)","v":0},"Outdoor Unit",null,null,"Indoor Units",null,null,{"$f":"CONCATENATE($H$20,\" (kWh)\")","v":"Existing Installation (kWh)"},{"$f":"CONCATENATE($I$20,\" (kWh)\")","v":"VRVQ + Old IDUs (kWh)"},{"$f":"CONCATENATE($J$20,\" (kWh)\")","v":"VRVQ + New IDUs (kWh)"},{"$f":"IF(LEFT(B83,3)=\"RXY\",\"VRV IV with Variable Refrigerant Temperature\",IF(LEFT(B83,3)=\"REY\",\"Heat Recovery VRV III\",IF(LEFT(B83,4)=\"RSXY\",\"VRV IV with Variable Refrigerant Temperature\",IF(LEFT(B83,4)=\"RSEY\",\"Heat Recovery VRV III\",0))))","v":0}]
[{"$f":"IF($B$83=\"Select Outdoor Unit\",0,1)","v":0}]
[{"$f":"IF($B$83=\"Select Outdoor Unit\",0,1)","v":0},null,null,null,"Type",null,"Qty"]
[{"$f":"IF(Output!$J$5=\"Select Outdoor Unit\",0,IF(G83>0,1,0))","v":0},{"$f":"Results!C57","v":"Select Outdoor Unit"},null,null,{"$f":"E74","v":"Wall Mounted"},null,{"$f":"Results!L57","v":0},{"$f":"Results!M57","v":0},{"$f":"Results!P57","v":0},{"$f":"Results!R57","v":0},{"$f":"Results!T57","v":0}]
[{"$f":"IF(Output!$J$5=\"Select Outdoor Unit\",0,IF(G84>0,1,0))","v":0},null,null,null,"Ceiling Mounted Cassette",null,{"$f":"Results!L58","v":0}]
[{"$f":"IF(Output!$J$5=\"Select Outdoor Unit\",0,IF(G85>0,1,0))","v":0},null,null,null,"Horizontal Ducted",null,{"$f":"Results!L59","v":0}]
[{"$f":"IF(Output!$J$5=\"Select Outdoor Unit\",0,IF(G86>0,1,0))","v":0},null,null,null,"Ceiling Suspended",null,{"$f":"Results!L60","v":0}]
[{"$f":"IF(Output!$J$5=\"Select Outdoor Unit\",0,IF(G87>0,1,0))","v":0},null,null,null,"Floor Standing",null,{"$f":"Results!L61","v":0}]
[{"$f":"IF(Output!$J$5=\"Select Outdoor Unit\",0,IF(G88>0,1,0))","v":0},null,null,null,"Concealed Floor",null,{"$f":"Results!L62","v":0}]
[{"$f":"IF($B$92=\"Select Outdoor Unit\",0,1)","v":0},"Outdoor Unit",null,null,"Indoor Units",null,null,{"$f":"CONCATENATE($H$20,\" (kWh)\")","v":"Existing Installation (kWh)"},{"$f":"CONCATENATE($I$20,\" (kWh)\")","v":"VRVQ + Old IDUs (kWh)"},{"$f":"CONCATENATE($J$20,\" (kWh)\")","v":"VRVQ + New IDUs (kWh)"},{"$f":"IF(LEFT(B92,3)=\"RXY\",\"VRV IV with Variable Refrigerant Temperature\",IF(LEFT(B92,3)=\"REY\",\"Heat Recovery VRV III\",IF(LEFT(B92,4)=\"RSXY\",\"VRV IV with Variable Refrigerant Temperature\",IF(LEFT(B92,4)=\"RSEY\",\"Heat Recovery VRV III\",0))))","v":0}]
[{"$f":"IF($B$92=\"Select Outdoor Unit\",0,1)","v":0}]
[0,null,null,null,"Type",null,"Qty"]
[{"$f":"IF(Output!$L$5=\"Select Outdoor Unit\",0,IF(G92>0,1,0))","v":0},{"$f":"Results!C64","v":"Select Outdoor Unit"},null,null,{"$f":"E83","v":"Wall Mounted"},null,{"$f":"Results!L64","v":0},{"$f":"Results!M64","v":0},{"$f":"Results!P64","v":0},{"$f":"Results!R64","v":0},{"$f":"Results!T64","v":0}]
[{"$f":"IF(Output!$L$5=\"Select Outdoor Unit\",0,IF(G93>0,1,0))","v":0},null,null,null,"Ceiling Mounted Cassette",null,{"$f":"Results!L65","v":0}]
[{"$f":"IF(Output!$L$5=\"Select Outdoor Unit\",0,IF(G94>0,1,0))","v":0},null,null,null,"Horizontal Ducted",null,{"$f":"Results!L66","v":0}]
[{"$f":"IF(Output!$L$5=\"Select Outdoor Unit\",0,IF(G95>0,1,0))","v":0},null,null,null,"Ceiling Suspended",null,{"$f":"Results!L67","v":0}]
[{"$f":"IF(Output!$L$5=\"Select Outdoor Unit\",0,IF(G96>0,1,0))","v":0},null,null,null,"Floor Standing",null,{"$f":"Results!L68","v":0}]
[{"$f":"IF(Output!$L$5=\"Select Outdoor Unit\",0,IF(G97>0,1,0))","v":0},null,null,null,"Concealed Floor",null,{"$f":"Results!L69","v":0}]
[{"$f":"IF($B$101=\"Select Outdoor Unit\",0,1)","v":0},"Outdoor Unit",null,null,"Indoor Units",null,null,{"$f":"CONCATENATE($H$20,\" (kWh)\")","v":"Existing Installation (kWh)"},{"$f":"CONCATENATE($I$20,\" (kWh)\")","v":"VRVQ + Old IDUs (kWh)"},{"$f":"CONCATENATE($J$20,\" (kWh)\")","v":"VRVQ + New IDUs (kWh)"},{"$f":"IF(LEFT(B101,3)=\"RXY\",\"VRV IV with Variable Refrigerant Temperature\",IF(LEFT(B101,3)=\"REY\",\"Heat Recovery VRV III\",IF(LEFT(B101,4)=\"RSXY\",\"VRV IV with Variable Refrigerant Temperature\",IF(LEFT(B101,4)=\"RSEY\",\"Heat Recovery VRV III\",0))))","v":0}]
[{"$f":"IF($B$101=\"Select Outdoor Unit\",0,1)","v":0}]
[0,null,null,null,"Type",null,"Qty"]
[{"$f":"IF(Output!$N$5=\"Select Outdoor Unit\",0,IF(G101>0,1,0))","v":0},{"$f":"Results!C71","v":"Select Outdoor Unit"},null,null,{"$f":"E92","v":"Wall Mounted"},null,{"$f":"Results!L71","v":0},{"$f":"Results!M71","v":0},{"$f":"Results!P71","v":0},{"$f":"Results!R71","v":0},{"$f":"Results!T71","v":0}]
[{"$f":"IF(Output!$N$5=\"Select Outdoor Unit\",0,IF(G102>0,1,0))","v":0},null,null,null,"Ceiling Mounted Cassette",null,{"$f":"Results!L72","v":0}]
[{"$f":"IF(Output!$N$5=\"Select Outdoor Unit\",0,IF(G103>0,1,0))","v":0},null,null,null,"Horizontal Ducted",null,{"$f":"Results!L73","v":0}]
[{"$f":"IF(Output!$N$5=\"Select Outdoor Unit\",0,IF(G104>0,1,0))","v":0},null,null,null,"Ceiling Suspended",null,{"$f":"Results!L74","v":0}]
[{"$f":"IF(Output!$N$5=\"Select Outdoor Unit\",0,IF(G105>0,1,0))","v":0},null,null,null,"Floor Standing",null,{"$f":"Results!L75","v":0}]
[{"$f":"IF(Output!$N$5=\"Select Outdoor Unit\",0,IF(G106>0,1,0))","v":0},null,null,null,"Concealed Floor",null,{"$f":"Results!L76","v":0}]
[{"$f":"IF($B$110=\"Select Outdoor Unit\",0,1)","v":0},"Outdoor Unit",null,null,"Indoor Units",null,null,{"$f":"CONCATENATE($H$20,\" (kWh)\")","v":"Existing Installation (kWh)"},{"$f":"CONCATENATE($I$20,\" (kWh)\")","v":"VRVQ + Old IDUs (kWh)"},{"$f":"CONCATENATE($J$20,\" (kWh)\")","v":"VRVQ + New IDUs (kWh)"},{"$f":"IF(LEFT(B110,3)=\"RXY\",\"VRV IV with Variable Refrigerant Temperature\",IF(LEFT(B110,3)=\"REY\",\"Heat Recovery VRV III\",IF(LEFT(B110,4)=\"RSXY\",\"VRV IV with Variable Refrigerant Temperature\",IF(LEFT(B110,4)=\"RSEY\",\"Heat Recovery VRV III\",0))))","v":0}]
[{"$f":"IF($B$110=\"Select Outdoor Unit\",0,1)","v":0}]
[0,null,null,null,"Type",null,"Qty"]
[{"$f":"IF(Output!$P$5=\"Select Outdoor Unit\",0,IF(G110>0,1,0))","v":0},{"$f":"Results!C78","v":"Select Outdoor Unit"},null,null,{"$f":"E101","v":"Wall Mounted"},null,{"$f":"Results!L78","v":0},{"$f":"Results!M78","v":0},{"$f":"Results!P78","v":0},{"$f":"Results!R78","v":0},{"$f":"Results!T78","v":0}]
[{"$f":"IF(Output!$P$5=\"Select Outdoor Unit\",0,IF(G111>0,1,0))","v":0},null,null,null,"Ceiling Mounted Cassette",null,{"$f":"Results!L79","v":0}]
[{"$f":"IF(Output!$P$5=\"Select Outdoor Unit\",0,IF(G112>0,1,0))","v":0},null,null,null,"Horizontal Ducted",null,{"$f":"Results!L80","v":0}]
[{"$f":"IF(Output!$P$5=\"Select Outdoor Unit\",0,IF(G113>0,1,0))","v":0},null,null,null,"Ceiling Suspended",null,{"$f":"Results!L81","v":0}]
[{"$f":"IF(Output!$P$5=\"Select Outdoor Unit\",0,IF(G114>0,1,0))","v":0},null,null,null,"Floor Standing",null,{"$f":"Results!L82","v":0}]
[{"$f":"IF(Output!$P$5=\"Select Outdoor Unit\",0,IF(G115>0,1,0))","v":0},null,null,null,"Concealed Floor",null,{"$f":"Results!L83","v":0}]
[{"$f":"IF($B$119=\"Select Outdoor Unit\",0,1)","v":0},"Outdoor Unit",null,null,"Indoor Units",null,null,{"$f":"CONCATENATE($H$20,\" (kWh)\")","v":"Existing Installation (kWh)"},{"$f":"CONCATENATE($I$20,\" (kWh)\")","v":"VRVQ + Old IDUs (kWh)"},{"$f":"CONCATENATE($J$20,\" (kWh)\")","v":"VRVQ + New IDUs (kWh)"},{"$f":"IF(LEFT(B119,3)=\"RXY\",\"VRV IV with Variable Refrigerant Temperature\",IF(LEFT(B119,3)=\"REY\",\"Heat Recovery VRV III\",IF(LEFT(B119,4)=\"RSXY\",\"VRV IV with Variable Refrigerant Temperature\",IF(LEFT(B119,4)=\"RSEY\",\"Heat Recovery VRV III\",0))))","v":0}]
[{"$f":"IF($B$119=\"Select Outdoor Unit\",0,1)","v":0}]
[0,null,null,null,"Type",null,"Qty"]
[{"$f":"IF(Output!$R$5=\"Select Outdoor Unit\",0,IF(G119>0,1,0))","v":0},{"$f":"Results!C85","v":"Select Outdoor Unit"},null,null,{"$f":"E110","v":"Wall Mounted"},null,{"$f":"Results!L85","v":0},{"$f":"Results!M85","v":0},{"$f":"Results!P85","v":0},{"$f":"Results!R85","v":0},{"$f":"Results!T85","v":0}]
[{"$f":"IF(Output!$R$5=\"Select Outdoor Unit\",0,IF(G120>0,1,0))","v":0},null,null,null,"Ceiling Mounted Cassette",null,{"$f":"Results!L86","v":0}]
[{"$f":"IF(Output!$R$5=\"Select Outdoor Unit\",0,IF(G121>0,1,0))","v":0},null,null,null,"Horizontal Ducted",null,{"$f":"Results!L87","v":0}]
[{"$f":"IF(Output!$R$5=\"Select Outdoor Unit\",0,IF(G122>0,1,0))","v":0},null,null,null,"Ceiling Suspended",null,{"$f":"Results!L88","v":0}]
[{"$f":"IF(Output!$R$5=\"Select Outdoor Unit\",0,IF(G123>0,1,0))","v":0},null,null,null,"Floor Standing",null,{"$f":"Results!L89","v":0}]
[{"$f":"IF(Output!$R$5=\"Select Outdoor Unit\",0,IF(G124>0,1,0))","v":0},null,null,null,"Concealed Floor",null,{"$f":"Results!L90","v":0}]
[{"$f":"IF($B$128=\"Select Outdoor Unit\",0,1)","v":0},"Outdoor Unit",null,null,"Indoor Units",null,null,{"$f":"CONCATENATE($H$20,\" (kWh)\")","v":"Existing Installation (kWh)"},{"$f":"CONCATENATE($I$20,\" (kWh)\")","v":"VRVQ + Old IDUs (kWh)"},{"$f":"CONCATENATE($J$20,\" (kWh)\")","v":"VRVQ + New IDUs (kWh)"},{"$f":"IF(LEFT(B128,3)=\"RXY\",\"VRV IV with Variable Refrigerant Temperature\",IF(LEFT(B128,3)=\"REY\",\"Heat Recovery VRV III\",IF(LEFT(B128,4)=\"RSXY\",\"VRV IV with Variable Refrigerant Temperature\",IF(LEFT(B128,4)=\"RSEY\",\"Heat Recovery VRV III\",0))))","v":0}]
[{"$f":"IF($B$128=\"Select Outdoor Unit\",0,1)","v":0}]
[0,null,null,null,"Type",null,"Qty"]
[{"$f":"IF(Output!$T$5=\"Select Outdoor Unit\",0,IF(G128>0,1,0))","v":0},{"$f":"Results!C92","v":"Select Outdoor Unit"},null,null,{"$f":"E119","v":"Wall Mounted"},null,{"$f":"Results!L92","v":0},{"$f":"Results!M92","v":0},{"$f":"Results!P92","v":0},{"$f":"Results!R92","v":0},{"$f":"Results!T92","v":0}]
[{"$f":"IF(Output!$T$5=\"Select Outdoor Unit\",0,IF(G129>0,1,0))","v":0},null,null,null,"Ceiling Mounted Cassette",null,{"$f":"Results!L93","v":0}]
[{"$f":"IF(Output!$T$5=\"Select Outdoor Unit\",0,IF(G130>0,1,0))","v":0},null,null,null,"Horizontal Ducted",null,{"$f":"Results!L94","v":0}]
[{"$f":"IF(Output!$T$5=\"Select Outdoor Unit\",0,IF(G131>0,1,0))","v":0},null,null,null,"Ceiling Suspended",null,{"$f":"Results!L95","v":0}]
[{"$f":"IF(Output!$T$5=\"Select Outdoor Unit\",0,IF(G132>0,1,0))","v":0},null,null,null,"Floor Standing",null,{"$f":"Results!L96","v":0}]
[{"$f":"IF(Output!$T$5=\"Select Outdoor Unit\",0,IF(G133>0,1,0))","v":0},null,null,null,"Concealed Floor",null,{"$f":"Results!L97","v":0}]
[{"$f":"IF($B$137=\"Select Outdoor Unit\",0,1)","v":0},"Outdoor Unit",null,null,"Indoor Units",null,null,{"$f":"CONCATENATE($H$20,\" (kWh)\")","v":"Existing Installation (kWh)"},{"$f":"CONCATENATE($I$20,\" (kWh)\")","v":"VRVQ + Old IDUs (kWh)"},{"$f":"CONCATENATE($J$20,\" (kWh)\")","v":"VRVQ + New IDUs (kWh)"},{"$f":"IF(LEFT(B137,3)=\"RXY\",\"VRV IV with Variable Refrigerant Temperature\",IF(LEFT(B137,3)=\"REY\",\"Heat Recovery VRV III\",IF(LEFT(B137,4)=\"RSXY\",\"VRV IV with Variable Refrigerant Temperature\",IF(LEFT(B137,4)=\"RSEY\",\"Heat Recovery VRV III\",0))))","v":0}]
[{"$f":"IF($B$137=\"Select Outdoor Unit\",0,1)","v":0}]
[0,null,null,null,"Type",null,"Qty"]
[{"$f":"IF(Output!$V$5=\"Select Outdoor Unit\",0,IF(G137>0,1,0))","v":0},{"$f":"Results!C99","v":"Select Outdoor Unit"},null,null,{"$f":"E128","v":"Wall Mounted"},null,{"$f":"Results!L99","v":0},{"$f":"Results!M99","v":0},{"$f":"Results!P99","v":0},{"$f":"Results!R99","v":0},{"$f":"Results!T99","v":0}]
[{"$f":"IF(Output!$V$5=\"Select Outdoor Unit\",0,IF(G138>0,1,0))","v":0},null,null,null,"Ceiling Mounted Cassette",null,{"$f":"Results!L100","v":0}]
[{"$f":"IF(Output!$V$5=\"Select Outdoor Unit\",0,IF(G139>0,1,0))","v":0},null,null,null,"Horizontal Ducted",null,{"$f":"Results!L101","v":0}]
[{"$f":"IF(Output!$V$5=\"Select Outdoor Unit\",0,IF(G140>0,1,0))","v":0},null,null,null,"Ceiling Suspended",null,{"$f":"Results!L102","v":0}]
[{"$f":"IF(Output!$V$5=\"Select Outdoor Unit\",0,IF(G141>0,1,0))","v":0},null,null,null,"Floor Standing",null,{"$f":"Results!L103","v":0}]
[{"$f":"IF(Output!$V$5=\"Select Outdoor Unit\",0,IF(G142>0,1,0))","v":0},null,null,null,"Concealed Floor",null,{"$f":"Results!L104","v":0}]

{"sheet":"FullDetails","index":2,"n_rows":324,"n_cols":14,"rows_kept":324,"cut":false,"hidden":false,"merged":[[294,6,323,6],[294,9,323,9],[294,12,323,12],[294,2,323,2],[6,6,35,6],[6,9,35,9],[6,12,35,12],[38,6,67,6],[38,9,67,9],[38,12,67,12],[70,6,99,6],[70,9,99,9],[70,12,99,12],[262,2,291,2],[292,2,293,2],[292,3,292,4],[292,6,292,7],[292,9,292,10],[292,12,292,13],[262,6,291,6],[262,9,291,9],[262,12,291,12],[230,2,259,2],[260,2,261,2],[260,3,260,4],[260,6,260,7],[260,9,260,10],[198,12,227,12],[196,12,196,13],[198,2,227,2],[228,2,229,2],[228,3,228,4],[228,6,228,7],[228,9,228,10],[198,6,227,6],[198,9,227,9],[260,12,260,13],[230,6,259,6],[230,9,259,9],[230,12,259,12],[228,12,228,13],[134,6,163,6],[134,9,163,9],[134,12,163,12],[166,2,195,2],[196,6,196,7],[196,9,196,10],[196,2,197,2],[196,3,196,4],[134,2,163,2],[164,2,165,2],[164,3,164,4],[166,6,195,6],[166,9,195,9],[166,12,195,12],[164,6,164,7],[164,9,164,10],[164,12,164,13],[70,2,99,2],[100,2,101,2],[100,3,100,4],[100,6,100,7],[100,9,100,10],[100,12,100,13],[102,2,131,2],[132,2,133,2],[132,3,132,4],[132,6,132,7],[132,9,132,10],[132,12,132,13],[102,6,131,6],[102,9,131,9],[102,12,131,12],[68,12,68,13],[6,2,35,2],[36,2,37,2],[36,3,36,4],[36,6,36,7],[36,9,36,10],[36,12,36,13],[38,2,67,2],[68,2,69,2],[68,3,68,4],[68,6,68,7],[68,9,68,10],[1,2,2,13],[4,6,4,7],[4,9,4,10],[4,12,4,13],[4,2,5,2],[4,3,4,4]]}
[]
[null,null,"Full equipment list"]
[]
[]
[null,{"$f":"IF($C$7=\"Select Outdoor Unit\",0,1)","v":1},"R22 Outdoor Unit","R22 Indoor Units",null,null,"VRVQ + Old IDUs",null,null,"VRVQ + New IDUs",null,null,{"$f":"'Print Results'!K53","v":"VRV IV with Variable Refrigerant Temperature"}]
[null,{"$f":"IF($C$7=\"Select Outdoor Unit\",0,1)","v":1},null,"Type","Qty",null,"Outdoor","Indoor",null,"Outdoor","Indoor",null,"Outdoor","Indoor"]
[null,{"$f":"IF(Output!$D$5=\"Select Outdoor Unit\",0,IF(E7>0,1,0))","v":0},{"$f":"'Print Results'!B56","v":"RSXY8K7"},"Wall Mounted (25)",{"$f":"COUNTIFS(Output!$D$6:$D$37,25,Output!$E$5:$E$36,\"Wall Mounted\")","v":0},null,{"$f":"VLOOKUP(C7,Database!$A$8:$J$53,7,FALSE)","v":"RXYQQ8T"},{"$f":"D7","v":"Wall Mounted (25)"},null,{"$f":"VLOOKUP(C7,Database!$A$8:$J$53,4,FALSE)","v":"RXYQQ8T"},"FXAQ (25)",null,{"$f":"VLOOKUP(C7,Database!$A$8:$J$53,10,FALSE)","v":"RYYQ8T"},{"$f":"K7","v":"FXAQ (25)"}]
[null,{"$f":"IF(Output!$D$5=\"Select Outdoor Unit\",0,IF(E8>0,1,0))","v":0},null,"Wall Mounted (31.25)",{"$f":"COUNTIFS(Output!$D$6:$D$37,31.25,Output!$E$5:$E$36,\"Wall Mounted\")","v":0},null,null,{"$f":"D8","v":"Wall Mounted (31.25)"},null,null,"FXAQ (31.25)",null,null,{"$f":"K8","v":"FXAQ (31.25)"}]
[null,{"$f":"IF(Output!$D$5=\"Select Outdoor Unit\",0,IF(E9>0,1,0))","v":0},null,"Wall Mounted (40)",{"$f":"COUNTIFS(Output!$D$6:$D$37,40,Output!$E$5:$E$36,\"Wall Mounted\")","v":0},null,null,"Wall Mounted (40)",null,null,"FXAQ (40)",null,null,"FXAQ (40)"]
[null,{"$f":"IF(Output!$D$5=\"Select Outdoor Unit\",0,IF(E10>0,1,0))","v":0},null,"Wall Mounted (50)",{"$f":"COUNTIFS(Output!$D$6:$D$37,50,Output!$E$5:$E$36,\"Wall Mounted\")","v":0},null,null,"Wall Mounted (50)",null,null,"FXAQ (50)",null,null,"FXAQ (50)"]
[null,{"$f":"IF(Output!$D$5=\"Select Outdoor Unit\",0,IF(E11>0,1,0))","v":0},null,"Wall Mounted (63)",{"$f":"COUNTIFS(Output!$D$6:$D$37,63,Output!$E$5:$E$36,\"Wall Mounted\")","v":0},null,null,"Wall Mounted (63)",null,null,"FXAQ (63)",null,null,"FXAQ (63)"]
[null,{"$f":"IF(Output!$D$5=\"Select Outdoor Unit\",0,IF(E12>0,1,0))","v":0},null,"Ceiling Mounted Cassette (31.25)",{"$f":"COUNTIFS(Output!$D$6:$D$37,31.25,Output!$E$5:$E$36,\"Ceiling Mounted Cassette\")","v":0},null,null,{"$f":"D12","v":"Ceiling Mounted Cassette (31.25)"},null,null,"FXFQ (31.25)",null,null,"FXFQ (31.25)"]
[null,{"$f":"IF(Output!$D$5=\"Select Outdoor Unit\",0,IF(E13>0,1,0))","v":0},null,"Ceiling Mounted Cassette (40)",{"$f":"COUNTIFS(Output!$D$6:$D$37,40,Output!$E$5:$E$36,\"Ceiling Mounted Cassette\")","v":0},null,null,"Ceiling Mounted Cassette (40)",null,null,"FXFQ (40)",null,null,"FXFQ (40)"]
[null,{"$f":"IF(Output!$D$5=\"Select Outdoor Unit\",0,IF(E14>0,1,0))","v":0},null,"Ceiling Mounted Cassette (50)",{"$f":"COUNTIFS(Output!$D$6:$D$37,50,Output!$E$5:$E$36,\"Ceiling Mounted Cassette\")","v":0},null,null,"Ceiling Mounted Cassette (50)",null,null,"FXFQ (50)",null,null,"FXFQ (50)"]
[null,{"$f":"IF(Output!$D$5=\"Select Outdoor Unit\",0,IF(E15>0,1,0))","v":0},null,"Ceiling Mounted Cassette (63)",{"$f":"COUNTIFS(Output!$D$6:$D$37,63,Output!$E$5:$E$36,\"Ceiling Mounted Cassette\")","v":0},null,null,"Ceiling Mounted Cassette (63)",null,null,"FXFQ (63)",null,null,"FXFQ (63)"]
[null,{"$f":"IF(Output!$D$5=\"Select Outdoor Unit\",0,IF(E16>0,1,0))","v":0},null,"Ceiling Mounted Cassette (80)",{"$f":"COUNTIFS(Output!$D$6:$D$37,80,Output!$E$5:$E$36,\"Ceiling Mounted Cassette\")","v":0},null,null,"Ceiling Mounted Cassette (80)",null,null,"FXFQ (80)",null,null,"FXFQ (80)"]
[null,{"$f":"IF(Output!$D$5=\"Select Outdoor Unit\",0,IF(E17>0,1,0))","v":0},null,"Ceiling Mounted Cassette (100)",{"$f":"COUNTIFS(Output!$D$6:$D$37,100,Output!$E$5:$E$36,\"Ceiling Mounted Cassette\")","v":0},null,null,"Ceiling Mounted Cassette (100)",null,null,"FXFQ (100)",null,null,"FXFQ (100)"]
[null,{"$f":"IF(Output!$D$5=\"Select Outdoor Unit\",0,IF(E18>0,1,0))","v":0},null,"Ceiling Mounted Cassette (125)",{"$f":"COUNTIFS(Output!$D$6:$D$37,125,Output!$E$5:$E$36,\"Ceiling Mounted Cassette\")","v":0},null,null,"Ceiling Mounted Cassette (125)",null,null,"FXFQ (125)",null,null,"FXFQ (125)"]
[null,{"$f":"IF(Output!$D$5=\"Select Outdoor Unit\",0,IF(E19>0,1,0))","v":0},null,"Horizontal Ducted (20)",{"$f":"COUNTIFS(Output!$D$6:$D$37,20,Output!$E$5:$E$36,\"Horizontal Ducted\")","v":0},null,null,"Horizontal Ducted (20)",null,null,"FXSQ (20)",null,null,"FXSQ (20)"]
[null,{"$f":"IF(Output!$D$5=\"Select Outdoor Unit\",0,IF(E20>0,1,0))","v":0},null,"Horizontal Ducted (25)",{"$f":"COUNTIFS(Output!$D$6:$D$37,25,Output!$E$5:$E$36,\"Horizontal Ducted\")","v":0},null,null,"Horizontal Ducted (25)",null,null,"FXSQ (25)",null,null,"FXSQ (25)"]
[null,{"$f":"IF(Output!$D$5=\"Select Outdoor Unit\",0,IF(E21>0,1,0))","v":1},null,"Horizontal Ducted (31.25)",{"$f":"COUNTIFS(Output!$D$6:$D$37,31.25,Output!$E$5:$E$36,\"Horizontal Ducted\")","v":1},null,null,"Horizontal Ducted (31.25)",null,null,"FXSQ (31.25)",null,null,"FXSQ (31.25)"]
[null,{"$f":"IF(Output!$D$5=\"Select Outdoor Unit\",0,IF(E22>0,1,0))","v":0},null,"Horizontal Ducted (40)",{"$f":"COUNTIFS(Output!$D$6:$D$37,40,Output!$E$5:$E$36,\"Horizontal Ducted\")","v":0},null,null,"Horizontal Ducted (40)",null,null,"FXSQ (40)",null,null,"FXSQ (40)"]
[null,{"$f":"IF(Output!$D$5=\"Select Outdoor Unit\",0,IF(E23>0,1,0))","v":0},null,"Horizontal Ducted (50)",{"$f":"COUNTIFS(Output!$D$6:$D$37,50,Output!$E$5:$E$36,\"Horizontal Ducted\")","v":0},null,null,"Horizontal Ducted (50)",null,null,"FXSQ (50)",null,null,"FXSQ (50)"]
[null,{"$f":"IF(Output!$D$5=\"Select Outdoor Unit\",0,IF(E24>0,1,0))","v":0},null,"Horizontal Ducted (63)",{"$f":"COUNTIFS(Output!$D$6:$D$37,63,Output!$E$5:$E$36,\"Horizontal Ducted\")","v":0},null,null,"Horizontal Ducted (63)",null,null,"FXSQ (63)",null,null,"FXSQ (63)"]
[null,{"$f":"IF(Output!$D$5=\"Select Outdoor Unit\",0,IF(E25>0,1,0))","v":0},null,"Horizontal Ducted (80)",{"$f":"COUNTIFS(Output!$D$6:$D$37,80,Output!$E$5:$E$36,\"Horizontal Ducted\")","v":0},null,null,"Horizontal Ducted (80)",null,null,"FXSQ (80)",null,null,"FXSQ (80)"]
[null,{"$f":"IF(Output!$D$5=\"Select Outdoor Unit\",0,IF(E26>0,1,0))","v":0},null,"Horizontal Ducted (100)",{"$f":"COUNTIFS(Output!$D$6:$D$37,100,Output!$E$5:$E$36,\"Horizontal Ducted\")","v":0},null,null,"Horizontal Ducted (100)",null,null,"FXSQ (100)",null,null,"FXSQ (100)"]
[null,{"$f":"IF(Output!$D$5=\"Select Outdoor Unit\",0,IF(E27>0,1,0))","v":0},null,"Horizontal Ducted (125)",{"$f":"COUNTIFS(Output!$D$6:$D$37,125,Output!$E$5:$E$36,\"Horizontal Ducted\")","v":0},null,null,"Horizontal Ducted (125)",null,null,"FXSQ (125)",null,null,"FXSQ (125)"]
[null,{"$f":"IF(Output!$D$5=\"Select Outdoor Unit\",0,IF(E28>0,1,0))","v":0},null,"Ceiling Suspended (31.25)",{"$f":"COUNTIFS(Output!$D$6:$D$37,31.25,Output!$E$5:$E$36,\"Ceiling Suspended\")","v":0},null,null,"Ceiling Suspended (31.25)",null,null,"FXHQ (31.25)",null,null,"FXHQ (31.25)"]
[null,{"$f":"IF(Output!$D$5=\"Select Outdoor Unit\",0,IF(E29>0,1,0))","v":1},null,"Ceiling Suspended (63)",{"$f":"COUNTIFS(Output!$D$6:$D$37,63,Output!$E$5:$E$36,\"Ceiling Suspended\")","v":1},null,null,"Ceiling Suspended (63)",null,null,"FXHQ (63)",null,null,"FXHQ (63)"]
[null,{"$f":"IF(Output!$D$5=\"Select Outdoor Unit\",0,IF(E30>0,1,0))","v":1},null,"Ceiling Suspended (100)",{"$f":"COUNTIFS(Output!$D$6:$D$37,100,Output!$E$5:$E$36,\"Ceiling Suspended\")","v":1},null,null,"Ceiling Suspended (100)",null,null,"FXHQ (100)",null,null,"FXHQ (100)"]
[null,{"$f":"IF(Output!$D$5=\"Select Outdoor Unit\",0,IF(E31>0,1,0))","v":0},null,"Floor Standing (25)",{"$f":"COUNTIFS(Output!$D$6:$D$37,25,Output!$E$5:$E$36,\"Floor Standing\")","v":0},null,null,"Floor Standing (25)",null,null,"FXLQ (25)",null,null,"FXLQ (25)"]
[null,{"$f":"IF(Output!$D$5=\"Select Outdoor Unit\",0,IF(E32>0,1,0))","v":0},null,"Floor Standing (40)",{"$f":"COUNTIFS(Output!$D$6:$D$37,40,Output!$E$5:$E$36,\"Floor Standing\")","v":0},null,null,"Floor Standing (40)",null,null,"FXLQ (40)",null,null,"FXLQ (40)"]
[null,{"$f":"IF(Output!$D$5=\"Select Outdoor Unit\",0,IF(E33>0,1,0))","v":0},null,"Floor Standing (63)",{"$f":"COUNTIFS(Output!$D$6:$D$37,63,Output!$E$5:$E$36,\"Floor Standing\")","v":0},null,null,"Floor Standing (63)",null,null,"FXLQ (63)",null,null,"FXLQ (63)"]
[null,{"$f":"IF(Output!$D$5=\"Select Outdoor Unit\",0,IF(E34>0,1,0))","v":0},null,"Concealed Floor (25)",{"$f":"COUNTIFS(Output!$D$6:$D$37,25,Output!$E$5:$E$36,\"Concealed Floor\")","v":0},null,null,"Concealed Floor (25)",null,null,"FXNQ (25)",null,null,"FXNQ (25)"]
[null,{"$f":"IF(Output!$D$5=\"Select Outdoor Unit\",0,IF(E35>0,1,0))","v":0},null,"Concealed Floor (40)",{"$f":"COUNTIFS(Output!$D$6:$D$37,40,Output!$E$5:$E$36,\"Concealed Floor\")","v":0},null,null,"Concealed Floor (40)",null,null,"FXNQ (40)",null,null,"FXNQ (40)"]
[null,{"$f":"IF(Output!$D$5=\"Select Outdoor Unit\",0,IF(E36>0,1,0))","v":0},null,"Concealed Floor (63)",{"$f":"COUNTIFS(Output!$D$6:$D$37,63,Output!$E$5:$E$36,\"Concealed Floor\")","v":0},null,null,"Concealed Floor (63)",null,null,"FXNQ (63)",null,null,"FXNQ (63)"]
[null,{"$f":"IF($C$39=\"Select Outdoor Unit\",0,1)","v":0},"R22 Outdoor Unit","R22 Indoor Units",null,null,"VRVQ + Old IDUs",null,null,"VRVQ + New IDUs",null,null,{"$f":"'Print Results'!K62","v":0}]
[null,{"$f":"IF($C$39=\"Select Outdoor Unit\",0,1)","v":0},null,"Type","Qty",null,"Outdoor","Indoor",null,"Outdoor","Indoor",null,"Outdoor","Indoor"]
[null,{"$f":"IF(Output!$D$5=\"Select Outdoor Unit\",0,IF(E39>0,1,0))","v":0},{"$f":"'Print Results'!B65","v":"Select Outdoor Unit"},"Wall Mounted (25)",{"$f":"COUNTIFS(Output!$F$6:$F$37,25,Output!$G$5:$G$36,\"Wall Mounted\")","v":0},null,{"$f":"VLOOKUP(C39,Database!$A$8:$J$53,7,FALSE)","v":{"$error":"#N/A"}},{"$f":"D39","v":"Wall Mounted (25)"},null,{"$f":"VLOOKUP(C39,Database!$A$8:$J$53,4,FALSE)","v":{"$error":"#N/A"}},"FXAQ (25)",null,{"$f":"VLOOKUP(C39,Database!$A$8:$J$53,10,FALSE)","v":{"$error":"#N/A"}},{"$f":"K39","v":"FXAQ (25)"}]
[null,{"$f":"IF(Output!$D$5=\"Select Outdoor Unit\",0,IF(E40>0,1,0))","v":0},null,"Wall Mounted (31.25)",{"$f":"COUNTIFS(Output!$F$6:$F$37,31.25,Output!$G$5:$G$36,\"Wall Mounted\")","v":0},null,null,{"$f":"D40","v":"Wall Mounted (31.25)"},null,null,"FXAQ (31.25)",null,null,{"$f":"K40","v":"FXAQ (31.25)"}]
[null,{"$f":"IF(Output!$D$5=\"Select Outdoor Unit\",0,IF(E41>0,1,0))","v":0},null,"Wall Mounted (40)",{"$f":"COUNTIFS(Output!$F$6:$F$37,40,Output!$G$5:$G$36,\"Wall Mounted\")","v":0},null,null,"Wall Mounted (40)",null,null,"FXAQ (40)",null,null,"FXAQ (40)"]
[null,{"$f":"IF(Output!$D$5=\"Select Outdoor Unit\",0,IF(E42>0,1,0))","v":0},null,"Wall Mounted (50)",{"$f":"COUNTIFS(Output!$F$6:$F$37,50,Output!$G$5:$G$36,\"Wall Mounted\")","v":0},null,null,"Wall Mounted (50)",null,null,"FXAQ (50)",null,null,"FXAQ (50)"]
[null,{"$f":"IF(Output!$D$5=\"Select Outdoor Unit\",0,IF(E43>0,1,0))","v":0},null,"Wall Mounted (63)",{"$f":"COUNTIFS(Output!$F$6:$F$37,63,Output!$G$5:$G$36,\"Wall Mounted\")","v":0},null,null,"Wall Mounted (63)",null,null,"FXAQ (63)",null,null,"FXAQ (63)"]
[null,{"$f":"IF(Output!$D$5=\"Select Outdoor Unit\",0,IF(E44>0,1,0))","v":0},null,"Ceiling Mounted Cassette (31.25)",{"$f":"COUNTIFS(Output!$F$6:$F$37,31.25,Output!$G$5:$G$36,\"Ceiling Mounted Cassette\")","v":0},null,null,"Ceiling Mounted Cassette (31.25)",null,null,"FXFQ (31.25)",null,null,"FXFQ (31.25)"]
[null,{"$f":"IF(Output!$D$5=\"Select Outdoor Unit\",0,IF(E45>0,1,0))","v":0},null,"Ceiling Mounted Cassette (40)",{"$f":"COUNTIFS(Output!$F$6:$F$37,40,Output!$G$5:$G$36,\"Ceiling Mounted Cassette\")","v":0},null,null,"Ceiling Mounted Cassette (40)",null,null,"FXFQ (40)",null,null,"FXFQ (40)"]
[null,{"$f":"IF(Output!$D$5=\"Select Outdoor Unit\",0,IF(E46>0,1,0))","v":0},null,"Ceiling Mounted Cassette (50)",{"$f":"COUNTIFS(Output!$F$6:$F$37,50,Output!$G$5:$G$36,\"Ceiling Mounted Cassette\")","v":0},null,null,"Ceiling Mounted Cassette (50)",null,null,"FXFQ (50)",null,null,"FXFQ (50)"]
[null,{"$f":"IF(Output!$D$5=\"Select Outdoor Unit\",0,IF(E47>0,1,0))","v":0},null,"Ceiling Mounted Cassette (63)",{"$f":"COUNTIFS(Output!$F$6:$F$37,63,Output!$G$5:$G$36,\"Ceiling Mounted Cassette\")","v":0},null,null,"Ceiling Mounted Cassette (63)",null,null,"FXFQ (63)",null,null,"FXFQ (63)"]
[null,{"$f":"IF(Output!$D$5=\"Select Outdoor Unit\",0,IF(E48>0,1,0))","v":0},null,"Ceiling Mounted Cassette (80)",{"$f":"COUNTIFS(Output!$F$6:$F$37,80,Output!$G$5:$G$36,\"Ceiling Mounted Cassette\")","v":0},null,null,"Ceiling Mounted Cassette (80)",null,null,"FXFQ (80)",null,null,"FXFQ (80)"]
[null,{"$f":"IF(Output!$D$5=\"Select Outdoor Unit\",0,IF(E49>0,1,0))","v":0},null,"Ceiling Mounted Cassette (100)",{"$f":"COUNTIFS(Output!$F$6:$F$37,100,Output!$G$5:$G$36,\"Ceiling Mounted Cassette\")","v":0},null,null,"Ceiling Mounted Cassette (100)",null,null,"FXFQ (100)",null,null,"FXFQ (100)"]
[null,{"$f":"IF(Output!$D$5=\"Select Outdoor Unit\",0,IF(E50>0,1,0))","v":0},null,"Ceiling Mounted Cassette (125)",{"$f":"COUNTIFS(Output!$F$6:$F$37,125,Output!$G$5:$G$36,\"Ceiling Mounted Cassette\")","v":0},null,null,"Ceiling Mounted Cassette (125)",null,null,"FXFQ (125)",null,null,"FXFQ (125)"]
[null,{"$f":"IF(Output!$D$5=\"Select Outdoor Unit\",0,IF(E51>0,1,0))","v":0},null,"Horizontal Ducted (20)",{"$f":"COUNTIFS(Output!$F$6:$F$37,20,Output!$G$5:$G$36,\"Horizontal Ducted\")","v":0},null,null,"Horizontal Ducted (20)",null,null,"FXSQ (20)",null,null,"FXSQ (20)"]
[null,{"$f":"IF(Output!$D$5=\"Select Outdoor Unit\",0,IF(E52>0,1,0))","v":0},null,"Horizontal Ducted (25)",{"$f":"COUNTIFS(Output!$F$6:$F$37,25,Output!$G$5:$G$36,\"Horizontal Ducted\")","v":0},null,null,"Horizontal Ducted (25)",null,null,"FXSQ (25)",null,null,"FXSQ (25)"]
[null,{"$f":"IF(Output!$D$5=\"Select Outdoor Unit\",0,IF(E53>0,1,0))","v":0},null,"Horizontal Ducted (31.25)",{"$f":"COUNTIFS(Output!$F$6:$F$37,31.25,Output!$G$5:$G$36,\"Horizontal Ducted\")","v":0},null,null,"Horizontal Ducted (31.25)",null,null,"FXSQ (31.25)",null,null,"FXSQ (31.25)"]
[null,{"$f":"IF(Output!$D$5=\"Select Outdoor Unit\",0,IF(E54>0,1,0))","v":0},null,"Horizontal Ducted (40)",{"$f":"COUNTIFS(Output!$F$6:$F$37,40,Output!$G$5:$G$36,\"Horizontal Ducted\")","v":0},null,null,"Horizontal Ducted (40)",null,null,"FXSQ (40)",null,null,"FXSQ (40)"]
[null,{"$f":"IF(Output!$D$5=\"Select Outdoor Unit\",0,IF(E55>0,1,0))","v":0},null,"Horizontal Ducted (50)",{"$f":"COUNTIFS(Output!$F$6:$F$37,50,Output!$G$5:$G$36,\"Horizontal Ducted\")","v":0},null,null,"Horizontal Ducted (50)",null,null,"FXSQ (50)",null,null,"FXSQ (50)"]
[null,{"$f":"IF(Output!$D$5=\"Select Outdoor Unit\",0,IF(E56>0,1,0))","v":0},null,"Horizontal Ducted (63)",{"$f":"COUNTIFS(Output!$F$6:$F$37,63,Output!$G$5:$G$36,\"Horizontal Ducted\")","v":0},null,null,"Horizontal Ducted (63)",null,null,"FXSQ (63)",null,null,"FXSQ (63)"]
[null,{"$f":"IF(Output!$D$5=\"Select Outdoor Unit\",0,IF(E57>0,1,0))","v":0},null,"Horizontal Ducted (80)",{"$f":"COUNTIFS(Output!$F$6:$F$37,80,Output!$G$5:$G$36,\"Horizontal Ducted\")","v":0},null,null,"Horizontal Ducted (80)",null,null,"FXSQ (80)",null,null,"FXSQ (80)"]
[null,{"$f":"IF(Output!$D$5=\"Select Outdoor Unit\",0,IF(E58>0,1,0))","v":0},null,"Horizontal Ducted (100)",{"$f":"COUNTIFS(Output!$F$6:$F$37,100,Output!$G$5:$G$36,\"Horizontal Ducted\")","v":0},null,null,"Horizontal Ducted (100)",null,null,"FXSQ (100)",null,null,"FXSQ (100)"]
[null,{"$f":"IF(Output!$D$5=\"Select Outdoor Unit\",0,IF(E59>0,1,0))","v":0},null,"Horizontal Ducted (125)",{"$f":"COUNTIFS(Output!$F$6:$F$37,125,Output!$G$5:$G$36,\"Horizontal Ducted\")","v":0},null,null,"Horizontal Ducted (125)",null,null,"FXSQ (125)",null,null,"FXSQ (125)"]
[null,{"$f":"IF(Output!$D$5=\"Select Outdoor Unit\",0,IF(E60>0,1,0))","v":0},null,"Ceiling Suspended (31.25)",{"$f":"COUNTIFS(Output!$F$6:$F$37,31.25,Output!$G$5:$G$36,\"Ceiling Suspended\")","v":0},null,null,"Ceiling Suspended (31.25)",null,null,"FXHQ (31.25)",null,null,"FXHQ (31.25)"]
[null,{"$f":"IF(Output!$D$5=\"Select Outdoor Unit\",0,IF(E61>0,1,0))","v":0},null,"Ceiling Suspended (63)",{"$f":"COUNTIFS(Output!$F$6:$F$37,63,Output!$G$5:$G$36,\"Ceiling Suspended\")","v":0},null,null,"Ceiling Suspended (63)",null,null,"FXHQ (63)",null,null,"FXHQ (63)"]
[null,{"$f":"IF(Output!$D$5=\"Select Outdoor Unit\",0,IF(E62>0,1,0))","v":0},null,"Ceiling Suspended (100)",{"$f":"COUNTIFS(Output!$F$6:$F$37,100,Output!$G$5:$G$36,\"Ceiling Suspended\")","v":0},null,null,"Ceiling Suspended (100)",null,null,"FXHQ (100)",null,null,"FXHQ (100)"]
[null,{"$f":"IF(Output!$D$5=\"Select Outdoor Unit\",0,IF(E63>0,1,0))","v":0},null,"Floor Standing (25)",{"$f":"COUNTIFS(Output!$F$6:$F$37,25,Output!$G$5:$G$36,\"Floor Standing\")","v":0},null,null,"Floor Standing (25)",null,null,"FXLQ (25)",null,null,"FXLQ (25)"]
[null,{"$f":"IF(Output!$D$5=\"Select Outdoor Unit\",0,IF(E64>0,1,0))","v":0},null,"Floor Standing (40)",{"$f":"COUNTIFS(Output!$F$6:$F$37,40,Output!$G$5:$G$36,\"Floor Standing\")","v":0},null,null,"Floor Standing (40)",null,null,"FXLQ (40)",null,null,"FXLQ (40)"]
[null,{"$f":"IF(Output!$D$5=\"Select Outdoor Unit\",0,IF(E65>0,1,0))","v":0},null,"Floor Standing (63)",{"$f":"COUNTIFS(Output!$F$6:$F$37,63,Output!$G$5:$G$36,\"Floor Standing\")","v":0},null,null,"Floor Standing (63)",null,null,"FXLQ (63)",null,null,"FXLQ (63)"]
[null,{"$f":"IF(Output!$D$5=\"Select Outdoor Unit\",0,IF(E66>0,1,0))","v":0},null,"Concealed Floor (25)",{"$f":"COUNTIFS(Output!$F$6:$F$37,25,Output!$G$5:$G$36,\"Concealed Floor\")","v":0},null,null,"Concealed Floor (25)",null,null,"FXNQ (25)",null,null,"FXNQ (25)"]
[null,{"$f":"IF(Output!$D$5=\"Select Outdoor Unit\",0,IF(E67>0,1,0))","v":0},null,"Concealed Floor (40)",{"$f":"COUNTIFS(Output!$F$6:$F$37,40,Output!$G$5:$G$36,\"Concealed Floor\")","v":0},null,null,"Concealed Floor (40)",null,null,"FXNQ (40)",null,null,"FXNQ (40)"]
[null,{"$f":"IF(Output!$D$5=\"Select Outdoor Unit\",0,IF(E68>0,1,0))","v":0},null,"Concealed Floor (63)",{"$f":"COUNTIFS(Output!$F$6:$F$37,63,Output!$G$5:$G$36,\"Concealed Floor\")","v":0},null,null,"Concealed Floor (63)",null,null,"FXNQ (63)",null,null,"FXNQ (63)"]
[null,{"$f":"IF($C$71=\"Select Outdoor Unit\",0,1)","v":0},"R22 Outdoor Unit","R22 Indoor Units",null,null,"VRVQ + Old IDUs",null,null,"VRVQ + New IDUs",null,null,{"$f":"'Print Results'!K71","v":0}]
[null,{"$f":"IF($C$71=\"Select Outdoor Unit\",0,1)","v":0},null,"Type","Qty",null,"Outdoor","Indoor",null,"Outdoor","Indoor",null,"Outdoor","Indoor"]
[null,{"$f":"IF(Output!$D$5=\"Select Outdoor Unit\",0,IF(E71>0,1,0))","v":0},{"$f":"'Print Results'!B74","v":"Select Outdoor Unit"},"Wall Mounted (25)",{"$f":"COUNTIFS(Output!$H$6:$H$37,25,Output!$I$5:$I$36,\"Wall Mounted\")","v":0},null,{"$f":"VLOOKUP(C71,Database!$A$8:$J$53,7,FALSE)","v":{"$error":"#N/A"}},{"$f":"D71","v":"Wall Mounted (25)"},null,{"$f":"VLOOKUP(C71,Database!$A$8:$J$53,4,FALSE)","v":{"$error":"#N/A"}},"FXAQ (25)",null,{"$f":"VLOOKUP(C71,Database!$A$8:$J$53,10,FALSE)","v":{"$error":"#N/A"}},{"$f":"K71","v":"FXAQ (25)"}]
[null,{"$f":"IF(Output!$D$5=\"Select Outdoor Unit\",0,IF(E72>0,1,0))","v":0},null,"Wall Mounted (31.25)",{"$f":"COUNTIFS(Output!$H$6:$H$37,31.25,Output!$I$5:$I$36,\"Wall Mounted\")","v":0},null,null,{"$f":"D72","v":"Wall Mounted (31.25)"},null,null,"FXAQ (31.25)",null,null,{"$f":"K72","v":"FXAQ (31.25)"}]
[null,{"$f":"IF(Output!$D$5=\"Select Outdoor Unit\",0,IF(E73>0,1,0))","v":0},null,"Wall Mounted (40)",{"$f":"COUNTIFS(Output!$H$6:$H$37,40,Output!$I$5:$I$36,\"Wall Mounted\")","v":0},null,null,"Wall Mounted (40)",null,null,"FXAQ (40)",null,null,"FXAQ (40)"]
[null,{"$f":"IF(Output!$D$5=\"Select Outdoor Unit\",0,IF(E74>0,1,0))","v":0},null,"Wall Mounted (50)",{"$f":"COUNTIFS(Output!$H$6:$H$37,50,Output!$I$5:$I$36,\"Wall Mounted\")","v":0},null,null,"Wall Mounted (50)",null,null,"FXAQ (50)",null,null,"FXAQ (50)"]
[null,{"$f":"IF(Output!$D$5=\"Select Outdoor Unit\",0,IF(E75>0,1,0))","v":0},null,"Wall Mounted (63)",{"$f":"COUNTIFS(Output!$H$6:$H$37,63,Output!$I$5:$I$36,\"Wall Mounted\")","v":0},null,null,"Wall Mounted (63)",null,null,"FXAQ (63)",null,null,"FXAQ (63)"]
[null,{"$f":"IF(Output!$D$5=\"Select Outdoor Unit\",0,IF(E76>0,1,0))","v":0},null,"Ceiling Mounted Cassette (31.25)",{"$f":"COUNTIFS(Output!$H$6:$H$37,31.25,Output!$I$5:$I$36,\"Ceiling Mounted Cassette\")","v":0},null,null,"Ceiling Mounted Cassette (31.25)",null,null,"FXFQ (31.25)",null,null,"FXFQ (31.25)"]
[null,{"$f":"IF(Output!$D$5=\"Select Outdoor Unit\",0,IF(E77>0,1,0))","v":0},null,"Ceiling Mounted Cassette (40)",{"$f":"COUNTIFS(Output!$H$6:$H$37,40,Output!$I$5:$I$36,\"Ceiling Mounted Cassette\")","v":0},null,null,"Ceiling Mounted Cassette (40)",null,null,"FXFQ (40)",null,null,"FXFQ (40)"]
[null,{"$f":"IF(Output!$D$5=\"Select Outdoor Unit\",0,IF(E78>0,1,0))","v":0},null,"Ceiling Mounted Cassette (50)",{"$f":"COUNTIFS(Output!$H$6:$H$37,50,Output!$I$5:$I$36,\"Ceiling Mounted Cassette\")","v":0},null,null,"Ceiling Mounted Cassette (50)",null,null,"FXFQ (50)",null,null,"FXFQ (50)"]
[null,{"$f":"IF(Output!$D$5=\"Select Outdoor Unit\",0,IF(E79>0,1,0))","v":0},null,"Ceiling Mounted Cassette (63)",{"$f":"COUNTIFS(Output!$H$6:$H$37,63,Output!$I$5:$I$36,\"Ceiling Mounted Cassette\")","v":0},null,null,"Ceiling Mounted Cassette (63)",null,null,"FXFQ (63)",null,null,"FXFQ (63)"]
[null,{"$f":"IF(Output!$D$5=\"Select Outdoor Unit\",0,IF(E80>0,1,0))","v":0},null,"Ceiling Mounted Cassette (80)",{"$f":"COUNTIFS(Output!$H$6:$H$37,80,Output!$I$5:$I$36,\"Ceiling Mounted Cassette\")","v":0},null,null,"Ceiling Mounted Cassette (80)",null,null,"FXFQ (80)",null,null,"FXFQ (80)"]
[null,{"$f":"IF(Output!$D$5=\"Select Outdoor Unit\",0,IF(E81>0,1,0))","v":0},null,"Ceiling Mounted Cassette (100)",{"$f":"COUNTIFS(Output!$H$6:$H$37,100,Output!$I$5:$I$36,\"Ceiling Mounted Cassette\")","v":0},null,null,"Ceiling Mounted Cassette (100)",null,null,"FXFQ (100)",null,null,"FXFQ (100)"]
[null,{"$f":"IF(Output!$D$5=\"Select Outdoor Unit\",0,IF(E82>0,1,0))","v":0},null,"Ceiling Mounted Cassette (125)",{"$f":"COUNTIFS(Output!$H$6:$H$37,125,Output!$I$5:$I$36,\"Ceiling Mounted Cassette\")","v":0},null,null,"Ceiling Mounted Cassette (125)",null,null,"FXFQ (125)",null,null,"FXFQ (125)"]
[null,{"$f":"IF(Output!$D$5=\"Select Outdoor Unit\",0,IF(E83>0,1,0))","v":0},null,"Horizontal Ducted (20)",{"$f":"COUNTIFS(Output!$H$6:$H$37,20,Output!$I$5:$I$36,\"Horizontal Ducted\")","v":0},null,null,"Horizontal Ducted (20)",null,null,"FXSQ (20)",null,null,"FXSQ (20)"]
[null,{"$f":"IF(Output!$D$5=\"Select Outdoor Unit\",0,IF(E84>0,1,0))","v":0},null,"Horizontal Ducted (25)",{"$f":"COUNTIFS(Output!$H$6:$H$37,25,Output!$I$5:$I$36,\"Horizontal Ducted\")","v":0},null,null,"Horizontal Ducted (25)",null,null,"FXSQ (25)",null,null,"FXSQ (25)"]
[null,{"$f":"IF(Output!$D$5=\"Select Outdoor Unit\",0,IF(E85>0,1,0))","v":0},null,"Horizontal Ducted (31.25)",{"$f":"COUNTIFS(Output!$H$6:$H$37,31.25,Output!$I$5:$I$36,\"Horizontal Ducted\")","v":0},null,null,"Horizontal Ducted (31.25)",null,null,"FXSQ (31.25)",null,null,"FXSQ (31.25)"]
[null,{"$f":"IF(Output!$D$5=\"Select Outdoor Unit\",0,IF(E86>0,1,0))","v":0},null,"Horizontal Ducted (40)",{"$f":"COUNTIFS(Output!$H$6:$H$37,40,Output!$I$5:$I$36,\"Horizontal Ducted\")","v":0},null,null,"Horizontal Ducted (40)",null,null,"FXSQ (40)",null,null,"FXSQ (40)"]
[null,{"$f":"IF(Output!$D$5=\"Select Outdoor Unit\",0,IF(E87>0,1,0))","v":0},null,"Horizontal Ducted (50)",{"$f":"COUNTIFS(Output!$H$6:$H$37,50,Output!$I$5:$I$36,\"Horizontal Ducted\")","v":0},null,null,"Horizontal Ducted (50)",null,null,"FXSQ (50)",null,null,"FXSQ (50)"]
[null,{"$f":"IF(Output!$D$5=\"Select Outdoor Unit\",0,IF(E88>0,1,0))","v":0},null,"Horizontal Ducted (63)",{"$f":"COUNTIFS(Output!$H$6:$H$37,63,Output!$I$5:$I$36,\"Horizontal Ducted\")","v":0},null,null,"Horizontal Ducted (63)",null,null,"FXSQ (63)",null,null,"FXSQ (63)"]
[null,{"$f":"IF(Output!$D$5=\"Select Outdoor Unit\",0,IF(E89>0,1,0))","v":0},null,"Horizontal Ducted (80)",{"$f":"COUNTIFS(Output!$H$6:$H$37,80,Output!$I$5:$I$36,\"Horizontal Ducted\")","v":0},null,null,"Horizontal Ducted (80)",null,null,"FXSQ (80)",null,null,"FXSQ (80)"]
[null,{"$f":"IF(Output!$D$5=\"Select Outdoor Unit\",0,IF(E90>0,1,0))","v":0},null,"Horizontal Ducted (100)",{"$f":"COUNTIFS(Output!$H$6:$H$37,100,Output!$I$5:$I$36,\"Horizontal Ducted\")","v":0},null,null,"Horizontal Ducted (100)",null,null,"FXSQ (100)",null,null,"FXSQ (100)"]
[null,{"$f":"IF(Output!$D$5=\"Select Outdoor Unit\",0,IF(E91>0,1,0))","v":0},null,"Horizontal Ducted (125)",{"$f":"COUNTIFS(Output!$H$6:$H$37,125,Output!$I$5:$I$36,\"Horizontal Ducted\")","v":0},null,null,"Horizontal Ducted (125)",null,null,"FXSQ (125)",null,null,"FXSQ (125)"]
[null,{"$f":"IF(Output!$D$5=\"Select Outdoor Unit\",0,IF(E92>0,1,0))","v":0},null,"Ceiling Suspended (31.25)",{"$f":"COUNTIFS(Output!$H$6:$H$37,31.25,Output!$I$5:$I$36,\"Ceiling Suspended\")","v":0},null,null,"Ceiling Suspended (31.25)",null,null,"FXHQ (31.25)",null,null,"FXHQ (31.25)"]
[null,{"$f":"IF(Output!$D$5=\"Select Outdoor Unit\",0,IF(E93>0,1,0))","v":0},null,"Ceiling Suspended (63)",{"$f":"COUNTIFS(Output!$H$6:$H$37,63,Output!$I$5:$I$36,\"Ceiling Suspended\")","v":0},null,null,"Ceiling Suspended (63)",null,null,"FXHQ (63)",null,null,"FXHQ (63)"]
[null,{"$f":"IF(Output!$D$5=\"Select Outdoor Unit\",0,IF(E94>0,1,0))","v":0},null,"Ceiling Suspended (100)",{"$f":"COUNTIFS(Output!$H$6:$H$37,100,Output!$I$5:$I$36,\"Ceiling Suspended\")","v":0},null,null,"Ceiling Suspended (100)",null,null,"FXHQ (100)",null,null,"FXHQ (100)"]
[null,{"$f":"IF(Output!$D$5=\"Select Outdoor Unit\",0,IF(E95>0,1,0))","v":0},null,"Floor Standing (25)",{"$f":"COUNTIFS(Output!$H$6:$H$37,25,Output!$I$5:$I$36,\"Floor Standing\")","v":0},null,null,"Floor Standing (25)",null,null,"FXLQ (25)",null,null,"FXLQ (25)"]
[null,{"$f":"IF(Output!$D$5=\"Select Outdoor Unit\",0,IF(E96>0,1,0))","v":0},null,"Floor Standing (40)",{"$f":"COUNTIFS(Output!$H$6:$H$37,40,Output!$I$5:$I$36,\"Floor Standing\")","v":0},null,null,"Floor Standing (40)",null,null,"FXLQ (40)",null,null,"FXLQ (40)"]
[null,{"$f":"IF(Output!$D$5=\"Select Outdoor Unit\",0,IF(E97>0,1,0))","v":0},null,"Floor Standing (63)",{"$f":"COUNTIFS(Output!$H$6:$H$37,63,Output!$I$5:$I$36,\"Floor Standing\")","v":0},null,null,"Floor Standing (63)",null,null,"FXLQ (63)",null,null,"FXLQ (63)"]
[null,{"$f":"IF(Output!$D$5=\"Select Outdoor Unit\",0,IF(E98>0,1,0))","v":0},null,"Concealed Floor (25)",{"$f":"COUNTIFS(Output!$H$6:$H$37,25,Output!$I$5:$I$36,\"Concealed Floor\")","v":0},null,null,"Concealed Floor (25)",null,null,"FXNQ (25)",null,null,"FXNQ (25)"]
[null,{"$f":"IF(Output!$D$5=\"Select Outdoor Unit\",0,IF(E99>0,1,0))","v":0},null,"Concealed Floor (40)",{"$f":"COUNTIFS(Output!$H$6:$H$37,40,Output!$I$5:$I$36,\"Concealed Floor\")","v":0},null,null,"Concealed Floor (40)",null,null,"FXNQ (40)",null,null,"FXNQ (40)"]
[null,{"$f":"IF(Output!$D$5=\"Select Outdoor Unit\",0,IF(E100>0,1,0))","v":0},null,"Concealed Floor (63)",{"$f":"COUNTIFS(Output!$H$6:$H$37,63,Output!$I$5:$I$36,\"Concealed Floor\")","v":0},null,null,"Concealed Floor (63)",null,null,"FXNQ (63)",null,null,"FXNQ (63)"]
[null,{"$f":"IF($C$103=\"Select Outdoor Unit\",0,1)","v":0},"R22 Outdoor Unit","R22 Indoor Units",null,null,"VRVQ + Old IDUs",null,null,"VRVQ + New IDUs",null,null,{"$f":"'Print Results'!K80","v":0}]
[null,{"$f":"IF($C$103=\"Select Outdoor Unit\",0,1)","v":0},null,"Type","Qty",null,"Outdoor","Indoor",null,"Outdoor","Indoor",null,"Outdoor","Indoor"]
[null,{"$f":"IF(Output!$D$5=\"Select Outdoor Unit\",0,IF(E103>0,1,0))","v":0},{"$f":"'Print Results'!B83","v":"Select Outdoor Unit"},"Wall Mounted (25)",{"$f":"COUNTIFS(Output!$J$6:$J$37,25,Output!$K$5:$K$36,\"Wall Mounted\")","v":0},null,{"$f":"VLOOKUP(C103,Database!$A$8:$J$53,7,FALSE)","v":{"$error":"#N/A"}},{"$f":"D103","v":"Wall Mounted (25)"},null,{"$f":"VLOOKUP(C103,Database!$A$8:$J$53,4,FALSE)","v":{"$error":"#N/A"}},"FXAQ (25)",null,{"$f":"VLOOKUP(C103,Database!$A$8:$J$53,10,FALSE)","v":{"$error":"#N/A"}},{"$f":"K103","v":"FXAQ (25)"}]
[null,{"$f":"IF(Output!$D$5=\"Select Outdoor Unit\",0,IF(E104>0,1,0))","v":0},null,"Wall Mounted (31.25)",{"$f":"COUNTIFS(Output!$J$6:$J$37,31.25,Output!$K$5:$K$36,\"Wall Mounted\")","v":0},null,null,{"$f":"D104","v":"Wall Mounted (31.25)"},null,null,"FXAQ (31.25)",null,null,{"$f":"K104","v":"FXAQ (31.25)"}]
[null,{"$f":"IF(Output!$D$5=\"Select Outdoor Unit\",0,IF(E105>0,1,0))","v":0},null,"Wall Mounted (40)",{"$f":"COUNTIFS(Output!$J$6:$J$37,40,Output!$K$5:$K$36,\"Wall Mounted\")","v":0},null,null,"Wall Mounted (40)",null,null,"FXAQ (40)",null,null,"FXAQ (40)"]
[null,{"$f":"IF(Output!$D$5=\"Select Outdoor Unit\",0,IF(E106>0,1,0))","v":0},null,"Wall Mounted (50)",{"$f":"COUNTIFS(Output!$J$6:$J$37,50,Output!$K$5:$K$36,\"Wall Mounted\")","v":0},null,null,"Wall Mounted (50)",null,null,"FXAQ (50)",null,null,"FXAQ (50)"]
[null,{"$f":"IF(Output!$D$5=\"Select Outdoor Unit\",0,IF(E107>0,1,0))","v":0},null,"Wall Mounted (63)",{"$f":"COUNTIFS(Output!$J$6:$J$37,63,Output!$K$5:$K$36,\"Wall Mounted\")","v":0},null,null,"Wall Mounted (63)",null,null,"FXAQ (63)",null,null,"FXAQ (63)"]
[null,{"$f":"IF(Output!$D$5=\"Select Outdoor Unit\",0,IF(E108>0,1,0))","v":0},null,"Ceiling Mounted Cassette (31.25)",{"$f":"COUNTIFS(Output!$J$6:$J$37,31.25,Output!$K$5:$K$36,\"Ceiling Mounted Cassette\")","v":0},null,null,"Ceiling Mounted Cassette (31.25)",null,null,"FXFQ (31.25)",null,null,"FXFQ (31.25)"]
[null,{"$f":"IF(Output!$D$5=\"Select Outdoor Unit\",0,IF(E109>0,1,0))","v":0},null,"Ceiling Mounted Cassette (40)",{"$f":"COUNTIFS(Output!$J$6:$J$37,40,Output!$K$5:$K$36,\"Ceiling Mounted Cassette\")","v":0},null,null,"Ceiling Mounted Cassette (40)",null,null,"FXFQ (40)",null,null,"FXFQ (40)"]
[null,{"$f":"IF(Output!$D$5=\"Select Outdoor Unit\",0,IF(E110>0,1,0))","v":0},null,"Ceiling Mounted Cassette (50)",{"$f":"COUNTIFS(Output!$J$6:$J$37,50,Output!$K$5:$K$36,\"Ceiling Mounted Cassette\")","v":0},null,null,"Ceiling Mounted Cassette (50)",null,null,"FXFQ (50)",null,null,"FXFQ (50)"]
[null,{"$f":"IF(Output!$D$5=\"Select Outdoor Unit\",0,IF(E111>0,1,0))","v":0},null,"Ceiling Mounted Cassette (63)",{"$f":"COUNTIFS(Output!$J$6:$J$37,63,Output!$K$5:$K$36,\"Ceiling Mounted Cassette\")","v":0},null,null,"Ceiling Mounted Cassette (63)",null,null,"FXFQ (63)",null,null,"FXFQ (63)"]
[null,{"$f":"IF(Output!$D$5=\"Select Outdoor Unit\",0,IF(E112>0,1,0))","v":0},null,"Ceiling Mounted Cassette (80)",{"$f":"COUNTIFS(Output!$J$6:$J$37,80,Output!$K$5:$K$36,\"Ceiling Mounted Cassette\")","v":0},null,null,"Ceiling Mounted Cassette (80)",null,null,"FXFQ (80)",null,null,"FXFQ (80)"]
[null,{"$f":"IF(Output!$D$5=\"Select Outdoor Unit\",0,IF(E113>0,1,0))","v":0},null,"Ceiling Mounted Cassette (100)",{"$f":"COUNTIFS(Output!$J$6:$J$37,100,Output!$K$5:$K$36,\"Ceiling Mounted Cassette\")","v":0},null,null,"Ceiling Mounted Cassette (100)",null,null,"FXFQ (100)",null,null,"FXFQ (100)"]
[null,{"$f":"IF(Output!$D$5=\"Select Outdoor Unit\",0,IF(E114>0,1,0))","v":0},null,"Ceiling Mounted Cassette (125)",{"$f":"COUNTIFS(Output!$J$6:$J$37,125,Output!$K$5:$K$36,\"Ceiling Mounted Cassette\")","v":0},null,null,"Ceiling Mounted Cassette (125)",null,null,"FXFQ (125)",null,null,"FXFQ (125)"]
[null,{"$f":"IF(Output!$D$5=\"Select Outdoor Unit\",0,IF(E115>0,1,0))","v":0},null,"Horizontal Ducted (20)",{"$f":"COUNTIFS(Output!$J$6:$J$37,20,Output!$K$5:$K$36,\"Horizontal Ducted\")","v":0},null,null,"Horizontal Ducted (20)",null,null,"FXSQ (20)",null,null,"FXSQ (20)"]
[null,{"$f":"IF(Output!$D$5=\"Select Outdoor Unit\",0,IF(E116>0,1,0))","v":0},null,"Horizontal Ducted (25)",{"$f":"COUNTIFS(Output!$J$6:$J$37,25,Output!$K$5:$K$36,\"Horizontal Ducted\")","v":0},null,null,"Horizontal Ducted (25)",null,null,"FXSQ (25)",null,null,"FXSQ (25)"]
[null,{"$f":"IF(Output!$D$5=\"Select Outdoor Unit\",0,IF(E117>0,1,0))","v":0},null,"Horizontal Ducted (31.25)",{"$f":"COUNTIFS(Output!$J$6:$J$37,31.25,Output!$K$5:$K$36,\"Horizontal Ducted\")","v":0},null,null,"Horizontal Ducted (31.25)",null,null,"FXSQ (31.25)",null,null,"FXSQ (31.25)"]
[null,{"$f":"IF(Output!$D$5=\"Select Outdoor Unit\",0,IF(E118>0,1,0))","v":0},null,"Horizontal Ducted (40)",{"$f":"COUNTIFS(Output!$J$6:$J$37,40,Output!$K$5:$K$36,\"Horizontal Ducted\")","v":0},null,null,"Horizontal Ducted (40)",null,null,"FXSQ (40)",null,null,"FXSQ (40)"]
[null,{"$f":"IF(Output!$D$5=\"Select Outdoor Unit\",0,IF(E119>0,1,0))","v":0},null,"Horizontal Ducted (50)",{"$f":"COUNTIFS(Output!$J$6:$J$37,50,Output!$K$5:$K$36,\"Horizontal Ducted\")","v":0},null,null,"Horizontal Ducted (50)",null,null,"FXSQ (50)",null,null,"FXSQ (50)"]
[null,{"$f":"IF(Output!$D$5=\"Select Outdoor Unit\",0,IF(E120>0,1,0))","v":0},null,"Horizontal Ducted (63)",{"$f":"COUNTIFS(Output!$J$6:$J$37,63,Output!$K$5:$K$36,\"Horizontal Ducted\")","v":0},null,null,"Horizontal Ducted (63)",null,null,"FXSQ (63)",null,null,"FXSQ (63)"]
[null,{"$f":"IF(Output!$D$5=\"Select Outdoor Unit\",0,IF(E121>0,1,0))","v":0},null,"Horizontal Ducted (80)",{"$f":"COUNTIFS(Output!$J$6:$J$37,80,Output!$K$5:$K$36,\"Horizontal Ducted\")","v":0},null,null,"Horizontal Ducted (80)",null,null,"FXSQ (80)",null,null,"FXSQ (80)"]
[null,{"$f":"IF(Output!$D$5=\"Select Outdoor Unit\",0,IF(E122>0,1,0))","v":0},null,"Horizontal Ducted (100)",{"$f":"COUNTIFS(Output!$J$6:$J$37,100,Output!$K$5:$K$36,\"Horizontal Ducted\")","v":0},null,null,"Horizontal Ducted (100)",null,null,"FXSQ (100)",null,null,"FXSQ (100)"]
[null,{"$f":"IF(Output!$D$5=\"Select Outdoor Unit\",0,IF(E123>0,1,0))","v":0},null,"Horizontal Ducted (125)",{"$f":"COUNTIFS(Output!$J$6:$J$37,125,Output!$K$5:$K$36,\"Horizontal Ducted\")","v":0},null,null,"Horizontal Ducted (125)",null,null,"FXSQ (125)",null,null,"FXSQ (125)"]
[null,{"$f":"IF(Output!$D$5=\"Select Outdoor Unit\",0,IF(E124>0,1,0))","v":0},null,"Ceiling Suspended (31.25)",{"$f":"COUNTIFS(Output!$J$6:$J$37,31.25,Output!$K$5:$K$36,\"Ceiling Suspended\")","v":0},null,null,"Ceiling Suspended (31.25)",null,null,"FXHQ (31.25)",null,null,"FXHQ (31.25)"]
[null,{"$f":"IF(Output!$D$5=\"Select Outdoor Unit\",0,IF(E125>0,1,0))","v":0},null,"Ceiling Suspended (63)",{"$f":"COUNTIFS(Output!$J$6:$J$37,63,Output!$K$5:$K$36,\"Ceiling Suspended\")","v":0},null,null,"Ceiling Suspended (63)",null,null,"FXHQ (63)",null,null,"FXHQ (63)"]
[null,{"$f":"IF(Output!$D$5=\"Select Outdoor Unit\",0,IF(E126>0,1,0))","v":0},null,"Ceiling Suspended (100)",{"$f":"COUNTIFS(Output!$J$6:$J$37,100,Output!$K$5:$K$36,\"Ceiling Suspended\")","v":0},null,null,"Ceiling Suspended (100)",null,null,"FXHQ (100)",null,null,"FXHQ (100)"]
[null,{"$f":"IF(Output!$D$5=\"Select Outdoor Unit\",0,IF(E127>0,1,0))","v":0},null,"Floor Standing (25)",{"$f":"COUNTIFS(Output!$J$6:$J$37,25,Output!$K$5:$K$36,\"Floor Standing\")","v":0},null,null,"Floor Standing (25)",null,null,"FXLQ (25)",null,null,"FXLQ (25)"]
[null,{"$f":"IF(Output!$D$5=\"Select Outdoor Unit\",0,IF(E128>0,1,0))","v":0},null,"Floor Standing (40)",{"$f":"COUNTIFS(Output!$J$6:$J$37,40,Output!$K$5:$K$36,\"Floor Standing\")","v":0},null,null,"Floor Standing (40)",null,null,"FXLQ (40)",null,null,"FXLQ (40)"]
[null,{"$f":"IF(Output!$D$5=\"Select Outdoor Unit\",0,IF(E129>0,1,0))","v":0},null,"Floor Standing (63)",{"$f":"COUNTIFS(Output!$J$6:$J$37,63,Output!$K$5:$K$36,\"Floor Standing\")","v":0},null,null,"Floor Standing (63)",null,null,"FXLQ (63)",null,null,"FXLQ (63)"]
[null,{"$f":"IF(Output!$D$5=\"Select Outdoor Unit\",0,IF(E130>0,1,0))","v":0},null,"Concealed Floor (25)",{"$f":"COUNTIFS(Output!$J$6:$J$37,25,Output!$K$5:$K$36,\"Concealed Floor\")","v":0},null,null,"Concealed Floor (25)",null,null,"FXNQ (25)",null,null,"FXNQ (25)"]
[null,{"$f":"IF(Output!$D$5=\"Select Outdoor Unit\",0,IF(E131>0,1,0))","v":0},null,"Concealed Floor (40)",{"$f":"COUNTIFS(Output!$J$6:$J$37,40,Output!$K$5:$K$36,\"Concealed Floor\")","v":0},null,null,"Concealed Floor (40)",null,null,"FXNQ (40)",null,null,"FXNQ (40)"]
[null,{"$f":"IF(Output!$D$5=\"Select Outdoor Unit\",0,IF(E132>0,1,0))","v":0},null,"Concealed Floor (63)",{"$f":"COUNTIFS(Output!$J$6:$J$37,63,Output!$K$5:$K$36,\"Concealed Floor\")","v":0},null,null,"Concealed Floor (63)",null,null,"FXNQ (63)",null,null,"FXNQ (63)"]
[null,{"$f":"IF($C$135=\"Select Outdoor Unit\",0,1)","v":0},"R22 Outdoor Unit","R22 Indoor Units",null,null,"VRVQ + Old IDUs",null,null,"VRVQ + New IDUs",null,null,{"$f":"'Print Results'!K89","v":0}]
[null,{"$f":"IF($C$135=\"Select Outdoor Unit\",0,1)","v":0},null,"Type","Qty",null,"Outdoor","Indoor",null,"Outdoor","Indoor",null,"Outdoor","Indoor"]
[null,{"$f":"IF(Output!$D$5=\"Select Outdoor Unit\",0,IF(E135>0,1,0))","v":0},{"$f":"'Print Results'!B92","v":"Select Outdoor Unit"},"Wall Mounted (25)",{"$f":"COUNTIFS(Output!$L$6:$L$37,25,Output!$M$5:$M$36,\"Wall Mounted\")","v":0},null,{"$f":"VLOOKUP(C135,Database!$A$8:$J$53,7,FALSE)","v":{"$error":"#N/A"}},{"$f":"D135","v":"Wall Mounted (25)"},null,{"$f":"VLOOKUP(C135,Database!$A$8:$J$53,4,FALSE)","v":{"$error":"#N/A"}},"FXAQ (25)",null,{"$f":"VLOOKUP(C135,Database!$A$8:$J$53,10,FALSE)","v":{"$error":"#N/A"}},{"$f":"K135","v":"FXAQ (25)"}]
[null,{"$f":"IF(Output!$D$5=\"Select Outdoor Unit\",0,IF(E136>0,1,0))","v":0},null,"Wall Mounted (31.25)",{"$f":"COUNTIFS(Output!$L$6:$L$37,31.25,Output!$M$5:$M$36,\"Wall Mounted\")","v":0},null,null,{"$f":"D136","v":"Wall Mounted (31.25)"},null,null,"FXAQ (31.25)",null,null,{"$f":"K136","v":"FXAQ (31.25)"}]
[null,{"$f":"IF(Output!$D$5=\"Select Outdoor Unit\",0,IF(E137>0,1,0))","v":0},null,"Wall Mounted (40)",{"$f":"COUNTIFS(Output!$L$6:$L$37,40,Output!$M$5:$M$36,\"Wall Mounted\")","v":0},null,null,"Wall Mounted (40)",null,null,"FXAQ (40)",null,null,"FXAQ (40)"]
[null,{"$f":"IF(Output!$D$5=\"Select Outdoor Unit\",0,IF(E138>0,1,0))","v":0},null,"Wall Mounted (50)",{"$f":"COUNTIFS(Output!$L$6:$L$37,50,Output!$M$5:$M$36,\"Wall Mounted\")","v":0},null,null,"Wall Mounted (50)",null,null,"FXAQ (50)",null,null,"FXAQ (50)"]
[null,{"$f":"IF(Output!$D$5=\"Select Outdoor Unit\",0,IF(E139>0,1,0))","v":0},null,"Wall Mounted (63)",{"$f":"COUNTIFS(Output!$L$6:$L$37,63,Output!$M$5:$M$36,\"Wall Mounted\")","v":0},null,null,"Wall Mounted (63)",null,null,"FXAQ (63)",null,null,"FXAQ (63)"]
[null,{"$f":"IF(Output!$D$5=\"Select Outdoor Unit\",0,IF(E140>0,1,0))","v":0},null,"Ceiling Mounted Cassette (31.25)",{"$f":"COUNTIFS(Output!$L$6:$L$37,31.25,Output!$M$5:$M$36,\"Ceiling Mounted Cassette\")","v":0},null,null,"Ceiling Mounted Cassette (31.25)",null,null,"FXFQ (31.25)",null,null,"FXFQ (31.25)"]
[null,{"$f":"IF(Output!$D$5=\"Select Outdoor Unit\",0,IF(E141>0,1,0))","v":0},null,"Ceiling Mounted Cassette (40)",{"$f":"COUNTIFS(Output!$L$6:$L$37,40,Output!$M$5:$M$36,\"Ceiling Mounted Cassette\")","v":0},null,null,"Ceiling Mounted Cassette (40)",null,null,"FXFQ (40)",null,null,"FXFQ (40)"]
[null,{"$f":"IF(Output!$D$5=\"Select Outdoor Unit\",0,IF(E142>0,1,0))","v":0},null,"Ceiling Mounted Cassette (50)",{"$f":"COUNTIFS(Output!$L$6:$L$37,50,Output!$M$5:$M$36,\"Ceiling Mounted Cassette\")","v":0},null,null,"Ceiling Mounted Cassette (50)",null,null,"FXFQ (50)",null,null,"FXFQ (50)"]
[null,{"$f":"IF(Output!$D$5=\"Select Outdoor Unit\",0,IF(E143>0,1,0))","v":0},null,"Ceiling Mounted Cassette (63)",{"$f":"COUNTIFS(Output!$L$6:$L$37,63,Output!$M$5:$M$36,\"Ceiling Mounted Cassette\")","v":0},null,null,"Ceiling Mounted Cassette (63)",null,null,"FXFQ (63)",null,null,"FXFQ (63)"]
[null,{"$f":"IF(Output!$D$5=\"Select Outdoor Unit\",0,IF(E144>0,1,0))","v":0},null,"Ceiling Mounted Cassette (80)",{"$f":"COUNTIFS(Output!$L$6:$L$37,80,Output!$M$5:$M$36,\"Ceiling Mounted Cassette\")","v":0},null,null,"Ceiling Mounted Cassette (80)",null,null,"FXFQ (80)",null,null,"FXFQ (80)"]
[null,{"$f":"IF(Output!$D$5=\"Select Outdoor Unit\",0,IF(E145>0,1,0))","v":0},null,"Ceiling Mounted Cassette (100)",{"$f":"COUNTIFS(Output!$L$6:$L$37,100,Output!$M$5:$M$36,\"Ceiling Mounted Cassette\")","v":0},null,null,"Ceiling Mounted Cassette (100)",null,null,"FXFQ (100)",null,null,"FXFQ (100)"]
[null,{"$f":"IF(Output!$D$5=\"Select Outdoor Unit\",0,IF(E146>0,1,0))","v":0},null,"Ceiling Mounted Cassette (125)",{"$f":"COUNTIFS(Output!$L$6:$L$37,125,Output!$M$5:$M$36,\"Ceiling Mounted Cassette\")","v":0},null,null,"Ceiling Mounted Cassette (125)",null,null,"FXFQ (125)",null,null,"FXFQ (125)"]
[null,{"$f":"IF(Output!$D$5=\"Select Outdoor Unit\",0,IF(E147>0,1,0))","v":0},null,"Horizontal Ducted (20)",{"$f":"COUNTIFS(Output!$L$6:$L$37,20,Output!$M$5:$M$36,\"Horizontal Ducted\")","v":0},null,null,"Horizontal Ducted (20)",null,null,"FXSQ (20)",null,null,"FXSQ (20)"]
[null,{"$f":"IF(Output!$D$5=\"Select Outdoor Unit\",0,IF(E148>0,1,0))","v":0},null,"Horizontal Ducted (25)",{"$f":"COUNTIFS(Output!$L$6:$L$37,25,Output!$M$5:$M$36,\"Horizontal Ducted\")","v":0},null,null,"Horizontal Ducted (25)",null,null,"FXSQ (25)",null,null,"FXSQ (25)"]
[null,{"$f":"IF(Output!$D$5=\"Select Outdoor Unit\",0,IF(E149>0,1,0))","v":0},null,"Horizontal Ducted (31.25)",{"$f":"COUNTIFS(Output!$L$6:$L$37,31.25,Output!$M$5:$M$36,\"Horizontal Ducted\")","v":0},null,null,"Horizontal Ducted (31.25)",null,null,"FXSQ (31.25)",null,null,"FXSQ (31.25)"]
[null,{"$f":"IF(Output!$D$5=\"Select Outdoor Unit\",0,IF(E150>0,1,0))","v":0},null,"Horizontal Ducted (40)",{"$f":"COUNTIFS(Output!$L$6:$L$37,40,Output!$M$5:$M$36,\"Horizontal Ducted\")","v":0},null,null,"Horizontal Ducted (40)",null,null,"FXSQ (40)",null,null,"FXSQ (40)"]
[null,{"$f":"IF(Output!$D$5=\"Select Outdoor Unit\",0,IF(E151>0,1,0))","v":0},null,"Horizontal Ducted (50)",{"$f":"COUNTIFS(Output!$L$6:$L$37,50,Output!$M$5:$M$36,\"Horizontal Ducted\")","v":0},null,null,"Horizontal Ducted (50)",null,null,"FXSQ (50)",null,null,"FXSQ (50)"]
[null,{"$f":"IF(Output!$D$5=\"Select Outdoor Unit\",0,IF(E152>0,1,0))","v":0},null,"Horizontal Ducted (63)",{"$f":"COUNTIFS(Output!$L$6:$L$37,63,Output!$M$5:$M$36,\"Horizontal Ducted\")","v":0},null,null,"Horizontal Ducted (63)",null,null,"FXSQ (63)",null,null,"FXSQ (63)"]
[null,{"$f":"IF(Output!$D$5=\"Select Outdoor Unit\",0,IF(E153>0,1,0))","v":0},null,"Horizontal Ducted (80)",{"$f":"COUNTIFS(Output!$L$6:$L$37,80,Output!$M$5:$M$36,\"Horizontal Ducted\")","v":0},null,null,"Horizontal Ducted (80)",null,null,"FXSQ (80)",null,null,"FXSQ (80)"]
[null,{"$f":"IF(Output!$D$5=\"Select Outdoor Unit\",0,IF(E154>0,1,0))","v":0},null,"Horizontal Ducted (100)",{"$f":"COUNTIFS(Output!$L$6:$L$37,100,Output!$M$5:$M$36,\"Horizontal Ducted\")","v":0},null,null,"Horizontal Ducted (100)",null,null,"FXSQ (100)",null,null,"FXSQ (100)"]
[null,{"$f":"IF(Output!$D$5=\"Select Outdoor Unit\",0,IF(E155>0,1,0))","v":0},null,"Horizontal Ducted (125)",{"$f":"COUNTIFS(Output!$L$6:$L$37,125,Output!$M$5:$M$36,\"Horizontal Ducted\")","v":0},null,null,"Horizontal Ducted (125)",null,null,"FXSQ (125)",null,null,"FXSQ (125)"]
[null,{"$f":"IF(Output!$D$5=\"Select Outdoor Unit\",0,IF(E156>0,1,0))","v":0},null,"Ceiling Suspended (31.25)",{"$f":"COUNTIFS(Output!$L$6:$L$37,31.25,Output!$M$5:$M$36,\"Ceiling Suspended\")","v":0},null,null,"Ceiling Suspended (31.25)",null,null,"FXHQ (31.25)",null,null,"FXHQ (31.25)"]
[null,{"$f":"IF(Output!$D$5=\"Select Outdoor Unit\",0,IF(E157>0,1,0))","v":0},null,"Ceiling Suspended (63)",{"$f":"COUNTIFS(Output!$L$6:$L$37,63,Output!$M$5:$M$36,\"Ceiling Suspended\")","v":0},null,null,"Ceiling Suspended (63)",null,null,"FXHQ (63)",null,null,"FXHQ (63)"]
[null,{"$f":"IF(Output!$D$5=\"Select Outdoor Unit\",0,IF(E158>0,1,0))","v":0},null,"Ceiling Suspended (100)",{"$f":"COUNTIFS(Output!$L$6:$L$37,100,Output!$M$5:$M$36,\"Ceiling Suspended\")","v":0},null,null,"Ceiling Suspended (100)",null,null,"FXHQ (100)",null,null,"FXHQ (100)"]
[null,{"$f":"IF(Output!$D$5=\"Select Outdoor Unit\",0,IF(E159>0,1,0))","v":0},null,"Floor Standing (25)",{"$f":"COUNTIFS(Output!$L$6:$L$37,25,Output!$M$5:$M$36,\"Floor Standing\")","v":0},null,null,"Floor Standing (25)",null,null,"FXLQ (25)",null,null,"FXLQ (25)"]
[null,{"$f":"IF(Output!$D$5=\"Select Outdoor Unit\",0,IF(E160>0,1,0))","v":0},null,"Floor Standing (40)",{"$f":"COUNTIFS(Output!$L$6:$L$37,40,Output!$M$5:$M$36,\"Floor Standing\")","v":0},null,null,"Floor Standing (40)",null,null,"FXLQ (40)",null,null,"FXLQ (40)"]
[null,{"$f":"IF(Output!$D$5=\"Select Outdoor Unit\",0,IF(E161>0,1,0))","v":0},null,"Floor Standing (63)",{"$f":"COUNTIFS(Output!$L$6:$L$37,63,Output!$M$5:$M$36,\"Floor Standing\")","v":0},null,null,"Floor Standing (63)",null,null,"FXLQ (63)",null,null,"FXLQ (63)"]
[null,{"$f":"IF(Output!$D$5=\"Select Outdoor Unit\",0,IF(E162>0,1,0))","v":0},null,"Concealed Floor (25)",{"$f":"COUNTIFS(Output!$L$6:$L$37,25,Output!$M$5:$M$36,\"Concealed Floor\")","v":0},null,null,"Concealed Floor (25)",null,null,"FXNQ (25)",null,null,"FXNQ (25)"]
[null,{"$f":"IF(Output!$D$5=\"Select Outdoor Unit\",0,IF(E163>0,1,0))","v":0},null,"Concealed Floor (40)",{"$f":"COUNTIFS(Output!$L$6:$L$37,40,Output!$M$5:$M$36,\"Concealed Floor\")","v":0},null,null,"Concealed Floor (40)",null,null,"FXNQ (40)",null,null,"FXNQ (40)"]
[null,{"$f":"IF(Output!$D$5=\"Select Outdoor Unit\",0,IF(E164>0,1,0))","v":0},null,"Concealed Floor (63)",{"$f":"COUNTIFS(Output!$L$6:$L$37,63,Output!$M$5:$M$36,\"Concealed Floor\")","v":0},null,null,"Concealed Floor (63)",null,null,"FXNQ (63)",null,null,"FXNQ (63)"]
[null,{"$f":"IF($C$167=\"Select Outdoor Unit\",0,1)","v":0},"R22 Outdoor Unit","R22 Indoor Units",null,null,"VRVQ + Old IDUs",null,null,"VRVQ + New IDUs",null,null,{"$f":"'Print Results'!K98","v":0}]
[null,{"$f":"IF($C$167=\"Select Outdoor Unit\",0,1)","v":0},null,"Type","Qty",null,"Outdoor","Indoor",null,"Outdoor","Indoor",null,"Outdoor","Indoor"]
[null,{"$f":"IF(Output!$D$5=\"Select Outdoor Unit\",0,IF(E167>0,1,0))","v":0},{"$f":"'Print Results'!B101","v":"Select Outdoor Unit"},"Wall Mounted (25)",{"$f":"COUNTIFS(Output!$N$6:$N$37,25,Output!$O$5:$O$36,\"Wall Mounted\")","v":0},null,{"$f":"VLOOKUP(C167,Database!$A$8:$J$53,7,FALSE)","v":{"$error":"#N/A"}},{"$f":"D167","v":"Wall Mounted (25)"},null,{"$f":"VLOOKUP(C167,Database!$A$8:$J$53,4,FALSE)","v":{"$error":"#N/A"}},"FXAQ (25)",null,{"$f":"VLOOKUP(C167,Database!$A$8:$J$53,10,FALSE)","v":{"$error":"#N/A"}},{"$f":"K167","v":"FXAQ (25)"}]
[null,{"$f":"IF(Output!$D$5=\"Select Outdoor Unit\",0,IF(E168>0,1,0))","v":0},null,"Wall Mounted (31.25)",{"$f":"COUNTIFS(Output!$N$6:$N$37,31.25,Output!$O$5:$O$36,\"Wall Mounted\")","v":0},null,null,{"$f":"D168","v":"Wall Mounted (31.25)"},null,null,"FXAQ (31.25)",null,null,{"$f":"K168","v":"FXAQ (31.25)"}]
[null,{"$f":"IF(Output!$D$5=\"Select Outdoor Unit\",0,IF(E169>0,1,0))","v":0},null,"Wall Mounted (40)",{"$f":"COUNTIFS(Output!$N$6:$N$37,40,Output!$O$5:$O$36,\"Wall Mounted\")","v":0},null,null,"Wall Mounted (40)",null,null,"FXAQ (40)",null,null,"FXAQ (40)"]
[null,{"$f":"IF(Output!$D$5=\"Select Outdoor Unit\",0,IF(E170>0,1,0))","v":0},null,"Wall Mounted (50)",{"$f":"COUNTIFS(Output!$N$6:$N$37,50,Output!$O$5:$O$36,\"Wall Mounted\")","v":0},null,null,"Wall Mounted (50)",null,null,"FXAQ (50)",null,null,"FXAQ (50)"]
[null,{"$f":"IF(Output!$D$5=\"Select Outdoor Unit\",0,IF(E171>0,1,0))","v":0},null,"Wall Mounted (63)",{"$f":"COUNTIFS(Output!$N$6:$N$37,63,Output!$O$5:$O$36,\"Wall Mounted\")","v":0},null,null,"Wall Mounted (63)",null,null,"FXAQ (63)",null,null,"FXAQ (63)"]
[null,{"$f":"IF(Output!$D$5=\"Select Outdoor Unit\",0,IF(E172>0,1,0))","v":0},null,"Ceiling Mounted Cassette (31.25)",{"$f":"COUNTIFS(Output!$N$6:$N$37,31.25,Output!$O$5:$O$36,\"Ceiling Mounted Cassette\")","v":0},null,null,"Ceiling Mounted Cassette (31.25)",null,null,"FXFQ (31.25)",null,null,"FXFQ (31.25)"]
[null,{"$f":"IF(Output!$D$5=\"Select Outdoor Unit\",0,IF(E173>0,1,0))","v":0},null,"Ceiling Mounted Cassette (40)",{"$f":"COUNTIFS(Output!$N$6:$N$37,40,Output!$O$5:$O$36,\"Ceiling Mounted Cassette\")","v":0},null,null,"Ceiling Mounted Cassette (40)",null,null,"FXFQ (40)",null,null,"FXFQ (40)"]
[null,{"$f":"IF(Output!$D$5=\"Select Outdoor Unit\",0,IF(E174>0,1,0))","v":0},null,"Ceiling Mounted Cassette (50)",{"$f":"COUNTIFS(Output!$N$6:$N$37,50,Output!$O$5:$O$36,\"Ceiling Mounted Cassette\")","v":0},null,null,"Ceiling Mounted Cassette (50)",null,null,"FXFQ (50)",null,null,"FXFQ (50)"]
[null,{"$f":"IF(Output!$D$5=\"Select Outdoor Unit\",0,IF(E175>0,1,0))","v":0},null,"Ceiling Mounted Cassette (63)",{"$f":"COUNTIFS(Output!$N$6:$N$37,63,Output!$O$5:$O$36,\"Ceiling Mounted Cassette\")","v":0},null,null,"Ceiling Mounted Cassette (63)",null,null,"FXFQ (63)",null,null,"FXFQ (63)"]
[null,{"$f":"IF(Output!$D$5=\"Select Outdoor Unit\",0,IF(E176>0,1,0))","v":0},null,"Ceiling Mounted Cassette (80)",{"$f":"COUNTIFS(Output!$N$6:$N$37,80,Output!$O$5:$O$36,\"Ceiling Mounted Cassette\")","v":0},null,null,"Ceiling Mounted Cassette (80)",null,null,"FXFQ (80)",null,null,"FXFQ (80)"]
[null,{"$f":"IF(Output!$D$5=\"Select Outdoor Unit\",0,IF(E177>0,1,0))","v":0},null,"Ceiling Mounted Cassette (100)",{"$f":"COUNTIFS(Output!$N$6:$N$37,100,Output!$O$5:$O$36,\"Ceiling Mounted Cassette\")","v":0},null,null,"Ceiling Mounted Cassette (100)",null,null,"FXFQ (100)",null,null,"FXFQ (100)"]
[null,{"$f":"IF(Output!$D$5=\"Select Outdoor Unit\",0,IF(E178>0,1,0))","v":0},null,"Ceiling Mounted Cassette (125)",{"$f":"COUNTIFS(Output!$N$6:$N$37,125,Output!$O$5:$O$36,\"Ceiling Mounted Cassette\")","v":0},null,null,"Ceiling Mounted Cassette (125)",null,null,"FXFQ (125)",null,null,"FXFQ (125)"]
[null,{"$f":"IF(Output!$D$5=\"Select Outdoor Unit\",0,IF(E179>0,1,0))","v":0},null,"Horizontal Ducted (20)",{"$f":"COUNTIFS(Output!$N$6:$N$37,20,Output!$O$5:$O$36,\"Horizontal Ducted\")","v":0},null,null,"Horizontal Ducted (20)",null,null,"FXSQ (20)",null,null,"FXSQ (20)"]
[null,{"$f":"IF(Output!$D$5=\"Select Outdoor Unit\",0,IF(E180>0,1,0))","v":0},null,"Horizontal Ducted (25)",{"$f":"COUNTIFS(Output!$N$6:$N$37,25,Output!$O$5:$O$36,\"Horizontal Ducted\")","v":0},null,null,"Horizontal Ducted (25)",null,null,"FXSQ (25)",null,null,"FXSQ (25)"]
[null,{"$f":"IF(Output!$D$5=\"Select Outdoor Unit\",0,IF(E181>0,1,0))","v":0},null,"Horizontal Ducted (31.25)",{"$f":"COUNTIFS(Output!$N$6:$N$37,31.25,Output!$O$5:$O$36,\"Horizontal Ducted\")","v":0},null,null,"Horizontal Ducted (31.25)",null,null,"FXSQ (31.25)",null,null,"FXSQ (31.25)"]
[null,{"$f":"IF(Output!$D$5=\"Select Outdoor Unit\",0,IF(E182>0,1,0))","v":0},null,"Horizontal Ducted (40)",{"$f":"COUNTIFS(Output!$N$6:$N$37,40,Output!$O$5:$O$36,\"Horizontal Ducted\")","v":0},null,null,"Horizontal Ducted (40)",null,null,"FXSQ (40)",null,null,"FXSQ (40)"]
[null,{"$f":"IF(Output!$D$5=\"Select Outdoor Unit\",0,IF(E183>0,1,0))","v":0},null,"Horizontal Ducted (50)",{"$f":"COUNTIFS(Output!$N$6:$N$37,50,Output!$O$5:$O$36,\"Horizontal Ducted\")","v":0},null,null,"Horizontal Ducted (50)",null,null,"FXSQ (50)",null,null,"FXSQ (50)"]
[null,{"$f":"IF(Output!$D$5=\"Select Outdoor Unit\",0,IF(E184>0,1,0))","v":0},null,"Horizontal Ducted (63)",{"$f":"COUNTIFS(Output!$N$6:$N$37,63,Output!$O$5:$O$36,\"Horizontal Ducted\")","v":0},null,null,"Horizontal Ducted (63)",null,null,"FXSQ (63)",null,null,"FXSQ (63)"]
[null,{"$f":"IF(Output!$D$5=\"Select Outdoor Unit\",0,IF(E185>0,1,0))","v":0},null,"Horizontal Ducted (80)",{"$f":"COUNTIFS(Output!$N$6:$N$37,80,Output!$O$5:$O$36,\"Horizontal Ducted\")","v":0},null,null,"Horizontal Ducted (80)",null,null,"FXSQ (80)",null,null,"FXSQ (80)"]
[null,{"$f":"IF(Output!$D$5=\"Select Outdoor Unit\",0,IF(E186>0,1,0))","v":0},null,"Horizontal Ducted (100)",{"$f":"COUNTIFS(Output!$N$6:$N$37,1000,Output!$O$5:$O$36,\"Horizontal Ducted\")","v":0},null,null,"Horizontal Ducted (100)",null,null,"FXSQ (100)",null,null,"FXSQ (100)"]
[null,{"$f":"IF(Output!$D$5=\"Select Outdoor Unit\",0,IF(E187>0,1,0))","v":0},null,"Horizontal Ducted (125)",{"$f":"COUNTIFS(Output!$N$6:$N$37,125,Output!$O$5:$O$36,\"Horizontal Ducted\")","v":0},null,null,"Horizontal Ducted (125)",null,null,"FXSQ (125)",null,null,"FXSQ (125)"]
[null,{"$f":"IF(Output!$D$5=\"Select Outdoor Unit\",0,IF(E188>0,1,0))","v":0},null,"Ceiling Suspended (31.25)",{"$f":"COUNTIFS(Output!$N$6:$N$37,31.25,Output!$O$5:$O$36,\"Ceiling Suspended\")","v":0},null,null,"Ceiling Suspended (31.25)",null,null,"FXHQ (31.25)",null,null,"FXHQ (31.25)"]
[null,{"$f":"IF(Output!$D$5=\"Select Outdoor Unit\",0,IF(E189>0,1,0))","v":0},null,"Ceiling Suspended (63)",{"$f":"COUNTIFS(Output!$N$6:$N$37,63,Output!$O$5:$O$36,\"Ceiling Suspended\")","v":0},null,null,"Ceiling Suspended (63)",null,null,"FXHQ (63)",null,null,"FXHQ (63)"]
[null,{"$f":"IF(Output!$D$5=\"Select Outdoor Unit\",0,IF(E190>0,1,0))","v":0},null,"Ceiling Suspended (100)",{"$f":"COUNTIFS(Output!$N$6:$N$37,100,Output!$O$5:$O$36,\"Ceiling Suspended\")","v":0},null,null,"Ceiling Suspended (100)",null,null,"FXHQ (100)",null,null,"FXHQ (100)"]
[null,{"$f":"IF(Output!$D$5=\"Select Outdoor Unit\",0,IF(E191>0,1,0))","v":0},null,"Floor Standing (25)",{"$f":"COUNTIFS(Output!$N$6:$N$37,25,Output!$O$5:$O$36,\"Floor Standing\")","v":0},null,null,"Floor Standing (25)",null,null,"FXLQ (25)",null,null,"FXLQ (25)"]
[null,{"$f":"IF(Output!$D$5=\"Select Outdoor Unit\",0,IF(E192>0,1,0))","v":0},null,"Floor Standing (40)",{"$f":"COUNTIFS(Output!$N$6:$N$37,40,Output!$O$5:$O$36,\"Floor Standing\")","v":0},null,null,"Floor Standing (40)",null,null,"FXLQ (40)",null,null,"FXLQ (40)"]
[null,{"$f":"IF(Output!$D$5=\"Select Outdoor Unit\",0,IF(E193>0,1,0))","v":0},null,"Floor Standing (63)",{"$f":"COUNTIFS(Output!$N$6:$N$37,63,Output!$O$5:$O$36,\"Floor Standing\")","v":0},null,null,"Floor Standing (63)",null,null,"FXLQ (63)",null,null,"FXLQ (63)"]
[null,{"$f":"IF(Output!$D$5=\"Select Outdoor Unit\",0,IF(E194>0,1,0))","v":0},null,"Concealed Floor (25)",{"$f":"COUNTIFS(Output!$N$6:$N$37,25,Output!$O$5:$O$36,\"Concealed Floor\")","v":0},null,null,"Concealed Floor (25)",null,null,"FXNQ (25)",null,null,"FXNQ (25)"]
[null,{"$f":"IF(Output!$D$5=\"Select Outdoor Unit\",0,IF(E195>0,1,0))","v":0},null,"Concealed Floor (40)",{"$f":"COUNTIFS(Output!$N$6:$N$37,40,Output!$O$5:$O$36,\"Concealed Floor\")","v":0},null,null,"Concealed Floor (40)",null,null,"FXNQ (40)",null,null,"FXNQ (40)"]
[null,{"$f":"IF(Output!$D$5=\"Select Outdoor Unit\",0,IF(E196>0,1,0))","v":0},null,"Concealed Floor (63)",{"$f":"COUNTIFS(Output!$N$6:$N$37,63,Output!$O$5:$O$36,\"Concealed Floor\")","v":0},null,null,"Concealed Floor (63)",null,null,"FXNQ (63)",null,null,"FXNQ (63)"]
[null,{"$f":"IF($C$199=\"Select Outdoor Unit\",0,1)","v":0},"R22 Outdoor Unit","R22 Indoor Units",null,null,"VRVQ + Old IDUs",null,null,"VRVQ + New IDUs",null,null,{"$f":"'Print Results'!K107","v":0}]
[null,{"$f":"IF($C$199=\"Select Outdoor Unit\",0,1)","v":0},null,"Type","Qty",null,"Outdoor","Indoor",null,"Outdoor","Indoor",null,"Outdoor","Indoor"]
[null,{"$f":"IF(Output!$D$5=\"Select Outdoor Unit\",0,IF(E199>0,1,0))","v":0},{"$f":"'Print Results'!B110","v":"Select Outdoor Unit"},"Wall Mounted (25)",{"$f":"COUNTIFS(Output!$P$6:$P$37,25,Output!$Q$5:$Q$36,\"Wall Mounted\")","v":0},null,{"$f":"VLOOKUP(C199,Database!$A$8:$J$53,7,FALSE)","v":{"$error":"#N/A"}},{"$f":"D199","v":"Wall Mounted (25)"},null,{"$f":"VLOOKUP(C199,Database!$A$8:$J$53,4,FALSE)","v":{"$error":"#N/A"}},"FXAQ (25)",null,{"$f":"VLOOKUP(C199,Database!$A$8:$J$53,10,FALSE)","v":{"$error":"#N/A"}},{"$f":"K199","v":"FXAQ (25)"}]
[null,{"$f":"IF(Output!$D$5=\"Select Outdoor Unit\",0,IF(E200>0,1,0))","v":0},null,"Wall Mounted (31.25)",{"$f":"COUNTIFS(Output!$P$6:$P$37,31.25,Output!$Q$5:$Q$36,\"Wall Mounted\")","v":0},null,null,{"$f":"D200","v":"Wall Mounted (31.25)"},null,null,"FXAQ (31.25)",null,null,{"$f":"K200","v":"FXAQ (31.25)"}]
[null,{"$f":"IF(Output!$D$5=\"Select Outdoor Unit\",0,IF(E201>0,1,0))","v":0},null,"Wall Mounted (40)",{"$f":"COUNTIFS(Output!$P$6:$P$37,40,Output!$Q$5:$Q$36,\"Wall Mounted\")","v":0},null,null,"Wall Mounted (40)",null,null,"FXAQ (40)",null,null,"FXAQ (40)"]
[null,{"$f":"IF(Output!$D$5=\"Select Outdoor Unit\",0,IF(E202>0,1,0))","v":0},null,"Wall Mounted (50)",{"$f":"COUNTIFS(Output!$P$6:$P$37,50,Output!$Q$5:$Q$36,\"Wall Mounted\")","v":0},null,null,"Wall Mounted (50)",null,null,"FXAQ (50)",null,null,"FXAQ (50)"]
[null,{"$f":"IF(Output!$D$5=\"Select Outdoor Unit\",0,IF(E203>0,1,0))","v":0},null,"Wall Mounted (63)",{"$f":"COUNTIFS(Output!$P$6:$P$37,63,Output!$Q$5:$Q$36,\"Wall Mounted\")","v":0},null,null,"Wall Mounted (63)",null,null,"FXAQ (63)",null,null,"FXAQ (63)"]
[null,{"$f":"IF(Output!$D$5=\"Select Outdoor Unit\",0,IF(E204>0,1,0))","v":0},null,"Ceiling Mounted Cassette (31.25)",{"$f":"COUNTIFS(Output!$P$6:$P$37,31.25,Output!$Q$5:$Q$36,\"Ceiling Mounted Cassette\")","v":0},null,null,"Ceiling Mounted Cassette (31.25)",null,null,"FXFQ (31.25)",null,null,"FXFQ (31.25)"]
[null,{"$f":"IF(Output!$D$5=\"Select Outdoor Unit\",0,IF(E205>0,1,0))","v":0},null,"Ceiling Mounted Cassette (40)",{"$f":"COUNTIFS(Output!$P$6:$P$37,40,Output!$Q$5:$Q$36,\"Ceiling Mounted Cassette\")","v":0},null,null,"Ceiling Mounted Cassette (40)",null,null,"FXFQ (40)",null,null,"FXFQ (40)"]
[null,{"$f":"IF(Output!$D$5=\"Select Outdoor Unit\",0,IF(E206>0,1,0))","v":0},null,"Ceiling Mounted Cassette (50)",{"$f":"COUNTIFS(Output!$P$6:$P$37,50,Output!$Q$5:$Q$36,\"Ceiling Mounted Cassette\")","v":0},null,null,"Ceiling Mounted Cassette (50)",null,null,"FXFQ (50)",null,null,"FXFQ (50)"]
[null,{"$f":"IF(Output!$D$5=\"Select Outdoor Unit\",0,IF(E207>0,1,0))","v":0},null,"Ceiling Mounted Cassette (63)",{"$f":"COUNTIFS(Output!$P$6:$P$37,63,Output!$Q$5:$Q$36,\"Ceiling Mounted Cassette\")","v":0},null,null,"Ceiling Mounted Cassette (63)",null,null,"FXFQ (63)",null,null,"FXFQ (63)"]
[null,{"$f":"IF(Output!$D$5=\"Select Outdoor Unit\",0,IF(E208>0,1,0))","v":0},null,"Ceiling Mounted Cassette (80)",{"$f":"COUNTIFS(Output!$P$6:$P$37,80,Output!$Q$5:$Q$36,\"Ceiling Mounted Cassette\")","v":0},null,null,"Ceiling Mounted Cassette (80)",null,null,"FXFQ (80)",null,null,"FXFQ (80)"]
[null,{"$f":"IF(Output!$D$5=\"Select Outdoor Unit\",0,IF(E209>0,1,0))","v":0},null,"Ceiling Mounted Cassette (100)",{"$f":"COUNTIFS(Output!$P$6:$P$37,100,Output!$Q$5:$Q$36,\"Ceiling Mounted Cassette\")","v":0},null,null,"Ceiling Mounted Cassette (100)",null,null,"FXFQ (100)",null,null,"FXFQ (100)"]
[null,{"$f":"IF(Output!$D$5=\"Select Outdoor Unit\",0,IF(E210>0,1,0))","v":0},null,"Ceiling Mounted Cassette (125)",{"$f":"COUNTIFS(Output!$P$6:$P$37,125,Output!$Q$5:$Q$36,\"Ceiling Mounted Cassette\")","v":0},null,null,"Ceiling Mounted Cassette (125)",null,null,"FXFQ (125)",null,null,"FXFQ (125)"]
[null,{"$f":"IF(Output!$D$5=\"Select Outdoor Unit\",0,IF(E211>0,1,0))","v":0},null,"Horizontal Ducted (20)",{"$f":"COUNTIFS(Output!$P$6:$P$37,20,Output!$Q$5:$Q$36,\"Horizontal Ducted\")","v":0},null,null,"Horizontal Ducted (20)",null,null,"FXSQ (20)",null,null,"FXSQ (20)"]
[null,{"$f":"IF(Output!$D$5=\"Select Outdoor Unit\",0,IF(E212>0,1,0))","v":0},null,"Horizontal Ducted (25)",{"$f":"COUNTIFS(Output!$P$6:$P$37,25,Output!$Q$5:$Q$36,\"Horizontal Ducted\")","v":0},null,null,"Horizontal Ducted (25)",null,null,"FXSQ (25)",null,null,"FXSQ (25)"]
[null,{"$f":"IF(Output!$D$5=\"Select Outdoor Unit\",0,IF(E213>0,1,0))","v":0},null,"Horizontal Ducted (31.25)",{"$f":"COUNTIFS(Output!$P$6:$P$37,31.25,Output!$Q$5:$Q$36,\"Horizontal Ducted\")","v":0},null,null,"Horizontal Ducted (31.25)",null,null,"FXSQ (31.25)",null,null,"FXSQ (31.25)"]
[null,{"$f":"IF(Output!$D$5=\"Select Outdoor Unit\",0,IF(E214>0,1,0))","v":0},null,"Horizontal Ducted (40)",{"$f":"COUNTIFS(Output!$P$6:$P$37,40,Output!$Q$5:$Q$36,\"Horizontal Ducted\")","v":0},null,null,"Horizontal Ducted (40)",null,null,"FXSQ (40)",null,null,"FXSQ (40)"]
[null,{"$f":"IF(Output!$D$5=\"Select Outdoor Unit\",0,IF(E215>0,1,0))","v":0},null,"Horizontal Ducted (50)",{"$f":"COUNTIFS(Output!$P$6:$P$37,50,Output!$Q$5:$Q$36,\"Horizontal Ducted\")","v":0},null,null,"Horizontal Ducted (50)",null,null,"FXSQ (50)",null,null,"FXSQ (50)"]
[null,{"$f":"IF(Output!$D$5=\"Select Outdoor Unit\",0,IF(E216>0,1,0))","v":0},null,"Horizontal Ducted (63)",{"$f":"COUNTIFS(Output!$P$6:$P$37,63,Output!$Q$5:$Q$36,\"Horizontal Ducted\")","v":0},null,null,"Horizontal Ducted (63)",null,null,"FXSQ (63)",null,null,"FXSQ (63)"]
[null,{"$f":"IF(Output!$D$5=\"Select Outdoor Unit\",0,IF(E217>0,1,0))","v":0},null,"Horizontal Ducted (80)",{"$f":"COUNTIFS(Output!$P$6:$P$37,80,Output!$Q$5:$Q$36,\"Horizontal Ducted\")","v":0},null,null,"Horizontal Ducted (80)",null,null,"FXSQ (80)",null,null,"FXSQ (80)"]
[null,{"$f":"IF(Output!$D$5=\"Select Outdoor Unit\",0,IF(E218>0,1,0))","v":0},null,"Horizontal Ducted (100)",{"$f":"COUNTIFS(Output!$P$6:$P$37,100,Output!$Q$5:$Q$36,\"Horizontal Ducted\")","v":0},null,null,"Horizontal Ducted (100)",null,null,"FXSQ (100)",null,null,"FXSQ (100)"]
[null,{"$f":"IF(Output!$D$5=\"Select Outdoor Unit\",0,IF(E219>0,1,0))","v":0},null,"Horizontal Ducted (125)",{"$f":"COUNTIFS(Output!$P$6:$P$37,125,Output!$Q$5:$Q$36,\"Horizontal Ducted\")","v":0},null,null,"Horizontal Ducted (125)",null,null,"FXSQ (125)",null,null,"FXSQ (125)"]
[null,{"$f":"IF(Output!$D$5=\"Select Outdoor Unit\",0,IF(E220>0,1,0))","v":0},null,"Ceiling Suspended (31.25)",{"$f":"COUNTIFS(Output!$P$6:$P$37,31.25,Output!$Q$5:$Q$36,\"Ceiling Suspended\")","v":0},null,null,"Ceiling Suspended (31.25)",null,null,"FXHQ (31.25)",null,null,"FXHQ (31.25)"]
[null,{"$f":"IF(Output!$D$5=\"Select Outdoor Unit\",0,IF(E221>0,1,0))","v":0},null,"Ceiling Suspended (63)",{"$f":"COUNTIFS(Output!$P$6:$P$37,63,Output!$Q$5:$Q$36,\"Ceiling Suspended\")","v":0},null,null,"Ceiling Suspended (63)",null,null,"FXHQ (63)",null,null,"FXHQ (63)"]
[null,{"$f":"IF(Output!$D$5=\"Select Outdoor Unit\",0,IF(E222>0,1,0))","v":0},null,"Ceiling Suspended (100)",{"$f":"COUNTIFS(Output!$P$6:$P$37,100,Output!$Q$5:$Q$36,\"Ceiling Suspended\")","v":0},null,null,"Ceiling Suspended (100)",null,null,"FXHQ (100)",null,null,"FXHQ (100)"]
[null,{"$f":"IF(Output!$D$5=\"Select Outdoor Unit\",0,IF(E223>0,1,0))","v":0},null,"Floor Standing (25)",{"$f":"COUNTIFS(Output!$P$6:$P$37,25,Output!$Q$5:$Q$36,\"Floor Standing\")","v":0},null,null,"Floor Standing (25)",null,null,"FXLQ (25)",null,null,"FXLQ (25)"]
[null,{"$f":"IF(Output!$D$5=\"Select Outdoor Unit\",0,IF(E224>0,1,0))","v":0},null,"Floor Standing (40)",{"$f":"COUNTIFS(Output!$P$6:$P$37,40,Output!$Q$5:$Q$36,\"Floor Standing\")","v":0},null,null,"Floor Standing (40)",null,null,"FXLQ (40)",null,null,"FXLQ (40)"]
[null,{"$f":"IF(Output!$D$5=\"Select Outdoor Unit\",0,IF(E225>0,1,0))","v":0},null,"Floor Standing (63)",{"$f":"COUNTIFS(Output!$P$6:$P$37,63,Output!$Q$5:$Q$36,\"Floor Standing\")","v":0},null,null,"Floor Standing (63)",null,null,"FXLQ (63)",null,null,"FXLQ (63)"]
[null,{"$f":"IF(Output!$D$5=\"Select Outdoor Unit\",0,IF(E226>0,1,0))","v":0},null,"Concealed Floor (25)",{"$f":"COUNTIFS(Output!$P$6:$P$37,25,Output!$Q$5:$Q$36,\"Concealed Floor\")","v":0},null,null,"Concealed Floor (25)",null,null,"FXNQ (25)",null,null,"FXNQ (25)"]
[null,{"$f":"IF(Output!$D$5=\"Select Outdoor Unit\",0,IF(E227>0,1,0))","v":0},null,"Concealed Floor (40)",{"$f":"COUNTIFS(Output!$P$6:$P$37,40,Output!$Q$5:$Q$36,\"Concealed Floor\")","v":0},null,null,"Concealed Floor (40)",null,null,"FXNQ (40)",null,null,"FXNQ (40)"]
[null,{"$f":"IF(Output!$D$5=\"Select Outdoor Unit\",0,IF(E228>0,1,0))","v":0},null,"Concealed Floor (63)",{"$f":"COUNTIFS(Output!$P$6:$P$37,63,Output!$Q$5:$Q$36,\"Concealed Floor\")","v":0},null,null,"Concealed Floor (63)",null,null,"FXNQ (63)",null,null,"FXNQ (63)"]
[null,{"$f":"IF($C$231=\"Select Outdoor Unit\",0,1)","v":0},"R22 Outdoor Unit","R22 Indoor Units",null,null,"VRVQ + Old IDUs",null,null,"VRVQ + New IDUs",null,null,{"$f":"'Print Results'!K116","v":0}]
[null,{"$f":"IF($C$231=\"Select Outdoor Unit\",0,1)","v":0},null,"Type","Qty",null,"Outdoor","Indoor",null,"Outdoor","Indoor",null,"Outdoor","Indoor"]
[null,{"$f":"IF(Output!$D$5=\"Select Outdoor Unit\",0,IF(E231>0,1,0))","v":0},{"$f":"'Print Results'!B119","v":"Select Outdoor Unit"},"Wall Mounted (25)",{"$f":"COUNTIFS(Output!$R$6:$R$37,25,Output!$S$5:$S$36,\"Wall Mounted\")","v":0},null,{"$f":"VLOOKUP(C231,Database!$A$8:$J$53,7,FALSE)","v":{"$error":"#N/A"}},{"$f":"D231","v":"Wall Mounted (25)"},null,{"$f":"VLOOKUP(C231,Database!$A$8:$J$53,4,FALSE)","v":{"$error":"#N/A"}},"FXAQ (25)",null,{"$f":"VLOOKUP(C231,Database!$A$8:$J$53,10,FALSE)","v":{"$error":"#N/A"}},{"$f":"K231","v":"FXAQ (25)"}]
[null,{"$f":"IF(Output!$D$5=\"Select Outdoor Unit\",0,IF(E232>0,1,0))","v":0},null,"Wall Mounted (31.25)",{"$f":"COUNTIFS(Output!$R$6:$R$37,31.25,Output!$S$5:$S$36,\"Wall Mounted\")","v":0},null,null,{"$f":"D232","v":"Wall Mounted (31.25)"},null,null,"FXAQ (31.25)",null,null,{"$f":"K232","v":"FXAQ (31.25)"}]
[null,{"$f":"IF(Output!$D$5=\"Select Outdoor Unit\",0,IF(E233>0,1,0))","v":0},null,"Wall Mounted (40)",{"$f":"COUNTIFS(Output!$R$6:$R$37,40,Output!$S$5:$S$36,\"Wall Mounted\")","v":0},null,null,"Wall Mounted (40)",null,null,"FXAQ (40)",null,null,"FXAQ (40)"]
[null,{"$f":"IF(Output!$D$5=\"Select Outdoor Unit\",0,IF(E234>0,1,0))","v":0},null,"Wall Mounted (50)",{"$f":"COUNTIFS(Output!$R$6:$R$37,50,Output!$S$5:$S$36,\"Wall Mounted\")","v":0},null,null,"Wall Mounted (50)",null,null,"FXAQ (50)",null,null,"FXAQ (50)"]
[null,{"$f":"IF(Output!$D$5=\"Select Outdoor Unit\",0,IF(E235>0,1,0))","v":0},null,"Wall Mounted (63)",{"$f":"COUNTIFS(Output!$R$6:$R$37,63,Output!$S$5:$S$36,\"Wall Mounted\")","v":0},null,null,"Wall Mounted (63)",null,null,"FXAQ (63)",null,null,"FXAQ (63)"]
[null,{"$f":"IF(Output!$D$5=\"Select Outdoor Unit\",0,IF(E236>0,1,0))","v":0},null,"Ceiling Mounted Cassette (31.25)",{"$f":"COUNTIFS(Output!$R$6:$R$37,31.25,Output!$S$5:$S$36,\"Ceiling Mounted Cassette\")","v":0},null,null,"Ceiling Mounted Cassette (31.25)",null,null,"FXFQ (31.25)",null,null,"FXFQ (31.25)"]
[null,{"$f":"IF(Output!$D$5=\"Select Outdoor Unit\",0,IF(E237>0,1,0))","v":0},null,"Ceiling Mounted Cassette (40)",{"$f":"COUNTIFS(Output!$R$6:$R$37,40,Output!$S$5:$S$36,\"Ceiling Mounted Cassette\")","v":0},null,null,"Ceiling Mounted Cassette (40)",null,null,"FXFQ (40)",null,null,"FXFQ (40)"]
[null,{"$f":"IF(Output!$D$5=\"Select Outdoor Unit\",0,IF(E238>0,1,0))","v":0},null,"Ceiling Mounted Cassette (50)",{"$f":"COUNTIFS(Output!$R$6:$R$37,50,Output!$S$5:$S$36,\"Ceiling Mounted Cassette\")","v":0},null,null,"Ceiling Mounted Cassette (50)",null,null,"FXFQ (50)",null,null,"FXFQ (50)"]
[null,{"$f":"IF(Output!$D$5=\"Select Outdoor Unit\",0,IF(E239>0,1,0))","v":0},null,"Ceiling Mounted Cassette (63)",{"$f":"COUNTIFS(Output!$R$6:$R$37,63,Output!$S$5:$S$36,\"Ceiling Mounted Cassette\")","v":0},null,null,"Ceiling Mounted Cassette (63)",null,null,"FXFQ (63)",null,null,"FXFQ (63)"]
[null,{"$f":"IF(Output!$D$5=\"Select Outdoor Unit\",0,IF(E240>0,1,0))","v":0},null,"Ceiling Mounted Cassette (80)",{"$f":"COUNTIFS(Output!$R$6:$R$37,80,Output!$S$5:$S$36,\"Ceiling Mounted Cassette\")","v":0},null,null,"Ceiling Mounted Cassette (80)",null,null,"FXFQ (80)",null,null,"FXFQ (80)"]
[null,{"$f":"IF(Output!$D$5=\"Select Outdoor Unit\",0,IF(E241>0,1,0))","v":0},null,"Ceiling Mounted Cassette (100)",{"$f":"COUNTIFS(Output!$R$6:$R$37,100,Output!$S$5:$S$36,\"Ceiling Mounted Cassette\")","v":0},null,null,"Ceiling Mounted Cassette (100)",null,null,"FXFQ (100)",null,null,"FXFQ (100)"]
[null,{"$f":"IF(Output!$D$5=\"Select Outdoor Unit\",0,IF(E242>0,1,0))","v":0},null,"Ceiling Mounted Cassette (125)",{"$f":"COUNTIFS(Output!$R$6:$R$37,125,Output!$S$5:$S$36,\"Ceiling Mounted Cassette\")","v":0},null,null,"Ceiling Mounted Cassette (125)",null,null,"FXFQ (125)",null,null,"FXFQ (125)"]
[null,{"$f":"IF(Output!$D$5=\"Select Outdoor Unit\",0,IF(E243>0,1,0))","v":0},null,"Horizontal Ducted (20)",{"$f":"COUNTIFS(Output!$R$6:$R$37,20,Output!$S$5:$S$36,\"Horizontal Ducted\")","v":0},null,null,"Horizontal Ducted (20)",null,null,"FXSQ (20)",null,null,"FXSQ (20)"]
[null,{"$f":"IF(Output!$D$5=\"Select Outdoor Unit\",0,IF(E244>0,1,0))","v":0},null,"Horizontal Ducted (25)",{"$f":"COUNTIFS(Output!$R$6:$R$37,25,Output!$S$5:$S$36,\"Horizontal Ducted\")","v":0},null,null,"Horizontal Ducted (25)",null,null,"FXSQ (25)",null,null,"FXSQ (25)"]
[null,{"$f":"IF(Output!$D$5=\"Select Outdoor Unit\",0,IF(E245>0,1,0))","v":0},null,"Horizontal Ducted (31.25)",{"$f":"COUNTIFS(Output!$R$6:$R$37,31.25,Output!$S$5:$S$36,\"Horizontal Ducted\")","v":0},null,null,"Horizontal Ducted (31.25)",null,null,"FXSQ (31.25)",null,null,"FXSQ (31.25)"]
[null,{"$f":"IF(Output!$D$5=\"Select Outdoor Unit\",0,IF(E246>0,1,0))","v":0},null,"Horizontal Ducted (40)",{"$f":"COUNTIFS(Output!$R$6:$R$37,40,Output!$S$5:$S$36,\"Horizontal Ducted\")","v":0},null,null,"Horizontal Ducted (40)",null,null,"FXSQ (40)",null,null,"FXSQ (40)"]
[null,{"$f":"IF(Output!$D$5=\"Select Outdoor Unit\",0,IF(E247>0,1,0))","v":0},null,"Horizontal Ducted (50)",{"$f":"COUNTIFS(Output!$R$6:$R$37,50,Output!$S$5:$S$36,\"Horizontal Ducted\")","v":0},null,null,"Horizontal Ducted (50)",null,null,"FXSQ (50)",null,null,"FXSQ (50)"]
[null,{"$f":"IF(Output!$D$5=\"Select Outdoor Unit\",0,IF(E248>0,1,0))","v":0},null,"Horizontal Ducted (63)",{"$f":"COUNTIFS(Output!$R$6:$R$37,63,Output!$S$5:$S$36,\"Horizontal Ducted\")","v":0},null,null,"Horizontal Ducted (63)",null,null,"FXSQ (63)",null,null,"FXSQ (63)"]
[null,{"$f":"IF(Output!$D$5=\"Select Outdoor Unit\",0,IF(E249>0,1,0))","v":0},null,"Horizontal Ducted (80)",{"$f":"COUNTIFS(Output!$R$6:$R$37,80,Output!$S$5:$S$36,\"Horizontal Ducted\")","v":0},null,null,"Horizontal Ducted (80)",null,null,"FXSQ (80)",null,null,"FXSQ (80)"]
[null,{"$f":"IF(Output!$D$5=\"Select Outdoor Unit\",0,IF(E250>0,1,0))","v":0},null,"Horizontal Ducted (100)",{"$f":"COUNTIFS(Output!$R$6:$R$37,100,Output!$S$5:$S$36,\"Horizontal Ducted\")","v":0},null,null,"Horizontal Ducted (100)",null,null,"FXSQ (100)",null,null,"FXSQ (100)"]
[null,{"$f":"IF(Output!$D$5=\"Select Outdoor Unit\",0,IF(E251>0,1,0))","v":0},null,"Horizontal Ducted (125)",{"$f":"COUNTIFS(Output!$R$6:$R$37,125,Output!$S$5:$S$36,\"Horizontal Ducted\")","v":0},null,null,"Horizontal Ducted (125)",null,null,"FXSQ (125)",null,null,"FXSQ (125)"]
[null,{"$f":"IF(Output!$D$5=\"Select Outdoor Unit\",0,IF(E252>0,1,0))","v":0},null,"Ceiling Suspended (31.25)",{"$f":"COUNTIFS(Output!$R$6:$R$37,31.25,Output!$S$5:$S$36,\"Ceiling Suspended\")","v":0},null,null,"Ceiling Suspended (31.25)",null,null,"FXHQ (31.25)",null,null,"FXHQ (31.25)"]
[null,{"$f":"IF(Output!$D$5=\"Select Outdoor Unit\",0,IF(E253>0,1,0))","v":0},null,"Ceiling Suspended (63)",{"$f":"COUNTIFS(Output!$R$6:$R$37,63,Output!$S$5:$S$36,\"Ceiling Suspended\")","v":0},null,null,"Ceiling Suspended (63)",null,null,"FXHQ (63)",null,null,"FXHQ (63)"]
[null,{"$f":"IF(Output!$D$5=\"Select Outdoor Unit\",0,IF(E254>0,1,0))","v":0},null,"Ceiling Suspended (100)",{"$f":"COUNTIFS(Output!$R$6:$R$37,100,Output!$S$5:$S$36,\"Ceiling Suspended\")","v":0},null,null,"Ceiling Suspended (100)",null,null,"FXHQ (100)",null,null,"FXHQ (100)"]
[null,{"$f":"IF(Output!$D$5=\"Select Outdoor Unit\",0,IF(E255>0,1,0))","v":0},null,"Floor Standing (25)",{"$f":"COUNTIFS(Output!$R$6:$R$37,25,Output!$S$5:$S$36,\"Floor Standing\")","v":0},null,null,"Floor Standing (25)",null,null,"FXLQ (25)",null,null,"FXLQ (25)"]
[null,{"$f":"IF(Output!$D$5=\"Select Outdoor Unit\",0,IF(E256>0,1,0))","v":0},null,"Floor Standing (40)",{"$f":"COUNTIFS(Output!$R$6:$R$37,40,Output!$S$5:$S$36,\"Floor Standing\")","v":0},null,null,"Floor Standing (40)",null,null,"FXLQ (40)",null,null,"FXLQ (40)"]
[null,{"$f":"IF(Output!$D$5=\"Select Outdoor Unit\",0,IF(E257>0,1,0))","v":0},null,"Floor Standing (63)",{"$f":"COUNTIFS(Output!$R$6:$R$37,63,Output!$S$5:$S$36,\"Floor Standing\")","v":0},null,null,"Floor Standing (63)",null,null,"FXLQ (63)",null,null,"FXLQ (63)"]
[null,{"$f":"IF(Output!$D$5=\"Select Outdoor Unit\",0,IF(E258>0,1,0))","v":0},null,"Concealed Floor (25)",{"$f":"COUNTIFS(Output!$R$6:$R$37,25,Output!$S$5:$S$36,\"Concealed Floor\")","v":0},null,null,"Concealed Floor (25)",null,null,"FXNQ (25)",null,null,"FXNQ (25)"]
[null,{"$f":"IF(Output!$D$5=\"Select Outdoor Unit\",0,IF(E259>0,1,0))","v":0},null,"Concealed Floor (40)",{"$f":"COUNTIFS(Output!$R$6:$R$37,40,Output!$S$5:$S$36,\"Concealed Floor\")","v":0},null,null,"Concealed Floor (40)",null,null,"FXNQ (40)",null,null,"FXNQ (40)"]
[null,{"$f":"IF(Output!$D$5=\"Select Outdoor Unit\",0,IF(E260>0,1,0))","v":0},null,"Concealed Floor (63)",{"$f":"COUNTIFS(Output!$R$6:$R$37,63,Output!$S$5:$S$36,\"Concealed Floor\")","v":0},null,null,"Concealed Floor (63)",null,null,"FXNQ (63)",null,null,"FXNQ (63)"]
[null,{"$f":"IF($C$263=\"Select Outdoor Unit\",0,1)","v":0},"R22 Outdoor Unit","R22 Indoor Units",null,null,"VRVQ + Old IDUs",null,null,"VRVQ + New IDUs",null,null,{"$f":"'Print Results'!K125","v":0}]
[null,{"$f":"IF($C$263=\"Select Outdoor Unit\",0,1)","v":0},null,"Type","Qty",null,"Outdoor","Indoor",null,"Outdoor","Indoor",null,"Outdoor","Indoor"]
[null,{"$f":"IF(Output!$D$5=\"Select Outdoor Unit\",0,IF(E263>0,1,0))","v":0},{"$f":"'Print Results'!B128","v":"Select Outdoor Unit"},"Wall Mounted (25)",{"$f":"COUNTIFS(Output!$T$6:$T$37,25,Output!$U$5:$U$36,\"Wall Mounted\")","v":0},null,{"$f":"VLOOKUP(C263,Database!$A$8:$J$53,7,FALSE)","v":{"$error":"#N/A"}},{"$f":"D263","v":"Wall Mounted (25)"},null,{"$f":"VLOOKUP(C263,Database!$A$8:$J$53,4,FALSE)","v":{"$error":"#N/A"}},"FXAQ (25)",null,{"$f":"VLOOKUP(C263,Database!$A$8:$J$53,10,FALSE)","v":{"$error":"#N/A"}},{"$f":"K263","v":"FXAQ (25)"}]
[null,{"$f":"IF(Output!$D$5=\"Select Outdoor Unit\",0,IF(E264>0,1,0))","v":0},null,"Wall Mounted (31.25)",{"$f":"COUNTIFS(Output!$T$6:$T$37,31.25,Output!$U$5:$U$36,\"Wall Mounted\")","v":0},null,null,{"$f":"D264","v":"Wall Mounted (31.25)"},null,null,"FXAQ (31.25)",null,null,{"$f":"K264","v":"FXAQ (31.25)"}]
[null,{"$f":"IF(Output!$D$5=\"Select Outdoor Unit\",0,IF(E265>0,1,0))","v":0},null,"Wall Mounted (40)",{"$f":"COUNTIFS(Output!$T$6:$T$37,40,Output!$U$5:$U$36,\"Wall Mounted\")","v":0},null,null,"Wall Mounted (40)",null,null,"FXAQ (40)",null,null,"FXAQ (40)"]
[null,{"$f":"IF(Output!$D$5=\"Select Outdoor Unit\",0,IF(E266>0,1,0))","v":0},null,"Wall Mounted (50)",{"$f":"COUNTIFS(Output!$T$6:$T$37,50,Output!$U$5:$U$36,\"Wall Mounted\")","v":0},null,null,"Wall Mounted (50)",null,null,"FXAQ (50)",null,null,"FXAQ (50)"]
[null,{"$f":"IF(Output!$D$5=\"Select Outdoor Unit\",0,IF(E267>0,1,0))","v":0},null,"Wall Mounted (63)",{"$f":"COUNTIFS(Output!$T$6:$T$37,63,Output!$U$5:$U$36,\"Wall Mounted\")","v":0},null,null,"Wall Mounted (63)",null,null,"FXAQ (63)",null,null,"FXAQ (63)"]
[null,{"$f":"IF(Output!$D$5=\"Select Outdoor Unit\",0,IF(E268>0,1,0))","v":0},null,"Ceiling Mounted Cassette (31.25)",{"$f":"COUNTIFS(Output!$T$6:$T$37,31.25,Output!$U$5:$U$36,\"Ceiling Mounted Cassette\")","v":0},null,null,"Ceiling Mounted Cassette (31.25)",null,null,"FXFQ (31.25)",null,null,"FXFQ (31.25)"]
[null,{"$f":"IF(Output!$D$5=\"Select Outdoor Unit\",0,IF(E269>0,1,0))","v":0},null,"Ceiling Mounted Cassette (40)",{"$f":"COUNTIFS(Output!$T$6:$T$37,40,Output!$U$5:$U$36,\"Ceiling Mounted Cassette\")","v":0},null,null,"Ceiling Mounted Cassette (40)",null,null,"FXFQ (40)",null,null,"FXFQ (40)"]
[null,{"$f":"IF(Output!$D$5=\"Select Outdoor Unit\",0,IF(E270>0,1,0))","v":0},null,"Ceiling Mounted Cassette (50)",{"$f":"COUNTIFS(Output!$T$6:$T$37,50,Output!$U$5:$U$36,\"Ceiling Mounted Cassette\")","v":0},null,null,"Ceiling Mounted Cassette (50)",null,null,"FXFQ (50)",null,null,"FXFQ (50)"]
[null,{"$f":"IF(Output!$D$5=\"Select Outdoor Unit\",0,IF(E271>0,1,0))","v":0},null,"Ceiling Mounted Cassette (63)",{"$f":"COUNTIFS(Output!$T$6:$T$37,63,Output!$U$5:$U$36,\"Ceiling Mounted Cassette\")","v":0},null,null,"Ceiling Mounted Cassette (63)",null,null,"FXFQ (63)",null,null,"FXFQ (63)"]
[null,{"$f":"IF(Output!$D$5=\"Select Outdoor Unit\",0,IF(E272>0,1,0))","v":0},null,"Ceiling Mounted Cassette (80)",{"$f":"COUNTIFS(Output!$T$6:$T$37,80,Output!$U$5:$U$36,\"Ceiling Mounted Cassette\")","v":0},null,null,"Ceiling Mounted Cassette (80)",null,null,"FXFQ (80)",null,null,"FXFQ (80)"]
[null,{"$f":"IF(Output!$D$5=\"Select Outdoor Unit\",0,IF(E273>0,1,0))","v":0},null,"Ceiling Mounted Cassette (100)",{"$f":"COUNTIFS(Output!$T$6:$T$37,100,Output!$U$5:$U$36,\"Ceiling Mounted Cassette\")","v":0},null,null,"Ceiling Mounted Cassette (100)",null,null,"FXFQ (100)",null,null,"FXFQ (100)"]
[null,{"$f":"IF(Output!$D$5=\"Select Outdoor Unit\",0,IF(E274>0,1,0))","v":0},null,"Ceiling Mounted Cassette (125)",{"$f":"COUNTIFS(Output!$T$6:$T$37,125,Output!$U$5:$U$36,\"Ceiling Mounted Cassette\")","v":0},null,null,"Ceiling Mounted Cassette (125)",null,null,"FXFQ (125)",null,null,"FXFQ (125)"]
[null,{"$f":"IF(Output!$D$5=\"Select Outdoor Unit\",0,IF(E275>0,1,0))","v":0},null,"Horizontal Ducted (20)",{"$f":"COUNTIFS(Output!$T$6:$T$37,20,Output!$U$5:$U$36,\"Horizontal Ducted\")","v":0},null,null,"Horizontal Ducted (20)",null,null,"FXSQ (20)",null,null,"FXSQ (20)"]
[null,{"$f":"IF(Output!$D$5=\"Select Outdoor Unit\",0,IF(E276>0,1,0))","v":0},null,"Horizontal Ducted (25)",{"$f":"COUNTIFS(Output!$T$6:$T$37,25,Output!$U$5:$U$36,\"Horizontal Ducted\")","v":0},null,null,"Horizontal Ducted (25)",null,null,"FXSQ (25)",null,null,"FXSQ (25)"]
[null,{"$f":"IF(Output!$D$5=\"Select Outdoor Unit\",0,IF(E277>0,1,0))","v":0},null,"Horizontal Ducted (31.25)",{"$f":"COUNTIFS(Output!$T$6:$T$37,31.25,Output!$U$5:$U$36,\"Horizontal Ducted\")","v":0},null,null,"Horizontal Ducted (31.25)",null,null,"FXSQ (31.25)",null,null,"FXSQ (31.25)"]
[null,{"$f":"IF(Output!$D$5=\"Select Outdoor Unit\",0,IF(E278>0,1,0))","v":0},null,"Horizontal Ducted (40)",{"$f":"COUNTIFS(Output!$T$6:$T$37,40,Output!$U$5:$U$36,\"Horizontal Ducted\")","v":0},null,null,"Horizontal Ducted (40)",null,null,"FXSQ (40)",null,null,"FXSQ (40)"]
[null,{"$f":"IF(Output!$D$5=\"Select Outdoor Unit\",0,IF(E279>0,1,0))","v":0},null,"Horizontal Ducted (50)",{"$f":"COUNTIFS(Output!$T$6:$T$37,50,Output!$U$5:$U$36,\"Horizontal Ducted\")","v":0},null,null,"Horizontal Ducted (50)",null,null,"FXSQ (50)",null,null,"FXSQ (50)"]
[null,{"$f":"IF(Output!$D$5=\"Select Outdoor Unit\",0,IF(E280>0,1,0))","v":0},null,"Horizontal Ducted (63)",{"$f":"COUNTIFS(Output!$T$6:$T$37,63,Output!$U$5:$U$36,\"Horizontal Ducted\")","v":0},null,null,"Horizontal Ducted (63)",null,null,"FXSQ (63)",null,null,"FXSQ (63)"]
[null,{"$f":"IF(Output!$D$5=\"Select Outdoor Unit\",0,IF(E281>0,1,0))","v":0},null,"Horizontal Ducted (80)",{"$f":"COUNTIFS(Output!$T$6:$T$37,80,Output!$U$5:$U$36,\"Horizontal Ducted\")","v":0},null,null,"Horizontal Ducted (80)",null,null,"FXSQ (80)",null,null,"FXSQ (80)"]
[null,{"$f":"IF(Output!$D$5=\"Select Outdoor Unit\",0,IF(E282>0,1,0))","v":0},null,"Horizontal Ducted (100)",{"$f":"COUNTIFS(Output!$T$6:$T$37,100,Output!$U$5:$U$36,\"Horizontal Ducted\")","v":0},null,null,"Horizontal Ducted (100)",null,null,"FXSQ (100)",null,null,"FXSQ (100)"]
[null,{"$f":"IF(Output!$D$5=\"Select Outdoor Unit\",0,IF(E283>0,1,0))","v":0},null,"Horizontal Ducted (125)",{"$f":"COUNTIFS(Output!$T$6:$T$37,125,Output!$U$5:$U$36,\"Horizontal Ducted\")","v":0},null,null,"Horizontal Ducted (125)",null,null,"FXSQ (125)",null,null,"FXSQ (125)"]
[null,{"$f":"IF(Output!$D$5=\"Select Outdoor Unit\",0,IF(E284>0,1,0))","v":0},null,"Ceiling Suspended (31.25)",{"$f":"COUNTIFS(Output!$T$6:$T$37,31.25,Output!$U$5:$U$36,\"Ceiling Suspended\")","v":0},null,null,"Ceiling Suspended (31.25)",null,null,"FXHQ (31.25)",null,null,"FXHQ (31.25)"]
[null,{"$f":"IF(Output!$D$5=\"Select Outdoor Unit\",0,IF(E285>0,1,0))","v":0},null,"Ceiling Suspended (63)",{"$f":"COUNTIFS(Output!$T$6:$T$37,63,Output!$U$5:$U$36,\"Ceiling Suspended\")","v":0},null,null,"Ceiling Suspended (63)",null,null,"FXHQ (63)",null,null,"FXHQ (63)"]
[null,{"$f":"IF(Output!$D$5=\"Select Outdoor Unit\",0,IF(E286>0,1,0))","v":0},null,"Ceiling Suspended (100)",{"$f":"COUNTIFS(Output!$T$6:$T$37,100,Output!$U$5:$U$36,\"Ceiling Suspended\")","v":0},null,null,"Ceiling Suspended (100)",null,null,"FXHQ (100)",null,null,"FXHQ (100)"]
[null,{"$f":"IF(Output!$D$5=\"Select Outdoor Unit\",0,IF(E287>0,1,0))","v":0},null,"Floor Standing (25)",{"$f":"COUNTIFS(Output!$T$6:$T$37,25,Output!$U$5:$U$36,\"Floor Standing\")","v":0},null,null,"Floor Standing (25)",null,null,"FXLQ (25)",null,null,"FXLQ (25)"]
[null,{"$f":"IF(Output!$D$5=\"Select Outdoor Unit\",0,IF(E288>0,1,0))","v":0},null,"Floor Standing (40)",{"$f":"COUNTIFS(Output!$T$6:$T$37,40,Output!$U$5:$U$36,\"Floor Standing\")","v":0},null,null,"Floor Standing (40)",null,null,"FXLQ (40)",null,null,"FXLQ (40)"]
[null,{"$f":"IF(Output!$D$5=\"Select Outdoor Unit\",0,IF(E289>0,1,0))","v":0},null,"Floor Standing (63)",{"$f":"COUNTIFS(Output!$T$6:$T$37,63,Output!$U$5:$U$36,\"Floor Standing\")","v":0},null,null,"Floor Standing (63)",null,null,"FXLQ (63)",null,null,"FXLQ (63)"]
[null,{"$f":"IF(Output!$D$5=\"Select Outdoor Unit\",0,IF(E290>0,1,0))","v":0},null,"Concealed Floor (25)",{"$f":"COUNTIFS(Output!$T$6:$T$37,25,Output!$U$5:$U$36,\"Concealed Floor\")","v":0},null,null,"Concealed Floor (25)",null,null,"FXNQ (25)",null,null,"FXNQ (25)"]
[null,{"$f":"IF(Output!$D$5=\"Select Outdoor Unit\",0,IF(E291>0,1,0))","v":0},null,"Concealed Floor (40)",{"$f":"COUNTIFS(Output!$T$6:$T$37,40,Output!$U$5:$U$36,\"Concealed Floor\")","v":0},null,null,"Concealed Floor (40)",null,null,"FXNQ (40)",null,null,"FXNQ (40)"]
[null,{"$f":"IF(Output!$D$5=\"Select Outdoor Unit\",0,IF(E292>0,1,0))","v":0},null,"Concealed Floor (63)",{"$f":"COUNTIFS(Output!$T$6:$T$37,63,Output!$U$5:$U$36,\"Concealed Floor\")","v":0},null,null,"Concealed Floor (63)",null,null,"FXNQ (63)",null,null,"FXNQ (63)"]
[null,{"$f":"IF($C$295=\"Select Outdoor Unit\",0,1)","v":0},"R22 Outdoor Unit","R22 Indoor Units",null,null,"VRVQ + Old IDUs",null,null,"VRVQ + New IDUs",null,null,{"$f":"'Print Results'!K134","v":0}]
[null,{"$f":"IF($C$295=\"Select Outdoor Unit\",0,1)","v":0},null,"Type","Qty",null,"Outdoor","Indoor",null,"Outdoor","Indoor",null,"Outdoor","Indoor"]
[null,{"$f":"IF(Output!$D$5=\"Select Outdoor Unit\",0,IF(E295>0,1,0))","v":0},{"$f":"'Print Results'!B137","v":"Select Outdoor Unit"},"Wall Mounted (25)",{"$f":"COUNTIFS(Output!$V$6:$V$37,25,Output!$W$5:$W$36,\"Wall Mounted\")","v":0},null,{"$f":"VLOOKUP(C295,Database!$A$8:$J$53,7,FALSE)","v":{"$error":"#N/A"}},{"$f":"D295","v":"Wall Mounted (25)"},null,{"$f":"VLOOKUP(C295,Database!$A$8:$J$53,4,FALSE)","v":{"$error":"#N/A"}},"FXAQ (25)",null,{"$f":"VLOOKUP(C295,Database!$A$8:$J$53,10,FALSE)","v":{"$error":"#N/A"}},{"$f":"K295","v":"FXAQ (25)"}]
[null,{"$f":"IF(Output!$D$5=\"Select Outdoor Unit\",0,IF(E296>0,1,0))","v":0},null,"Wall Mounted (31.25)",{"$f":"COUNTIFS(Output!$V$6:$V$37,31.25,Output!$W$5:$W$36,\"Wall Mounted\")","v":0},null,null,{"$f":"D296","v":"Wall Mounted (31.25)"},null,null,"FXAQ (31.25)",null,null,{"$f":"K296","v":"FXAQ (31.25)"}]
[null,{"$f":"IF(Output!$D$5=\"Select Outdoor Unit\",0,IF(E297>0,1,0))","v":0},null,"Wall Mounted (40)",{"$f":"COUNTIFS(Output!$V$6:$V$37,40,Output!$W$5:$W$36,\"Wall Mounted\")","v":0},null,null,"Wall Mounted (40)",null,null,"FXAQ (40)",null,null,"FXAQ (40)"]
[null,{"$f":"IF(Output!$D$5=\"Select Outdoor Unit\",0,IF(E298>0,1,0))","v":0},null,"Wall Mounted (50)",{"$f":"COUNTIFS(Output!$V$6:$V$37,50,Output!$W$5:$W$36,\"Wall Mounted\")","v":0},null,null,"Wall Mounted (50)",null,null,"FXAQ (50)",null,null,"FXAQ (50)"]
[null,{"$f":"IF(Output!$D$5=\"Select Outdoor Unit\",0,IF(E299>0,1,0))","v":0},null,"Wall Mounted (63)",{"$f":"COUNTIFS(Output!$V$6:$V$37,63,Output!$W$5:$W$36,\"Wall Mounted\")","v":0},null,null,"Wall Mounted (63)",null,null,"FXAQ (63)",null,null,"FXAQ (63)"]
[null,{"$f":"IF(Output!$D$5=\"Select Outdoor Unit\",0,IF(E300>0,1,0))","v":0},null,"Ceiling Mounted Cassette (31.25)",{"$f":"COUNTIFS(Output!$V$6:$V$37,31.25,Output!$W$5:$W$36,\"Ceiling Mounted Cassette\")","v":0},null,null,"Ceiling Mounted Cassette (31.25)",null,null,"FXFQ (31.25)",null,null,"FXFQ (31.25)"]
[null,{"$f":"IF(Output!$D$5=\"Select Outdoor Unit\",0,IF(E301>0,1,0))","v":0},null,"Ceiling Mounted Cassette (40)",{"$f":"COUNTIFS(Output!$V$6:$V$37,40,Output!$W$5:$W$36,\"Ceiling Mounted Cassette\")","v":0},null,null,"Ceiling Mounted Cassette (40)",null,null,"FXFQ (40)",null,null,"FXFQ (40)"]
[null,{"$f":"IF(Output!$D$5=\"Select Outdoor Unit\",0,IF(E302>0,1,0))","v":0},null,"Ceiling Mounted Cassette (50)",{"$f":"COUNTIFS(Output!$V$6:$V$37,50,Output!$W$5:$W$36,\"Ceiling Mounted Cassette\")","v":0},null,null,"Ceiling Mounted Cassette (50)",null,null,"FXFQ (50)",null,null,"FXFQ (50)"]
[null,{"$f":"IF(Output!$D$5=\"Select Outdoor Unit\",0,IF(E303>0,1,0))","v":0},null,"Ceiling Mounted Cassette (63)",{"$f":"COUNTIFS(Output!$V$6:$V$37,63,Output!$W$5:$W$36,\"Ceiling Mounted Cassette\")","v":0},null,null,"Ceiling Mounted Cassette (63)",null,null,"FXFQ (63)",null,null,"FXFQ (63)"]
[null,{"$f":"IF(Output!$D$5=\"Select Outdoor Unit\",0,IF(E304>0,1,0))","v":0},null,"Ceiling Mounted Cassette (80)",{"$f":"COUNTIFS(Output!$V$6:$V$37,80,Output!$W$5:$W$36,\"Ceiling Mounted Cassette\")","v":0},null,null,"Ceiling Mounted Cassette (80)",null,null,"FXFQ (80)",null,null,"FXFQ (80)"]
[null,{"$f":"IF(Output!$D$5=\"Select Outdoor Unit\",0,IF(E305>0,1,0))","v":0},null,"Ceiling Mounted Cassette (100)",{"$f":"COUNTIFS(Output!$V$6:$V$37,100,Output!$W$5:$W$36,\"Ceiling Mounted Cassette\")","v":0},null,null,"Ceiling Mounted Cassette (100)",null,null,"FXFQ (100)",null,null,"FXFQ (100)"]
[null,{"$f":"IF(Output!$D$5=\"Select Outdoor Unit\",0,IF(E306>0,1,0))","v":0},null,"Ceiling Mounted Cassette (125)",{"$f":"COUNTIFS(Output!$V$6:$V$37,125,Output!$W$5:$W$36,\"Ceiling Mounted Cassette\")","v":0},null,null,"Ceiling Mounted Cassette (125)",null,null,"FXFQ (125)",null,null,"FXFQ (125)"]
[null,{"$f":"IF(Output!$D$5=\"Select Outdoor Unit\",0,IF(E307>0,1,0))","v":0},null,"Horizontal Ducted (20)",{"$f":"COUNTIFS(Output!$V$6:$V$37,20,Output!$W$5:$W$36,\"Horizontal Ducted\")","v":0},null,null,"Horizontal Ducted (20)",null,null,"FXSQ (20)",null,null,"FXSQ (20)"]
[null,{"$f":"IF(Output!$D$5=\"Select Outdoor Unit\",0,IF(E308>0,1,0))","v":0},null,"Horizontal Ducted (25)",{"$f":"COUNTIFS(Output!$V$6:$V$37,25,Output!$W$5:$W$36,\"Horizontal Ducted\")","v":0},null,null,"Horizontal Ducted (25)",null,null,"FXSQ (25)",null,null,"FXSQ (25)"]
[null,{"$f":"IF(Output!$D$5=\"Select Outdoor Unit\",0,IF(E309>0,1,0))","v":0},null,"Horizontal Ducted (31.25)",{"$f":"COUNTIFS(Output!$V$6:$V$37,31.25,Output!$W$5:$W$36,\"Horizontal Ducted\")","v":0},null,null,"Horizontal Ducted (31.25)",null,null,"FXSQ (31.25)",null,null,"FXSQ (31.25)"]
[null,{"$f":"IF(Output!$D$5=\"Select Outdoor Unit\",0,IF(E310>0,1,0))","v":0},null,"Horizontal Ducted (40)",{"$f":"COUNTIFS(Output!$V$6:$V$37,40,Output!$W$5:$W$36,\"Horizontal Ducted\")","v":0},null,null,"Horizontal Ducted (40)",null,null,"FXSQ (40)",null,null,"FXSQ (40)"]
[null,{"$f":"IF(Output!$D$5=\"Select Outdoor Unit\",0,IF(E311>0,1,0))","v":0},null,"Horizontal Ducted (50)",{"$f":"COUNTIFS(Output!$V$6:$V$37,50,Output!$W$5:$W$36,\"Horizontal Ducted\")","v":0},null,null,"Horizontal Ducted (50)",null,null,"FXSQ (50)",null,null,"FXSQ (50)"]
[null,{"$f":"IF(Output!$D$5=\"Select Outdoor Unit\",0,IF(E312>0,1,0))","v":0},null,"Horizontal Ducted (63)",{"$f":"COUNTIFS(Output!$V$6:$V$37,63,Output!$W$5:$W$36,\"Horizontal Ducted\")","v":0},null,null,"Horizontal Ducted (63)",null,null,"FXSQ (63)",null,null,"FXSQ (63)"]
[null,{"$f":"IF(Output!$D$5=\"Select Outdoor Unit\",0,IF(E313>0,1,0))","v":0},null,"Horizontal Ducted (80)",{"$f":"COUNTIFS(Output!$V$6:$V$37,80,Output!$W$5:$W$36,\"Horizontal Ducted\")","v":0},null,null,"Horizontal Ducted (80)",null,null,"FXSQ (80)",null,null,"FXSQ (80)"]
[null,{"$f":"IF(Output!$D$5=\"Select Outdoor Unit\",0,IF(E314>0,1,0))","v":0},null,"Horizontal Ducted (100)",{"$f":"COUNTIFS(Output!$V$6:$V$37,100,Output!$W$5:$W$36,\"Horizontal Ducted\")","v":0},null,null,"Horizontal Ducted (100)",null,null,"FXSQ (100)",null,null,"FXSQ (100)"]
[null,{"$f":"IF(Output!$D$5=\"Select Outdoor Unit\",0,IF(E315>0,1,0))","v":0},null,"Horizontal Ducted (125)",{"$f":"COUNTIFS(Output!$V$6:$V$37,125,Output!$W$5:$W$36,\"Horizontal Ducted\")","v":0},null,null,"Horizontal Ducted (125)",null,null,"FXSQ (125)",null,null,"FXSQ (125)"]
[null,{"$f":"IF(Output!$D$5=\"Select Outdoor Unit\",0,IF(E316>0,1,0))","v":0},null,"Ceiling Suspended (31.25)",{"$f":"COUNTIFS(Output!$V$6:$V$37,31.25,Output!$W$5:$W$36,\"Ceiling Suspended\")","v":0},null,null,"Ceiling Suspended (31.25)",null,null,"FXHQ (31.25)",null,null,"FXHQ (31.25)"]
[null,{"$f":"IF(Output!$D$5=\"Select Outdoor Unit\",0,IF(E317>0,1,0))","v":0},null,"Ceiling Suspended (63)",{"$f":"COUNTIFS(Output!$V$6:$V$37,63,Output!$W$5:$W$36,\"Ceiling Suspended\")","v":0},null,null,"Ceiling Suspended (63)",null,null,"FXHQ (63)",null,null,"FXHQ (63)"]
[null,{"$f":"IF(Output!$D$5=\"Select Outdoor Unit\",0,IF(E318>0,1,0))","v":0},null,"Ceiling Suspended (100)",{"$f":"COUNTIFS(Output!$V$6:$V$37,100,Output!$W$5:$W$36,\"Ceiling Suspended\")","v":0},null,null,"Ceiling Suspended (100)",null,null,"FXHQ (100)",null,null,"FXHQ (100)"]
[null,{"$f":"IF(Output!$D$5=\"Select Outdoor Unit\",0,IF(E319>0,1,0))","v":0},null,"Floor Standing (25)",{"$f":"COUNTIFS(Output!$V$6:$V$37,25,Output!$W$5:$W$36,\"Floor Standing\")","v":0},null,null,"Floor Standing (25)",null,null,"FXLQ (25)",null,null,"FXLQ (25)"]
[null,{"$f":"IF(Output!$D$5=\"Select Outdoor Unit\",0,IF(E320>0,1,0))","v":0},null,"Floor Standing (40)",{"$f":"COUNTIFS(Output!$V$6:$V$37,40,Output!$W$5:$W$36,\"Floor Standing\")","v":0},null,null,"Floor Standing (40)",null,null,"FXLQ (40)",null,null,"FXLQ (40)"]
[null,{"$f":"IF(Output!$D$5=\"Select Outdoor Unit\",0,IF(E321>0,1,0))","v":0},null,"Floor Standing (63)",{"$f":"COUNTIFS(Output!$V$6:$V$37,63,Output!$W$5:$W$36,\"Floor Standing\")","v":0},null,null,"Floor Standing (63)",null,null,"FXLQ (63)",null,null,"FXLQ (63)"]
[null,{"$f":"IF(Output!$D$5=\"Select Outdoor Unit\",0,IF(E322>0,1,0))","v":0},null,"Concealed Floor (25)",{"$f":"COUNTIFS(Output!$V$6:$V$37,25,Output!$W$5:$W$36,\"Concealed Floor\")","v":0},null,null,"Concealed Floor (25)",null,null,"FXNQ (25)",null,null,"FXNQ (25)"]
[null,{"$f":"IF(Output!$D$5=\"Select Outdoor Unit\",0,IF(E323>0,1,0))","v":0},null,"Concealed Floor (40)",{"$f":"COUNTIFS(Output!$V$6:$V$37,40,Output!$W$5:$W$36,\"Concealed Floor\")","v":0},null,null,"Concealed Floor (40)",null,null,"FXNQ (40)",null,null,"FXNQ (40)"]
[null,{"$f":"IF(Output!$D$5=\"Select Outdoor Unit\",0,IF(E324>0,1,0))","v":0},null,"Concealed Floor (63)",{"$f":"COUNTIFS(Output!$V$6:$V$37,63,Output!$W$5:$W$36,\"Concealed Floor\")","v":0},null,null,"Concealed Floor (63)",null,null,"FXNQ (63)",null,null,"FXNQ (63)"]

{"sheet":"Results","index":3,"n_rows":104,"n_cols":25,"rows_kept":104,"cut":false,"hidden":true,"merged":[[1,1,2,21],[3,1,3,21],[91,20,96,20],[98,19,103,19],[98,20,103,20],[63,20,68,20],[70,19,75,19],[70,20,75,20],[77,19,82,19],[77,20,82,20],[84,19,89,19],[84,20,89,20],[28,20,33,20],[35,19,40,19],[35,20,40,20],[49,19,54,19],[49,20,54,20],[56,19,61,19],[56,20,61,20],[84,15,89,16],[90,15,90,16],[91,15,96,16],[97,15,97,16],[98,15,103,16],[28,19,33,19],[63,19,68,19],[91,19,96,19],[63,15,68,16],[69,15,69,16],[70,15,75,16],[76,15,76,16],[77,15,82,16],[83,15,83,16],[83,17,83,18],[84,17,89,18],[90,17,90,18],[91,17,96,18],[97,17,97,18],[56,17,61,18],[62,17,62,18],[63,17,68,18],[69,17,69,18],[70,17,75,18],[76,17,76,18],[27,15,27,16],[28,15,33,16],[34,15,34,16],[35,15,40,16],[48,15,48,16],[49,15,54,16],[55,15,55,16],[56,15,61,16],[62,15,62,16],[91,12,96,14],[97,12,97,14],[98,12,103,14],[27,17,27,18],[28,17,33,18],[34,17,34,18],[35,17,40,18],[48,17,48,18],[49,17,54,18],[55,17,55,18],[70,12,75,14],[76,12,76,14],[77,12,82,14],[83,12,83,14],[84,12,89,14],[90,12,90,14],[49,12,54,14],[55,12,55,14],[56,12,61,14],[62,12,62,14],[63,12,68,14],[69,12,69,14],[98,17,103,18],[77,17,82,18],[99,7,99,10],[100,7,100,10],[101,7,101,10],[102,7,102,10],[103,7,103,10],[27,12,27,14],[28,12,33,14],[34,12,34,14],[35,12,40,14],[48,12,48,14],[93,7,93,10],[94,7,94,10],[95,7,95,10],[96,7,96,10],[97,7,97,10],[98,7,98,10],[87,7,87,10],[88,7,88,10],[89,7,89,10],[90,7,90,10],[91,7,91,10],[92,7,92,10],[81,7,81,10],[82,7,82,10],[83,7,83,10],[84,7,84,10],[85,7,85,10],[86,7,86,10],[75,7,75,10],[76,7,76,10],[77,7,77,10],[78,7,78,10],[79,7,79,10],[80,7,80,10],[91,2,96,6],[97,2,97,6],[98,2,103,6],[77,2,82,6],[83,2,83,6],[84,2,89,6],[90,2,90,6],[57,7,57,10],[58,7,58,10],[59,7,59,10],[60,7,60,10],[61,7,61,10],[62,7,62,10],[69,7,69,10],[70,7,70,10],[71,7,71,10],[72,7,72,10],[73,7,73,10],[74,7,74,10],[63,7,63,10],[64,7,64,10],[65,7,65,10],[66,7,66,10],[67,7,67,10],[70,2,75,6],[76,2,76,6],[49,2,54,6],[55,2,55,6],[56,2,61,6],[62,2,62,6],[63,2,68,6],[69,2,69,6],[38,7,38,10],[39,7,39,10],[40,7,40,10],[48,7,48,10],[49,7,49,10],[50,7,50,10],[51,7,51,10],[52,7,52,10],[53,7,53,10],[54,7,54,10],[55,7,55,10],[56,7,56,10],[68,7,68,10],[28,2,33,6],[34,2,34,6],[35,2,40,6],[48,2,48,6],[34,7,34,10],[35,7,35,10],[36,7,36,10],[37,7,37,10],[27,7,27,10],[28,7,28,10],[29,7,29,10],[30,7,30,10],[31,7,31,10],[32,7,32,10],[33,7,33,10],[24,13,24,20],[24,2,24,9],[5,4,5,6],[6,4,6,5],[7,4,7,5],[5,12,5,14],[5,16,5,18],[27,2,27,6],[22,2,22,3],[5,8,5,10],[20,2,20,5]]}
[]
[null,{"$f":"VLOOKUP(Output!$J$2,Translation!$A$2:$BF$16,48,FALSE)","v":"Project Summary"}]
[]
[null,"Project Name"]
[]
[null,null,null,null,{"$f":"Database!B4","v":"Existing Installation"},null,null,null,{"$f":"Database!G4","v":"VRVQ + Old IDUs"},null,null,null,{"$f":"Database!D4","v":"VRVQ + New IDUs"},null,null,null,"Based on the latest VRV Systems"]
[null,null,null,null,{"$f":"Database!$B$3","v":"£/annum"},null,{"$f":"Database!$C$3","v":"CO2/annum"},null,{"$f":"M7","v":"£/annum"},{"$f":"N7","v":"Saving"},{"$f":"O7","v":"CO2/annum"},null,{"$f":"Database!$B$3","v":"£/annum"},{"$f":"VLOOKUP(Output!$J$2,Translation!$A$2:$BF$16,18,FALSE)","v":"Saving"},{"$f":"Database!$C$3","v":"CO2/annum"},null,{"$f":"M7","v":"£/annum"},{"$f":"N7","v":"Saving"},{"$f":"O7","v":"CO2/annum"}]
[null,null,null,null,{"$f":"IFERROR((M29+M36+M50+M57+M64+M71+M78+M85+M92+M99)*Database!S3,0)","v":638.54999999999995},null,{"$f":"IFERROR(CONCATENATE(ROUND((((M29+M36+M50+M57+M64+M71+M78+M85+M92+M99)*Database!T3)/1000),1),\" T\"),0)","v":"3 T"},null,{"$f":"IFERROR((P29+P36+P50+P57+P64+P71+P78+P85+P92+P99)*Database!S3,0)","v":370.26},{"$f":"IFERROR(IF(I8=0,0,(E8-I8)/E8),0)","v":0.4201550387596899},{"$f":"IFERROR(CONCATENATE(ROUND((((P29+P36+P50+P57+P64+P71+P78+P85+P92+P99)*Database!T3)/1000),1),\" T\"),0)","v":"1.7 T"},null,{"$f":"IF(Database!Y54=Database!T54,IFERROR((R29+R36+R50+R57+R64+R71+R78+R85+R92+R99)*Database!S3,0),0)","v":358.82},{"$f":"IFERROR(IF(M8=0,0,($E$8-M8)/$E$8),0)","v":0.43807062876830316},{"$f":"IF(Database!Y54=Database!T54,IFERROR(CONCATENATE(ROUND((((R29+R36+R50+R57+R64+R71+R78+R85+R92+R99)*Database!T3)/1000),1),\" T\"),0))","v":"1.7 T"},null,{"$f":"IFERROR((T29+T36+T50+T57+T64+T71+T78+T85+T92+T99)*Database!S3,0)","v":358.82},{"$f":"IFERROR(IF(Q8=0,0,(E8-Q8)/E8),0)","v":0.43807062876830316},{"$f":"IFERROR(CONCATENATE(ROUND((((T29+T36+T50+T57+T64+T71+T78+T85+T92+T99)*Database!T3)/1000),1),\" T\"),0)","v":"1.7 T"}]
[]
[null,null,null,null,null,null,null,null,null,null,null,null,null,null,false]
[]
[null,null,null,null,null,null,null,null,null,null,{"$f":"CONCATENATE(Output!A32,\"/annum\")","v":"€/annum"},{"$f":"CONCATENATE(G7,\" (T)\")","v":"CO2/annum (T)"},"Saving"]
[null,null,null,null,null,null,null,null,null,{"$f":"E6","v":"Existing Installation"},{"$f":"E8","v":638.54999999999995},{"$f":"ROUND((((M29+M36+M50+M57+M64+M71+M78+M85+M92+M99)*Database!T3)/1000),0)","v":3},0]
[null,null,null,null,null,null,null,null,null,{"$f":"I6","v":"VRVQ + Old IDUs"},{"$f":"IF(L14=0,0,I8)","v":370.26},{"$f":"ROUND((((P29+P36+P50+P57+P64+P71+P78+P85+P92+P99)*Database!T3)/1000),0)","v":2},{"$f":"K14*J8","v":155.56660465116278}]
[null,null,null,null,null,null,null,null,null,{"$f":"M6","v":"VRVQ + New IDUs"},{"$f":"M8","v":358.82},{"$f":"ROUND((((R29+R36+R50+R57+R64+R71+R78+R85+R92+R99)*Database!T3)/1000),0)","v":2},{"$f":"K15*N8","v":157.18850301464255}]
[null,null,null,null,null,null,null,null,null,{"$f":"Q6","v":"Based on the latest VRV Systems"},{"$f":"Q8","v":358.82},{"$f":"ROUND((((T29+T36+T50+T57+T64+T71+T78+T85+T92+T99)*Database!T3)/1000),0)","v":2},{"$f":"K16*R8","v":157.18850301464255}]
[]
[]
[]
[]
[null,null,{"$f":"IF(O23=TRUE,\"\",VLOOKUP(Output!$J$2,Translation!$A$2:$BF$16,49,FALSE))","v":"Show detailed view"}]
[]
[null,null,"Project generated:",null,{"$f":"TODAY()","v":"2013-10-08"},null,null,null,null,null,null,null,null,null,false]
[]
[{"$f":"IF($A$28=1,1,0)","v":0},null,null,null,null,null,null,null,null,null,{"$f":"VLOOKUP(Output!J2,Translation!A2:$BF$16,52,FALSE)","v":"Worst"},{"$f":"VLOOKUP(Output!J2,Translation!A2:$BF$16,53,FALSE)","v":"Average"},{"$f":"VLOOKUP(Output!J2,Translation!A2:$BF$16,54,FALSE)","v":"Best"}]
[{"$f":"IF($A$28=1,1,0)","v":0}]
[0]
[{"$f":"IF(AND(B28=1,$O$23=TRUE),1,0)","v":0},{"$f":"IF(Output!$D$5=\"Select Outdoor Unit\",0,1)","v":1},"Outdoor Unit 1",null,null,null,null,"Indoor Units",null,null,null,{"$f":"VLOOKUP(Output!$J$2,Translation!$A$2:$BF$16,5,FALSE)","v":"Quantity"},{"$f":"CONCATENATE(E6,\" (kWh)\")","v":"Existing Installation (kWh)"},null,null,{"$f":"CONCATENATE(I6,\" (kWh)\")","v":"VRVQ + Old IDUs (kWh)"},null,{"$f":"CONCATENATE(M6,\" (kWh)\")","v":"VRVQ + New IDUs (kWh)"},null,{"$f":"CONCATENATE(Q6,\" (kWh)\")","v":"Based on the latest VRV Systems (kWh)"},{"$f":"#REF!","v":{"$error":"#REF!"}},null,null,500]
[{"$f":"IF(AND(B29=1,$O$23=TRUE),1,0)","v":0},{"$f":"IF(Output!$D$5=\"Select Outdoor Unit\",0,IF(L29>0,1,0))","v":0},{"$f":"Output!D5","v":"RSXY8K7"},null,null,null,null,"Wall Mounted",null,null,null,{"$f":"Indoor!C13","v":0},{"$f":"ROUND(Indoor!E153,0)","v":5805},null,null,{"$f":"IFERROR(ROUND(Indoor!E173,0),0)","v":3366},null,{"$f":"ROUND(Indoor!E163,0)","v":3262},null,{"$f":"IFERROR(ROUND(Indoor!E183,0),0)","v":3262},{"$f":"IFERROR(ROUND(((VLOOKUP(C29,Database!$A$8:$AR$54,36,FALSE))*Database!$U$3)+((VLOOKUP(C29,Database!$A$8:$AR$54,37,FALSE))*Database!$V$3),0),0)","v":0},null,{"$f":"X29-X28","v":3423.75},{"$f":"SUM(M29:T34)/COUNTIF(M29:T34,\">0\")","v":3923.75},{"$f":"X29+X28","v":4423.75}]
[0,{"$f":"IF(Output!$D$5=\"Select Outdoor Unit\",0,IF(L30>0,1,0))","v":0},null,null,null,null,null,"Ceiling Mounted Cassette",null,null,null,{"$f":"Indoor!C25","v":0}]
[0,{"$f":"IF(Output!$D$5=\"Select Outdoor Unit\",0,IF(L31>0,1,0))","v":1},null,null,null,null,null,{"$f":"Lists!F4","v":"Horizontal Ducted"},null,null,null,{"$f":"Indoor!C37","v":1}]
[0,{"$f":"IF(Output!$D$5=\"Select Outdoor Unit\",0,IF(L32>0,1,0))","v":1},null,null,null,null,null,"Ceiling Suspended",null,null,null,{"$f":"Indoor!C49","v":2}]
[0,{"$f":"IF(Output!$D$5=\"Select Outdoor Unit\",0,IF(L33>0,1,0))","v":0},null,null,null,null,null,"Floor Standing",null,null,null,{"$f":"Indoor!C61","v":0}]
[0,{"$f":"IF(Output!$D$5=\"Select Outdoor Unit\",0,IF(L34>0,1,0))","v":0},null,null,null,null,null,"Concealed Floor",null,null,null,{"$f":"Indoor!C73","v":0}]
[0,{"$f":"IF(Output!$F$5=\"Select Outdoor Unit\",0,1)","v":0},"Outdoor Unit 2",null,null,null,null,"Indoor Units",null,null,null,{"$f":"L28","v":"Quantity"},{"$f":"M28","v":"Existing Installation (kWh)"},null,null,{"$f":"P28","v":"VRVQ + Old IDUs (kWh)"},null,{"$f":"R28","v":"VRVQ + New IDUs (kWh)"},null,{"$f":"T28","v":"Based on the latest VRV Systems (kWh)"},{"$f":"U28","v":{"$error":"#REF!"}}]
[0,{"$f":"IF(Output!$F$5=\"Select Outdoor Unit\",0,IF(L36>0,1,0))","v":0},{"$f":"Output!F5","v":"Select Outdoor Unit"},null,null,null,null,"Wall Mounted",null,null,null,{"$f":"Indoor!I13","v":0},{"$f":"IFERROR(ROUND(Indoor!E154,0),0)","v":0},null,null,{"$f":"IFERROR(ROUND(Indoor!E174,0),0)","v":0},null,{"$f":"IFERROR(ROUND(Indoor!E164,0),0)","v":0},null,{"$f":"IFERROR(ROUND(Indoor!E184,0),0)","v":0},{"$f":"IFERROR(ROUND(((VLOOKUP(C36,Database!$A$8:$AR$54,36,FALSE))*Database!$U$3)+((VLOOKUP(C36,Database!$A$8:$AR$54,37,FALSE))*Database!$V$3),0),0)","v":0},null,{"$f":"X36-X28","v":{"$error":"#DIV/0!"}},{"$f":"SUM(M36:T41)/COUNTIF(M36:T41,\">0\")","v":{"$error":"#DIV/0!"}},{"$f":"X36+X28","v":{"$error":"#DIV/0!"}}]
[0,{"$f":"IF(Output!$F$5=\"Select Outdoor Unit\",0,IF(L37>0,1,0))","v":0},null,null,null,null,null,"Ceiling Mounted Cassette",null,null,null,{"$f":"Indoor!I25","v":0}]
[0,{"$f":"IF(Output!$F$5=\"Select Outdoor Unit\",0,IF(L38>0,1,0))","v":0},null,null,null,null,null,{"$f":"H31","v":"Horizontal Ducted"},null,null,null,{"$f":"Indoor!I37","v":0}]
[0,{"$f":"IF(Output!$F$5=\"Select Outdoor Unit\",0,IF(L39>0,1,0))","v":0},null,null,null,null,null,"Ceiling Suspended",null,null,null,{"$f":"Indoor!I49","v":0}]
[0,{"$f":"IF(Output!$F$5=\"Select Outdoor Unit\",0,IF(L40>0,1,0))","v":0},null,null,null,null,null,"Floor Standing",null,null,null,{"$f":"Indoor!I61","v":0}]
[0,{"$f":"IF(Output!$F$5=\"Select Outdoor Unit\",0,IF(L41>0,1,0))","v":0},null,null,null,null,null,"Concealed Floor",null,null,null,{"$f":"Indoor!I73","v":0}]
[{"$f":"IF($A$49=1,1,IF(SUM($A$36:$A$41)=5,1,0))","v":0}]
[0]
[0]
[0]
[0]
[0]
[0]
[0,{"$f":"IF(Output!$H$5=\"Select Outdoor Unit\",0,1)","v":0},"Outdoor Unit 3",null,null,null,null,"Indoor Units",null,null,null,{"$f":"L28","v":"Quantity"},{"$f":"M35","v":"Existing Installation (kWh)"},null,null,{"$f":"P35","v":"VRVQ + Old IDUs (kWh)"},null,{"$f":"R35","v":"VRVQ + New IDUs (kWh)"},null,{"$f":"T35","v":"Based on the latest VRV Systems (kWh)"},{"$f":"U35","v":{"$error":"#REF!"}}]
[0,{"$f":"IF(Output!$H$5=\"Select Outdoor Unit\",0,IF(L50>0,1,0))","v":0},{"$f":"Output!H5","v":"Select Outdoor Unit"},null,null,null,null,"Wall Mounted",null,null,null,{"$f":"Indoor!O13","v":0},{"$f":"IFERROR(ROUND(Indoor!E155,0),0)","v":0},null,null,{"$f":"IFERROR(ROUND(Indoor!E175,0),0)","v":0},null,{"$f":"IFERROR(ROUND(Indoor!E165,0),0)","v":0},null,{"$f":"IFERROR(ROUND(Indoor!E185,0),0)","v":0},{"$f":"IFERROR(ROUND(((VLOOKUP(C50,Database!$A$8:$AR$54,36,FALSE))*Database!$U$3)+((VLOOKUP(C50,Database!$A$8:$AR$54,37,FALSE))*Database!$V$3),0),0)","v":0},null,{"$f":"X50-X28","v":{"$error":"#DIV/0!"}},{"$f":"SUM(M50:T55)/COUNTIF(M50:T55,\">0\")","v":{"$error":"#DIV/0!"}},{"$f":"X50+X28","v":{"$error":"#DIV/0!"}}]
[0,{"$f":"IF(Output!$H$5=\"Select Outdoor Unit\",0,IF(L51>0,1,0))","v":0},null,null,null,null,null,"Ceiling Mounted Cassette",null,null,null,{"$f":"Indoor!O25","v":0}]
[0,{"$f":"IF(Output!$H$5=\"Select Outdoor Unit\",0,IF(L52>0,1,0))","v":0},null,null,null,null,null,{"$f":"H38","v":"Horizontal Ducted"},null,null,null,{"$f":"Indoor!O37","v":0}]
[0,{"$f":"IF(Output!$H$5=\"Select Outdoor Unit\",0,IF(L53>0,1,0))","v":0},null,null,null,null,null,"Ceiling Suspended",null,null,null,{"$f":"Indoor!O49","v":0}]
[0,{"$f":"IF(Output!$H$5=\"Select Outdoor Unit\",0,IF(L54>0,1,0))","v":0},null,null,null,null,null,"Floor Standing",null,null,null,{"$f":"Indoor!O61","v":0}]
[0,{"$f":"IF(Output!$H$5=\"Select Outdoor Unit\",0,IF(L55>0,1,0))","v":0},null,null,null,null,null,"Concealed Floor",null,null,null,{"$f":"Indoor!O73","v":0}]
[0,{"$f":"IF(Output!$J$5=\"Select Outdoor Unit\",0,1)","v":0},"Outdoor Unit 4",null,null,null,null,"Indoor Units",null,null,null,{"$f":"L28","v":"Quantity"},{"$f":"M49","v":"Existing Installation (kWh)"},null,null,{"$f":"P49","v":"VRVQ + Old IDUs (kWh)"},null,{"$f":"R49","v":"VRVQ + New IDUs (kWh)"},null,{"$f":"T49","v":"Based on the latest VRV Systems (kWh)"},{"$f":"U49","v":{"$error":"#REF!"}}]
[0,{"$f":"IF(Output!$J$5=\"Select Outdoor Unit\",0,IF(L57>0,1,0))","v":0},{"$f":"Output!J5","v":"Select Outdoor Unit"},null,null,null,null,"Wall Mounted",null,null,null,{"$f":"Indoor!U13","v":0},{"$f":"IFERROR(ROUND(Indoor!E156,0),0)","v":0},null,null,{"$f":"IFERROR(ROUND(Indoor!E176,0),0)","v":0},null,{"$f":"IFERROR(ROUND(Indoor!E166,0),0)","v":0},null,{"$f":"IFERROR(ROUND(Indoor!E186,0),0)","v":0},{"$f":"IFERROR(ROUND(((VLOOKUP(C57,Database!$A$8:$AR$54,36,FALSE))*Database!$U$3)+((VLOOKUP(C57,Database!$A$8:$AR$54,37,FALSE))*Database!$V$3),0),0)","v":0},null,{"$f":"X57-X28","v":{"$error":"#DIV/0!"}},{"$f":"SUM(M57:T62)/COUNTIF(M57:T62,\">0\")","v":{"$error":"#DIV/0!"}},{"$f":"X57+X28","v":{"$error":"#DIV/0!"}}]
[0,{"$f":"IF(Output!$J$5=\"Select Outdoor Unit\",0,IF(L58>0,1,0))","v":0},null,null,null,null,null,"Ceiling Mounted Cassette",null,null,null,{"$f":"Indoor!U25","v":0}]
[0,{"$f":"IF(Output!$J$5=\"Select Outdoor Unit\",0,IF(L59>0,1,0))","v":0},null,null,null,null,null,{"$f":"H52","v":"Horizontal Ducted"},null,null,null,{"$f":"Indoor!U37","v":0}]
[0,{"$f":"IF(Output!$J$5=\"Select Outdoor Unit\",0,IF(L60>0,1,0))","v":0},null,null,null,null,null,"Ceiling Suspended",null,null,null,{"$f":"Indoor!U49","v":0}]
[0,{"$f":"IF(Output!$J$5=\"Select Outdoor Unit\",0,IF(L61>0,1,0))","v":0},null,null,null,null,null,"Floor Standing",null,null,null,{"$f":"Indoor!U61","v":0}]
[0,{"$f":"IF(Output!$J$5=\"Select Outdoor Unit\",0,IF(L62>0,1,0))","v":0},null,null,null,null,null,"Concealed Floor",null,null,null,{"$f":"Indoor!U73","v":0}]
[0,{"$f":"IF(Output!$L$5=\"Select Outdoor Unit\",0,1)","v":0},"Outdoor Unit 5",null,null,null,null,"Indoor Units",null,null,null,{"$f":"L28","v":"Quantity"},{"$f":"M56","v":"Existing Installation (kWh)"},null,null,{"$f":"P56","v":"VRVQ + Old IDUs (kWh)"},null,{"$f":"R56","v":"VRVQ + New IDUs (kWh)"},null,{"$f":"T56","v":"Based on the latest VRV Systems (kWh)"},{"$f":"U56","v":{"$error":"#REF!"}}]
[0,{"$f":"IF(Output!$L$5=\"Select Outdoor Unit\",0,IF(L64>0,1,0))","v":0},{"$f":"Output!L5","v":"Select Outdoor Unit"},null,null,null,null,"Wall Mounted",null,null,null,{"$f":"Indoor!AA13","v":0},{"$f":"IFERROR(ROUND(Indoor!E157,0),0)","v":0},null,null,{"$f":"IFERROR(ROUND(Indoor!E177,0),0)","v":0},null,{"$f":"IFERROR(ROUND(Indoor!E167,0),0)","v":0},null,{"$f":"IFERROR(ROUND(Indoor!E187,0),0)","v":0},{"$f":"IFERROR(ROUND(((VLOOKUP(C64,Database!$A$8:$AR$54,36,FALSE))*Database!$U$3)+((VLOOKUP(C64,Database!$A$8:$AR$54,37,FALSE))*Database!$V$3),0),0)","v":0},null,{"$f":"X64-X28","v":{"$error":"#DIV/0!"}},{"$f":"SUM(M64:T69)/COUNTIF(M64:T69,\">0\")","v":{"$error":"#DIV/0!"}},{"$f":"X64+X28","v":{"$error":"#DIV/0!"}}]
[0,{"$f":"IF(Output!$L$5=\"Select Outdoor Unit\",0,IF(L65>0,1,0))","v":0},null,null,null,null,null,"Ceiling Mounted Cassette",null,null,null,{"$f":"Indoor!AA25","v":0}]
[0,{"$f":"IF(Output!$L$5=\"Select Outdoor Unit\",0,IF(L66>0,1,0))","v":0},null,null,null,null,null,{"$f":"H59","v":"Horizontal Ducted"},null,null,null,{"$f":"Indoor!AA37","v":0}]
[0,{"$f":"IF(Output!$L$5=\"Select Outdoor Unit\",0,IF(L67>0,1,0))","v":0},null,null,null,null,null,"Ceiling Suspended",null,null,null,{"$f":"Indoor!AA49","v":0}]
[0,{"$f":"IF(Output!$L$5=\"Select Outdoor Unit\",0,IF(L68>0,1,0))","v":0},null,null,null,null,null,"Floor Standing",null,null,null,{"$f":"Indoor!AA61","v":0}]
[0,{"$f":"IF(Output!$L$5=\"Select Outdoor Unit\",0,IF(L69>0,1,0))","v":0},null,null,null,null,null,"Concealed Floor",null,null,null,{"$f":"Indoor!AA73","v":0}]
[0,{"$f":"IF(Output!$N$5=\"Select Outdoor Unit\",0,1)","v":0},"Outdoor Unit 6",null,null,null,null,"Indoor Units",null,null,null,{"$f":"L28","v":"Quantity"},{"$f":"M63","v":"Existing Installation (kWh)"},null,null,{"$f":"P63","v":"VRVQ + Old IDUs (kWh)"},null,{"$f":"R63","v":"VRVQ + New IDUs (kWh)"},null,{"$f":"T63","v":"Based on the latest VRV Systems (kWh)"},{"$f":"U63","v":{"$error":"#REF!"}}]
[0,{"$f":"IF(Output!$N$5=\"Select Outdoor Unit\",0,IF(L71>0,1,0))","v":0},{"$f":"Output!N5","v":"Select Outdoor Unit"},null,null,null,null,"Wall Mounted",null,null,null,{"$f":"Indoor!AG13","v":0},{"$f":"IFERROR(ROUND(Indoor!E158,0),0)","v":0},null,null,{"$f":"IFERROR(ROUND(Indoor!E178,0),0)","v":0},null,{"$f":"IFERROR(ROUND(Indoor!E168,0),0)","v":0},null,{"$f":"IFERROR(ROUND(Indoor!E188,0),0)","v":0},{"$f":"IFERROR(ROUND(((VLOOKUP(C71,Database!$A$8:$AR$54,36,FALSE))*Database!$U$3)+((VLOOKUP(C71,Database!$A$8:$AR$54,37,FALSE))*Database!$V$3),0),0)","v":0},null,{"$f":"X71-X28","v":{"$error":"#DIV/0!"}},{"$f":"SUM(M71:T76)/COUNTIF(M71:T76,\">0\")","v":{"$error":"#DIV/0!"}},{"$f":"X71+X28","v":{"$error":"#DIV/0!"}}]
[0,{"$f":"IF(Output!$N$5=\"Select Outdoor Unit\",0,IF(L72>0,1,0))","v":0},null,null,null,null,null,"Ceiling Mounted Cassette",null,null,null,{"$f":"Indoor!AG25","v":0}]
[0,{"$f":"IF(Output!$N$5=\"Select Outdoor Unit\",0,IF(L73>0,1,0))","v":0},null,null,null,null,null,{"$f":"H66","v":"Horizontal Ducted"},null,null,null,{"$f":"Indoor!AG37","v":0}]
[0,{"$f":"IF(Output!$N$5=\"Select Outdoor Unit\",0,IF(L74>0,1,0))","v":0},null,null,null,null,null,"Ceiling Suspended",null,null,null,{"$f":"Indoor!AG49","v":0}]
[0,{"$f":"IF(Output!$N$5=\"Select Outdoor Unit\",0,IF(L75>0,1,0))","v":0},null,null,null,null,null,"Floor Standing",null,null,null,{"$f":"Indoor!AG61","v":0}]
[0,{"$f":"IF(Output!$N$5=\"Select Outdoor Unit\",0,IF(L76>0,1,0))","v":0},null,null,null,null,null,"Concealed Floor",null,null,null,{"$f":"Indoor!AG73","v":0}]
[0,{"$f":"IF(Output!$P$5=\"Select Outdoor Unit\",0,1)","v":0},"Outdoor Unit 7",null,null,null,null,"Indoor Units",null,null,null,{"$f":"L28","v":"Quantity"},{"$f":"M70","v":"Existing Installation (kWh)"},null,null,{"$f":"P70","v":"VRVQ + Old IDUs (kWh)"},null,{"$f":"R70","v":"VRVQ + New IDUs (kWh)"},null,{"$f":"T70","v":"Based on the latest VRV Systems (kWh)"},{"$f":"U70","v":{"$error":"#REF!"}}]
[0,{"$f":"IF(Output!$P$5=\"Select Outdoor Unit\",0,IF(L78>0,1,0))","v":0},{"$f":"Output!P5","v":"Select Outdoor Unit"},null,null,null,null,"Wall Mounted",null,null,null,{"$f":"Indoor!AM13","v":0},{"$f":"IFERROR(ROUND(Indoor!E159,0),0)","v":0},null,null,{"$f":"IFERROR(ROUND(Indoor!E179,0),0)","v":0},null,{"$f":"IFERROR(ROUND(Indoor!E169,0),0)","v":0},null,{"$f":"IFERROR(ROUND(Indoor!E189,0),0)","v":0},{"$f":"IFERROR(ROUND(((VLOOKUP(C78,Database!$A$8:$AR$54,36,FALSE))*Database!$U$3)+((VLOOKUP(C78,Database!$A$8:$AR$54,37,FALSE))*Database!$V$3),0),0)","v":0},null,{"$f":"X78-X28","v":{"$error":"#DIV/0!"}},{"$f":"SUM(M78:T83)/COUNTIF(M78:T83,\">0\")","v":{"$error":"#DIV/0!"}},{"$f":"X78+X28","v":{"$error":"#DIV/0!"}}]
[0,{"$f":"IF(Output!$P$5=\"Select Outdoor Unit\",0,IF(L79>0,1,0))","v":0},null,null,null,null,null,"Ceiling Mounted Cassette",null,null,null,{"$f":"Indoor!AM25","v":0}]
[0,{"$f":"IF(Output!$P$5=\"Select Outdoor Unit\",0,IF(L80>0,1,0))","v":0},null,null,null,null,null,{"$f":"H73","v":"Horizontal Ducted"},null,null,null,{"$f":"Indoor!AM37","v":0}]
[0,{"$f":"IF(Output!$P$5=\"Select Outdoor Unit\",0,IF(L81>0,1,0))","v":0},null,null,null,null,null,"Ceiling Suspended",null,null,null,{"$f":"Indoor!AM49","v":0}]
[0,{"$f":"IF(Output!$P$5=\"Select Outdoor Unit\",0,IF(L82>0,1,0))","v":0},null,null,null,null,null,"Floor Standing",null,null,null,{"$f":"Indoor!AM61","v":0}]
[0,{"$f":"IF(Output!$P$5=\"Select Outdoor Unit\",0,IF(L83>0,1,0))","v":0},null,null,null,null,null,"Concealed Floor",null,null,null,{"$f":"Indoor!AM73","v":0}]
[0,{"$f":"IF(Output!$R$5=\"Select Outdoor Unit\",0,1)","v":0},"Outdoor Unit 8",null,null,null,null,"Indoor Units",null,null,null,{"$f":"L28","v":"Quantity"},{"$f":"M77","v":"Existing Installation (kWh)"},null,null,{"$f":"P77","v":"VRVQ + Old IDUs (kWh)"},null,{"$f":"R77","v":"VRVQ + New IDUs (kWh)"},null,{"$f":"T77","v":"Based on the latest VRV Systems (kWh)"},{"$f":"U77","v":{"$error":"#REF!"}}]
[0,{"$f":"IF(Output!$R$5=\"Select Outdoor Unit\",0,IF(L85>0,1,0))","v":0},{"$f":"Output!R5","v":"Select Outdoor Unit"},null,null,null,null,"Wall Mounted",null,null,null,{"$f":"Indoor!AS13","v":0},{"$f":"IFERROR(ROUND(Indoor!E160,0),0)","v":0},null,null,{"$f":"IFERROR(ROUND(Indoor!E180,0),0)","v":0},null,{"$f":"IFERROR(ROUND(Indoor!E170,0),0)","v":0},null,{"$f":"IFERROR(ROUND(Indoor!E190,0),0)","v":0},{"$f":"IFERROR(ROUND(((VLOOKUP(C85,Database!$A$8:$AR$54,36,FALSE))*Database!$U$3)+((VLOOKUP(C85,Database!$A$8:$AR$54,37,FALSE))*Database!$V$3),0),0)","v":0},null,{"$f":"X85-X28","v":{"$error":"#DIV/0!"}},{"$f":"SUM(M85:T90)/COUNTIF(M85:T90,\">0\")","v":{"$error":"#DIV/0!"}},{"$f":"X85+X28","v":{"$error":"#DIV/0!"}}]
[0,{"$f":"IF(Output!$R$5=\"Select Outdoor Unit\",0,IF(L86>0,1,0))","v":0},null,null,null,null,null,"Ceiling Mounted Cassette",null,null,null,{"$f":"Indoor!AS25","v":0}]
[0,{"$f":"IF(Output!$R$5=\"Select Outdoor Unit\",0,IF(L87>0,1,0))","v":0},null,null,null,null,null,{"$f":"H80","v":"Horizontal Ducted"},null,null,null,{"$f":"Indoor!AS37","v":0}]
[0,{"$f":"IF(Output!$R$5=\"Select Outdoor Unit\",0,IF(L88>0,1,0))","v":0},null,null,null,null,null,"Ceiling Suspended",null,null,null,{"$f":"Indoor!AS49","v":0}]
[0,{"$f":"IF(Output!$R$5=\"Select Outdoor Unit\",0,IF(L89>0,1,0))","v":0},null,null,null,null,null,"Floor Standing",null,null,null,{"$f":"Indoor!AS61","v":0}]
[0,{"$f":"IF(Output!$R$5=\"Select Outdoor Unit\",0,IF(L90>0,1,0))","v":0},null,null,null,null,null,"Concealed Floor",null,null,null,{"$f":"Indoor!AS73","v":0}]
[0,{"$f":"IF(Output!$T$5=\"Select Outdoor Unit\",0,1)","v":0},"Outdoor Unit 9",null,null,null,null,"Indoor Units",null,null,null,{"$f":"L28","v":"Quantity"},{"$f":"M84","v":"Existing Installation (kWh)"},null,null,{"$f":"P84","v":"VRVQ + Old IDUs (kWh)"},null,{"$f":"R84","v":"VRVQ + New IDUs (kWh)"},null,{"$f":"T84","v":"Based on the latest VRV Systems (kWh)"},{"$f":"U84","v":{"$error":"#REF!"}}]
[0,{"$f":"IF(Output!$T$5=\"Select Outdoor Unit\",0,IF(L92>0,1,0))","v":0},{"$f":"Output!T5","v":"Select Outdoor Unit"},null,null,null,null,"Wall Mounted",null,null,null,{"$f":"Indoor!AY13","v":0},{"$f":"IFERROR(ROUND(Indoor!E161,0),0)","v":0},null,null,{"$f":"IFERROR(ROUND(Indoor!E181,0),0)","v":0},null,{"$f":"IFERROR(ROUND(Indoor!E171,0),0)","v":0},null,{"$f":"IFERROR(ROUND(Indoor!E191,0),0)","v":0},{"$f":"IFERROR(ROUND(((VLOOKUP(C92,Database!$A$8:$AR$54,36,FALSE))*Database!$U$3)+((VLOOKUP(C92,Database!$A$8:$AR$54,37,FALSE))*Database!$V$3),0),0)","v":0},null,{"$f":"X92-X28","v":{"$error":"#DIV/0!"}},{"$f":"SUM(M92:T97)/COUNTIF(M92:T97,\">0\")","v":{"$error":"#DIV/0!"}},{"$f":"X92+X28","v":{"$error":"#DIV/0!"}}]
[0,{"$f":"IF(Output!$T$5=\"Select Outdoor Unit\",0,IF(L93>0,1,0))","v":0},null,null,null,null,null,"Ceiling Mounted Cassette",null,null,null,{"$f":"Indoor!AY25","v":0}]
[0,{"$f":"IF(Output!$T$5=\"Select Outdoor Unit\",0,IF(L94>0,1,0))","v":0},null,null,null,null,null,{"$f":"H87","v":"Horizontal Ducted"},null,null,null,{"$f":"Indoor!AY37","v":0}]
[0,{"$f":"IF(Output!$T$5=\"Select Outdoor Unit\",0,IF(L95>0,1,0))","v":0},null,null,null,null,null,"Ceiling Suspended",null,null,null,{"$f":"Indoor!AY49","v":0}]
[0,{"$f":"IF(Output!$T$5=\"Select Outdoor Unit\",0,IF(L96>0,1,0))","v":0},null,null,null,null,null,"Floor Standing",null,null,null,{"$f":"Indoor!AY61","v":0}]
[0,{"$f":"IF(Output!$T$5=\"Select Outdoor Unit\",0,IF(L97>0,1,0))","v":0},null,null,null,null,null,"Concealed Floor",null,null,null,{"$f":"Indoor!AY73","v":0}]
[0,{"$f":"IF(Output!$V$5=\"Select Outdoor Unit\",0,1)","v":0},"Outdoor Unit 10",null,null,null,null,"Indoor Units",null,null,null,{"$f":"L28","v":"Quantity"},{"$f":"M91","v":"Existing Installation (kWh)"},null,null,{"$f":"P91","v":"VRVQ + Old IDUs (kWh)"},null,{"$f":"R91","v":"VRVQ + New IDUs (kWh)"},null,{"$f":"T91","v":"Based on the latest VRV Systems (kWh)"},{"$f":"U91","v":{"$error":"#REF!"}}]
[0,{"$f":"IF(Output!$V$5=\"Select Outdoor Unit\",0,IF(L99>0,1,0))","v":0},{"$f":"Output!V5","v":"Select Outdoor Unit"},null,null,null,null,"Wall Mounted",null,null,null,{"$f":"Indoor!BE13","v":0},{"$f":"IFERROR(ROUND(Indoor!E162,0),0)","v":0},null,null,{"$f":"IFERROR(ROUND(Indoor!E182,0),0)","v":0},null,{"$f":"IFERROR(ROUND(Indoor!E172,0),0)","v":0},null,{"$f":"IFERROR(ROUND(Indoor!E192,0),0)","v":0},{"$f":"IFERROR(ROUND(((VLOOKUP(C99,Database!$A$8:$AR$54,36,FALSE))*Database!$U$3)+((VLOOKUP(C99,Database!$A$8:$AR$54,37,FALSE))*Database!$V$3),0),0)","v":0},null,{"$f":"X99-X28","v":{"$error":"#DIV/0!"}},{"$f":"SUM(M99:T104)/COUNTIF(M99:T104,\">0\")","v":{"$error":"#DIV/0!"}},{"$f":"X99+X28","v":{"$error":"#DIV/0!"}}]
[0,{"$f":"IF(Output!$V$5=\"Select Outdoor Unit\",0,IF(L100>0,1,0))","v":0},null,null,null,null,null,"Ceiling Mounted Cassette",null,null,null,{"$f":"Indoor!BE25","v":0}]
[0,{"$f":"IF(Output!$V$5=\"Select Outdoor Unit\",0,IF(L101>0,1,0))","v":0},null,null,null,null,null,{"$f":"H94","v":"Horizontal Ducted"},null,null,null,{"$f":"Indoor!BE37","v":0}]
[0,{"$f":"IF(Output!$V$5=\"Select Outdoor Unit\",0,IF(L102>0,1,0))","v":0},null,null,null,null,null,"Ceiling Suspended",null,null,null,{"$f":"Indoor!BE49","v":0}]
[0,{"$f":"IF(Output!$V$5=\"Select Outdoor Unit\",0,IF(L103>0,1,0))","v":0},null,null,null,null,null,"Floor Standing",null,null,null,{"$f":"Indoor!BE61","v":0}]
[0,{"$f":"IF(Output!$V$5=\"Select Outdoor Unit\",0,IF(L104>0,1,0))","v":0},null,null,null,null,null,"Concealed Floor",null,null,null,{"$f":"Indoor!BE73","v":0}]

{"sheet":"Output","index":4,"n_rows":79,"n_cols":29,"rows_kept":79,"cut":false,"hidden":true,"merged":[]}
[null,{"$f":"VLOOKUP($J$2,Translation!$A$2:$BF$16,22,FALSE)","v":"hours/day"},{"$f":"VLOOKUP($J$2,Translation!$A$2:$BF$16,23,FALSE)","v":"days/week"},{"$f":"VLOOKUP($J$2,Translation!$A$2:$BF$16,24,FALSE)","v":"weeks/year"},{"$f":"VLOOKUP($J$2,Translation!$A$2:$BF$16,26,FALSE)","v":"cooling weeks"},{"$f":"VLOOKUP($J$2,Translation!$A$2:$BF$16,25,FALSE)","v":"heating weeks"},{"$f":"VLOOKUP($J$2,Translation!$A$2:$BF$16,27,FALSE)","v":"intermediate weeks"},{"$f":"VLOOKUP($J$2,Translation!$A$2:$BF$16,31,FALSE)","v":"£/kWh"},{"$f":"VLOOKUP($J$2,Translation!$A$2:$BF$16,15,FALSE)","v":"Carbon Equivalent"},"Language",{"$f":"VLOOKUP($J$2,Translation!$A$2:$BF$16,38,FALSE)","v":"Number of Outdoor Units"},{"$f":"VLOOKUP($J$2,Translation!$A$2:$BF$16,39,FALSE)","v":"Next"},{"$f":"VLOOKUP($J$2,Translation!$A$2:$BF$16,40,FALSE)","v":"Back"},{"$f":"VLOOKUP($J$2,Translation!$A$2:$BF$16,41,FALSE)","v":"Finish"},{"$f":"VLOOKUP($J$2,Translation!$A$2:$BF$16,42,FALSE)","v":"If you start a new selection you will lose all the data relative to the current project."},{"$f":"VLOOKUP($J$2,Translation!$A$2:$BF$16,43,FALSE)","v":"Back to the current"},{"$f":"VLOOKUP($J$2,Translation!$A$2:$BF$16,44,FALSE)","v":"Start a new selection"},{"$f":"VLOOKUP($J$2,Translation!$A$2:$BF$16,47,FALSE)","v":"Your current connection index is:"},{"$f":"VLOOKUP($J$2,Translation!$A$2:$BF$16,50,FALSE)","v":"You have to use all the available slots for the Outdoor Units. If you want to reduce the size of the project go back to the welcome screen."},{"$f":"VLOOKUP(J2,Translation!A2:$BF$16,51,FALSE)","v":"Save as PDF"},{"$f":"VLOOKUP(J2,Translation!A2:$BF$16,55,FALSE)","v":"The following results are based upon nominal conditions and are based on UK average conditions."},{"$f":"VLOOKUP(J2,Translation!A2:$BF$16,56,FALSE)","v":"Warning! The number of weeks selected is outside the maximum range!"},{"$f":"VLOOKUP(J2,Translation!A2:$BF$16,58,FALSE)","v":"Insert Project Reference / Customer Name"},{"$f":"VLOOKUP(J2,Translation!A2:$BG$16,59,FALSE)","v":"Select application:"},{"$f":"VLOOKUP(J2,Translation!A2:BL16,64,FALSE)","v":"Manual Setup"},null,null,null,"Heat Recovery VRV III"]
[null,{"$f":"B3","v":7},{"$f":"C3","v":5},51,14,15,22,0.11,0.52700000000000002,"English",null,null,null,null,null,null,null,null,null,null,null,null,null,null,null,null,null,null,"VRV IV with Variable Refrigerant Effect"]
["Manual Setup",7,5,51,14,15,{"$f":"D3-E3-F3","v":22},0.11,0.52700000000000002]
[null,"Number of Outdoor","English","Outdoor 1","Indoor Associated","Outdoor 2","Indoor Associated","Outdoor 3","Indoor Associated","Outdoor 4","Indoor Associated","Outdoor 5","Indoor Associated","Outdoor 6","Indoor Associated","Outdoor 7","Indoor Associated","Outdoor 8","Indoor Associated","Outdoor 9","Indoor Associated","Outdoor 10","Indoor Associated"]
[null,1,"Italiano","RSXY8K7","Ceiling Suspended","Select Outdoor Unit",null,"Select Outdoor Unit",null,"Select Outdoor Unit",null,"Select Outdoor Unit",null,"Select Outdoor Unit",null,"Select Outdoor Unit",null,"Select Outdoor Unit",null,"Select Outdoor Unit",null,"Select Outdoor Unit"]
[1,{"$f":"IF($D$5<>\"Select Outdoor Unit\",1,0)","v":1},"Español",63,"Ceiling Suspended"]
[2,{"$f":"IF($F$5<>\"Select Outdoor Unit\",1,0)","v":0},"Française",100,"Horizontal Ducted"]
[3,{"$f":"IF($H$5<>\"Select Outdoor Unit\",1,0)","v":0},"Deutsch",31.25,"Select To Remove Unit"]
[4,{"$f":"IF($J$5<>\"Select Outdoor Unit\",1,0)","v":0},"Lang6",0]
[5,{"$f":"IF($L$5<>\"Select Outdoor Unit\",1,0)","v":0},"Lang7"]
[6,{"$f":"IF($N$5<>\"Select Outdoor Unit\",1,0)","v":0},"Lang8"]
[7,{"$f":"IF($P$5<>\"Select Outdoor Unit\",1,0)","v":0},"Lang9"]
[8,{"$f":"IF($R$5<>\"Select Outdoor Unit\",1,0)","v":0},"Lang10"]
[9,{"$f":"IF($T$5<>\"Select Outdoor Unit\",1,0)","v":0},"Lang11"]
[10,{"$f":"IF($V$5<>\"Select Outdoor Unit\",1,0)","v":0},"Lang12"]
[null,{"$f":"B5-SUM(B6:B15)","v":0},"Lang13"]
["Lang.",null,"Lang14"]
[true,null,"Lang15"]
[]
["CO2 Equivalent"]
[0.52700000000000002]
[0.51700000000000002]
[0.53700000000000003]
[]
["Application","Custom Conditions","Office"]
[{"$f":"VLOOKUP($J$2,Translation!$A$2:$BK$16,60,FALSE)","v":"Meeting Room"},false]
[{"$f":"VLOOKUP($J$2,Translation!$A$2:$BK$16,61,FALSE)","v":"Office"}]
[{"$f":"VLOOKUP($J$2,Translation!$A$2:$BK$16,62,FALSE)","v":"Restaurant"}]
[{"$f":"VLOOKUP($J$2,Translation!$A$2:$BK$16,63,FALSE)","v":"Shop Floor"}]
[{"$f":"IF(OR(C25=Translation!BH2,C25=Translation!BH3,Translation!BH4,C25=Translation!BH5,C25=Translation!BH6),1,IF(OR(C25=Translation!BI2,C25=Translation!BI3,C25=Translation!BI4,C25=Translation!BI5,C25=Translation!BI6),2,IF(OR(C25=Translation!BJ2,C25=Translation!BJ3,C25=Translation!BJ4,C25=Translation!BJ5,C25=Translation!BJ6),3,IF(OR(C25=Translation!BK2,C25=Translation!BK3,C25=Translation!BK4,C25=Translation!BK5,C25=Translation!BK6),4,0))))","v":2}]
[]
["€"]
["£"]
["€"]
[]
[]
[]
[]
[]
[null,null,"Min index",{"$f":"IFERROR(VLOOKUP(D5,Database!$A$8:$AQ$53,42,FALSE),0)","v":100},null,{"$f":"IFERROR(VLOOKUP(F5,Database!$A$8:$AQ$53,42,FALSE),0)","v":0},null,{"$f":"IFERROR(VLOOKUP(H5,Database!$A$8:$AQ$53,42,FALSE),0)","v":0},null,{"$f":"IFERROR(VLOOKUP(J5,Database!$A$8:$AQ$53,42,FALSE),0)","v":0},null,{"$f":"IFERROR(VLOOKUP(L5,Database!$A$8:$AQ$53,42,FALSE),0)","v":0},null,{"$f":"IFERROR(VLOOKUP(N5,Database!$A$8:$AQ$53,42,FALSE),0)","v":0},null,{"$f":"IFERROR(VLOOKUP(P5,Database!$A$8:$AQ$53,42,FALSE),0)","v":0},null,{"$f":"IFERROR(VLOOKUP(R5,Database!$A$8:$AQ$53,42,FALSE),0)","v":0},null,{"$f":"IFERROR(VLOOKUP(T5,Database!$A$8:$AQ$53,42,FALSE),0)","v":0},null,{"$f":"IFERROR(VLOOKUP(V5,Database!$A$8:$AQ$53,42,FALSE),0)","v":0}]
[null,null,"Current index",{"$f":"SUM(D6:D37)","v":194.25},null,{"$f":"SUM(F6:F37)","v":0},null,0,null,0,null,0,null,0,null,0,null,0,null,0,null,0]
[null,null,"Max index",{"$f":"IFERROR(VLOOKUP(D5,Database!$A$8:$AQ$53,43,FALSE),0)","v":260},null,{"$f":"IFERROR(VLOOKUP(F5,Database!$A$8:$AQ$53,43,FALSE),0)","v":0},null,{"$f":"IFERROR(VLOOKUP(H5,Database!$A$8:$AQ$53,43,FALSE),0)","v":0},null,{"$f":"IFERROR(VLOOKUP(J5,Database!$A$8:$AQ$53,43,FALSE),0)","v":0},null,{"$f":"IFERROR(VLOOKUP(L5,Database!$A$8:$AQ$53,43,FALSE),0)","v":0},null,{"$f":"IFERROR(VLOOKUP(N5,Database!$A$8:$AQ$53,43,FALSE),0)","v":0},null,{"$f":"IFERROR(VLOOKUP(P5,Database!$A$8:$AQ$53,43,FALSE),0)","v":0},null,{"$f":"IFERROR(VLOOKUP(R5,Database!$A$8:$AQ$53,43,FALSE),0)","v":0},null,{"$f":"IFERROR(VLOOKUP(T5,Database!$A$8:$AQ$53,43,FALSE),0)","v":0},null,{"$f":"IFERROR(VLOOKUP(V5,Database!$A$8:$AQ$53,43,FALSE),0)","v":0}]
[null,null,"Index Warning",{"$f":"IF(D41<D40,CONCATENATE(VLOOKUP($J$2,Translation!$A$2:$BF$16,45,FALSE),\" (Min. Index = \",D40,\")\"),IF(D41>D42,CONCATENATE(VLOOKUP($J$2,Translation!$A$2:$BF$16,46,FALSE),\" (Max. Index = \",D42,\")\"),CONCATENATE(\"Capacity Index: \",D41)))","v":"Capacity Index: 194.25"},null,{"$f":"IF(F41<F40,CONCATENATE(VLOOKUP($J$2,Translation!$A$2:$BF$16,45,FALSE),\" (Min. Index = \",F40,\")\"),IF(F41>F42,CONCATENATE(VLOOKUP($J$2,Translation!$A$2:$BF$16,46,FALSE),\" (Max. Index = \",F42,\")\"),CONCATENATE(\"Capacity Index: \",F41)))","v":"Capacity Index: 0"},null,{"$f":"IF(H41<H40,CONCATENATE(VLOOKUP($J$2,Translation!$A$2:$BF$16,45,FALSE),\" (Min. Index = \",H40,\")\"),IF(H41>H42,CONCATENATE(VLOOKUP($J$2,Translation!$A$2:$BF$16,46,FALSE),\" (Max. Index = \",H42,\")\"),CONCATENATE(\"Capacity Index: \",H41)))","v":"Capacity Index: 0"},null,{"$f":"IF(J41<J40,CONCATENATE(VLOOKUP($J$2,Translation!$A$2:$BF$16,45,FALSE),\" (Min. Index = \",J40,\")\"),IF(J41>J42,CONCATENATE(VLOOKUP($J$2,Translation!$A$2:$BF$16,46,FALSE),\" (Max. Index = \",J42,\")\"),CONCATENATE(\"Capacity Index: \",J41)))","v":"Capacity Index: 0"},null,{"$f":"IF(L41<L40,CONCATENATE(VLOOKUP($J$2,Translation!$A$2:$BF$16,45,FALSE),\" (Min. Index = \",L40,\")\"),IF(L41>L42,CONCATENATE(VLOOKUP($J$2,Translation!$A$2:$BF$16,46,FALSE),\" (Max. Index = \",L42,\")\"),CONCATENATE(\"Capacity Index: \",L41)))","v":"Capacity Index: 0"},null,{"$f":"IF(N41<N40,CONCATENATE(VLOOKUP($J$2,Translation!$A$2:$BF$16,45,FALSE),\" (Min. Index = \",N40,\")\"),IF(N41>N42,CONCATENATE(VLOOKUP($J$2,Translation!$A$2:$BF$16,46,FALSE),\" (Max. Index = \",N42,\")\"),CONCATENATE(\"Capacity Index: \",N41)))","v":"Capacity Index: 0"},null,{"$f":"IF(P41<P40,CONCATENATE(VLOOKUP($J$2,Translation!$A$2:$BF$16,45,FALSE),\" (Min. Index = \",P40,\")\"),IF(P41>P42,CONCATENATE(VLOOKUP($J$2,Translation!$A$2:$BF$16,46,FALSE),\" (Max. Index = \",P42,\")\"),CONCATENATE(\"Capacity Index: \",P41)))","v":"Capacity Index: 0"},null,{"$f":"IF(R41<R40,CONCATENATE(VLOOKUP($J$2,Translation!$A$2:$BF$16,45,FALSE),\" (Min. Index = \",R40,\")\"),IF(R41>R42,CONCATENATE(VLOOKUP($J$2,Translation!$A$2:$BF$16,46,FALSE),\" (Max. Index = \",R42,\")\"),CONCATENATE(\"Capacity Index: \",R41)))","v":"Capacity Index: 0"},null,{"$f":"IF(T41<T40,CONCATENATE(VLOOKUP($J$2,Translation!$A$2:$BF$16,45,FALSE),\" (Min. Index = \",T40,\")\"),IF(T41>T42,CONCATENATE(VLOOKUP($J$2,Translation!$A$2:$BF$16,46,FALSE),\" (Max. Index = \",T42,\")\"),CONCATENATE(\"Capacity Index: \",T41)))","v":"Capacity Index: 0"},null,{"$f":"IF(V41<V40,CONCATENATE(VLOOKUP($J$2,Translation!$A$2:$BF$16,45,FALSE),\" (Min. Index = \",V40,\")\"),IF(V41>V42,CONCATENATE(VLOOKUP($J$2,Translation!$A$2:$BF$16,46,FALSE),\" (Max. Index = \",V42,\")\"),CONCATENATE(\"Capacity Index: \",V41)))","v":"Capacity Index: 0"}]
[null,null,"Max Indoor",{"$f":"IFERROR(VLOOKUP(D5,Database!$A$8:$AR$53,44,FALSE),0)","v":13},null,{"$f":"IFERROR(VLOOKUP(F5,Database!$A$8:$AR$53,44,FALSE),0)","v":0},null,{"$f":"IFERROR(VLOOKUP(H5,Database!$A$8:$AR$53,44,FALSE),0)","v":0},null,{"$f":"IFERROR(VLOOKUP(J5,Database!$A$8:$AR$53,44,FALSE),0)","v":0},null,{"$f":"IFERROR(VLOOKUP(L5,Database!$A$8:$AR$53,44,FALSE),0)","v":0},null,{"$f":"IFERROR(VLOOKUP(N5,Database!$A$8:$AR$53,44,FALSE),0)","v":0},null,{"$f":"IFERROR(VLOOKUP(P5,Database!$A$8:$AR$53,44,FALSE),0)","v":0},null,{"$f":"IFERROR(VLOOKUP(R5,Database!$A$8:$AR$53,44,FALSE),0)","v":0},null,{"$f":"IFERROR(VLOOKUP(T5,Database!$A$8:$AR$53,44,FALSE),0)","v":0},null,{"$f":"IFERROR(VLOOKUP(V5,Database!$A$8:$AR$53,44,FALSE),0)","v":0}]
[null,null,"Actual Indoor",{"$f":"COUNTA(E5:E36)-COUNTIF(E5:E36,Lists!$F$2)","v":3},null,{"$f":"COUNTA(G5:G36)-COUNTIF(G5:G36,Lists!$F$2)","v":0},null,{"$f":"COUNTA(I5:I36)-COUNTIF(I5:I36,Lists!$F$2)","v":0},null,{"$f":"COUNTA(K5:K36)-COUNTIF(K5:K36,Lists!$F$2)","v":0},null,{"$f":"COUNTA(M5:M36)-COUNTIF(M5:M36,Lists!$F$2)","v":0},null,{"$f":"COUNTA(O5:O36)-COUNTIF(O5:O36,Lists!$F$2)","v":0},null,{"$f":"COUNTA(Q5:Q36)-COUNTIF(Q5:Q36,Lists!$F$2)","v":0},null,{"$f":"COUNTA(S5:S36)-COUNTIF(S5:S36,Lists!$F$2)","v":0},null,{"$f":"COUNTA(U5:U36)-COUNTIF(U5:U36,Lists!$F$2)","v":0},null,{"$f":"COUNTA(W5:W36)-COUNTIF(W5:W36,Lists!$F$2)","v":0}]
[null,null,null,{"$f":"CONCATENATE($C$40,\"= \",D40,\" - \",$C$42,\"= \",D42)","v":"Min index= 100 - Max index= 260"},null,{"$f":"CONCATENATE($C$40,\"= \",F40,\" - \",$C$42,\"= \",F42)","v":"Min index= 0 - Max index= 0"},null,"Min index= 0 - Max index= 0",null,"Min index= 0 - Max index= 0",null,"Min index= 0 - Max index= 0",null,"Min index= 0 - Max index= 0",null,"Min index= 0 - Max index= 0",null,"Min index= 0 - Max index= 0",null,"Min index= 0 - Max index= 0",null,"Min index= 0 - Max index= 0"]
[]
[null,null,null,null,{"$f":"IF(E5=Lists!$F$3,1,IF(E5=Lists!$F$5,2,IF(E5=Lists!$F$4,3,IF(E5=Lists!$F$6,4,IF(E5=Lists!$F$7,5,IF(E5=Lists!$F$8,6,0))))))","v":2},null,{"$f":"IF(G5=Lists!$F$3,1,IF(G5=Lists!$F$5,2,IF(G5=Lists!$F$4,3,IF(G5=Lists!$F$6,4,IF(G5=Lists!$F$7,5,IF(G5=Lists!$F$8,6,0))))))","v":0},null,{"$f":"IF(I5=Lists!$F$3,1,IF(I5=Lists!$F$5,2,IF(I5=Lists!$F$4,3,IF(I5=Lists!$F$6,4,IF(I5=Lists!$F$7,5,IF(I5=Lists!$F$8,6,0))))))","v":0},null,{"$f":"IF(K5=Lists!$F$3,1,IF(K5=Lists!$F$5,2,IF(K5=Lists!$F$4,3,IF(K5=Lists!$F$6,4,IF(K5=Lists!$F$7,5,IF(K5=Lists!$F$8,6,0))))))","v":0},null,{"$f":"IF(M5=Lists!$F$3,1,IF(M5=Lists!$F$5,2,IF(M5=Lists!$F$4,3,IF(M5=Lists!$F$6,4,IF(M5=Lists!$F$7,5,IF(M5=Lists!$F$8,6,0))))))","v":0},null,{"$f":"IF(O5=Lists!$F$3,1,IF(O5=Lists!$F$5,2,IF(O5=Lists!$F$4,3,IF(O5=Lists!$F$6,4,IF(O5=Lists!$F$7,5,IF(O5=Lists!$F$8,6,0))))))","v":0},null,{"$f":"IF(Q5=Lists!$F$3,1,IF(Q5=Lists!$F$5,2,IF(Q5=Lists!$F$4,3,IF(Q5=Lists!$F$6,4,IF(Q5=Lists!$F$7,5,IF(Q5=Lists!$F$8,6,0))))))","v":0},null,{"$f":"IF(S5=Lists!$F$3,1,IF(S5=Lists!$F$5,2,IF(S5=Lists!$F$4,3,IF(S5=Lists!$F$6,4,IF(S5=Lists!$F$7,5,IF(S5=Lists!$F$8,6,0))))))","v":0},null,{"$f":"IF(U5=Lists!$F$3,1,IF(U5=Lists!$F$5,2,IF(U5=Lists!$F$4,3,IF(U5=Lists!$F$6,4,IF(U5=Lists!$F$7,5,IF(U5=Lists!$F$8,6,0))))))","v":0},null,{"$f":"IF(W5=Lists!$F$3,1,IF(W5=Lists!$F$5,2,IF(W5=Lists!$F$4,3,IF(W5=Lists!$F$6,4,IF(W5=Lists!$F$7,5,IF(W5=Lists!$F$8,6,0))))))","v":0}]
[null,null,null,null,{"$f":"IF(E6=Lists!$F$3,1,IF(E6=Lists!$F$5,2,IF(E6=Lists!$F$4,3,IF(E6=Lists!$F$6,4,IF(E6=Lists!$F$7,5,IF(E6=Lists!$F$8,6,0))))))","v":2},null,{"$f":"IF(G6=Lists!$F$3,1,IF(G6=Lists!$F$5,2,IF(G6=Lists!$F$4,3,IF(G6=Lists!$F$6,4,IF(G6=Lists!$F$7,5,IF(G6=Lists!$F$8,6,0))))))","v":0},null,{"$f":"IF(I6=Lists!$F$3,1,IF(I6=Lists!$F$5,2,IF(I6=Lists!$F$4,3,IF(I6=Lists!$F$6,4,IF(I6=Lists!$F$7,5,IF(I6=Lists!$F$8,6,0))))))","v":0},null,{"$f":"IF(K6=Lists!$F$3,1,IF(K6=Lists!$F$5,2,IF(K6=Lists!$F$4,3,IF(K6=Lists!$F$6,4,IF(K6=Lists!$F$7,5,IF(K6=Lists!$F$8,6,0))))))","v":0},null,{"$f":"IF(M6=Lists!$F$3,1,IF(M6=Lists!$F$5,2,IF(M6=Lists!$F$4,3,IF(M6=Lists!$F$6,4,IF(M6=Lists!$F$7,5,IF(M6=Lists!$F$8,6,0))))))","v":0},null,{"$f":"IF(O6=Lists!$F$3,1,IF(O6=Lists!$F$5,2,IF(O6=Lists!$F$4,3,IF(O6=Lists!$F$6,4,IF(O6=Lists!$F$7,5,IF(O6=Lists!$F$8,6,0))))))","v":0},null,{"$f":"IF(Q6=Lists!$F$3,1,IF(Q6=Lists!$F$5,2,IF(Q6=Lists!$F$4,3,IF(Q6=Lists!$F$6,4,IF(Q6=Lists!$F$7,5,IF(Q6=Lists!$F$8,6,0))))))","v":0},null,{"$f":"IF(S6=Lists!$F$3,1,IF(S6=Lists!$F$5,2,IF(S6=Lists!$F$4,3,IF(S6=Lists!$F$6,4,IF(S6=Lists!$F$7,5,IF(S6=Lists!$F$8,6,0))))))","v":0},null,{"$f":"IF(U6=Lists!$F$3,1,IF(U6=Lists!$F$5,2,IF(U6=Lists!$F$4,3,IF(U6=Lists!$F$6,4,IF(U6=Lists!$F$7,5,IF(U6=Lists!$F$8,6,0))))))","v":0},null,{"$f":"IF(W6=Lists!$F$3,1,IF(W6=Lists!$F$5,2,IF(W6=Lists!$F$4,3,IF(W6=Lists!$F$6,4,IF(W6=Lists!$F$7,5,IF(W6=Lists!$F$8,6,0))))))","v":0}]
[null,null,null,null,{"$f":"IF(E7=Lists!$F$3,1,IF(E7=Lists!$F$5,2,IF(E7=Lists!$F$4,3,IF(E7=Lists!$F$6,4,IF(E7=Lists!$F$7,5,IF(E7=Lists!$F$8,6,0))))))","v":3},null,{"$f":"IF(G7=Lists!$F$3,1,IF(G7=Lists!$F$5,2,IF(G7=Lists!$F$4,3,IF(G7=Lists!$F$6,4,IF(G7=Lists!$F$7,5,IF(G7=Lists!$F$8,6,0))))))","v":0},null,{"$f":"IF(I7=Lists!$F$3,1,IF(I7=Lists!$F$5,2,IF(I7=Lists!$F$4,3,IF(I7=Lists!$F$6,4,IF(I7=Lists!$F$7,5,IF(I7=Lists!$F$8,6,0))))))","v":0},null,{"$f":"IF(K7=Lists!$F$3,1,IF(K7=Lists!$F$5,2,IF(K7=Lists!$F$4,3,IF(K7=Lists!$F$6,4,IF(K7=Lists!$F$7,5,IF(K7=Lists!$F$8,6,0))))))","v":0},null,{"$f":"IF(M7=Lists!$F$3,1,IF(M7=Lists!$F$5,2,IF(M7=Lists!$F$4,3,IF(M7=Lists!$F$6,4,IF(M7=Lists!$F$7,5,IF(M7=Lists!$F$8,6,0))))))","v":0},null,{"$f":"IF(O7=Lists!$F$3,1,IF(O7=Lists!$F$5,2,IF(O7=Lists!$F$4,3,IF(O7=Lists!$F$6,4,IF(O7=Lists!$F$7,5,IF(O7=Lists!$F$8,6,0))))))","v":0},null,{"$f":"IF(Q7=Lists!$F$3,1,IF(Q7=Lists!$F$5,2,IF(Q7=Lists!$F$4,3,IF(Q7=Lists!$F$6,4,IF(Q7=Lists!$F$7,5,IF(Q7=Lists!$F$8,6,0))))))","v":0},null,{"$f":"IF(S7=Lists!$F$3,1,IF(S7=Lists!$F$5,2,IF(S7=Lists!$F$4,3,IF(S7=Lists!$F$6,4,IF(S7=Lists!$F$7,5,IF(S7=Lists!$F$8,6,0))))))","v":0},null,{"$f":"IF(U7=Lists!$F$3,1,IF(U7=Lists!$F$5,2,IF(U7=Lists!$F$4,3,IF(U7=Lists!$F$6,4,IF(U7=Lists!$F$7,5,IF(U7=Lists!$F$8,6,0))))))","v":0},null,{"$f":"IF(W7=Lists!$F$3,1,IF(W7=Lists!$F$5,2,IF(W7=Lists!$F$4,3,IF(W7=Lists!$F$6,4,IF(W7=Lists!$F$7,5,IF(W7=Lists!$F$8,6,0))))))","v":0}]
[null,null,null,null,{"$f":"IF(E8=Lists!$F$3,1,IF(E8=Lists!$F$5,2,IF(E8=Lists!$F$4,3,IF(E8=Lists!$F$6,4,IF(E8=Lists!$F$7,5,IF(E8=Lists!$F$8,6,0))))))","v":0},null,{"$f":"IF(G8=Lists!$F$3,1,IF(G8=Lists!$F$5,2,IF(G8=Lists!$F$4,3,IF(G8=Lists!$F$6,4,IF(G8=Lists!$F$7,5,IF(G8=Lists!$F$8,6,0))))))","v":0},null,{"$f":"IF(I8=Lists!$F$3,1,IF(I8=Lists!$F$5,2,IF(I8=Lists!$F$4,3,IF(I8=Lists!$F$6,4,IF(I8=Lists!$F$7,5,IF(I8=Lists!$F$8,6,0))))))","v":0},null,{"$f":"IF(K8=Lists!$F$3,1,IF(K8=Lists!$F$5,2,IF(K8=Lists!$F$4,3,IF(K8=Lists!$F$6,4,IF(K8=Lists!$F$7,5,IF(K8=Lists!$F$8,6,0))))))","v":0},null,{"$f":"IF(M8=Lists!$F$3,1,IF(M8=Lists!$F$5,2,IF(M8=Lists!$F$4,3,IF(M8=Lists!$F$6,4,IF(M8=Lists!$F$7,5,IF(M8=Lists!$F$8,6,0))))))","v":0},null,{"$f":"IF(O8=Lists!$F$3,1,IF(O8=Lists!$F$5,2,IF(O8=Lists!$F$4,3,IF(O8=Lists!$F$6,4,IF(O8=Lists!$F$7,5,IF(O8=Lists!$F$8,6,0))))))","v":0},null,{"$f":"IF(Q8=Lists!$F$3,1,IF(Q8=Lists!$F$5,2,IF(Q8=Lists!$F$4,3,IF(Q8=Lists!$F$6,4,IF(Q8=Lists!$F$7,5,IF(Q8=Lists!$F$8,6,0))))))","v":0},null,{"$f":"IF(S8=Lists!$F$3,1,IF(S8=Lists!$F$5,2,IF(S8=Lists!$F$4,3,IF(S8=Lists!$F$6,4,IF(S8=Lists!$F$7,5,IF(S8=Lists!$F$8,6,0))))))","v":0},null,{"$f":"IF(U8=Lists!$F$3,1,IF(U8=Lists!$F$5,2,IF(U8=Lists!$F$4,3,IF(U8=Lists!$F$6,4,IF(U8=Lists!$F$7,5,IF(U8=Lists!$F$8,6,0))))))","v":0},null,{"$f":"IF(W8=Lists!$F$3,1,IF(W8=Lists!$F$5,2,IF(W8=Lists!$F$4,3,IF(W8=Lists!$F$6,4,IF(W8=Lists!$F$7,5,IF(W8=Lists!$F$8,6,0))))))","v":0}]
[null,null,null,null,{"$f":"IF(E9=Lists!$F$3,1,IF(E9=Lists!$F$5,2,IF(E9=Lists!$F$4,3,IF(E9=Lists!$F$6,4,IF(E9=Lists!$F$7,5,IF(E9=Lists!$F$8,6,0))))))","v":0},null,{"$f":"IF(G9=Lists!$F$3,1,IF(G9=Lists!$F$5,2,IF(G9=Lists!$F$4,3,IF(G9=Lists!$F$6,4,IF(G9=Lists!$F$7,5,IF(G9=Lists!$F$8,6,0))))))","v":0},null,{"$f":"IF(I9=Lists!$F$3,1,IF(I9=Lists!$F$5,2,IF(I9=Lists!$F$4,3,IF(I9=Lists!$F$6,4,IF(I9=Lists!$F$7,5,IF(I9=Lists!$F$8,6,0))))))","v":0},null,{"$f":"IF(K9=Lists!$F$3,1,IF(K9=Lists!$F$5,2,IF(K9=Lists!$F$4,3,IF(K9=Lists!$F$6,4,IF(K9=Lists!$F$7,5,IF(K9=Lists!$F$8,6,0))))))","v":0},null,{"$f":"IF(M9=Lists!$F$3,1,IF(M9=Lists!$F$5,2,IF(M9=Lists!$F$4,3,IF(M9=Lists!$F$6,4,IF(M9=Lists!$F$7,5,IF(M9=Lists!$F$8,6,0))))))","v":0},null,{"$f":"IF(O9=Lists!$F$3,1,IF(O9=Lists!$F$5,2,IF(O9=Lists!$F$4,3,IF(O9=Lists!$F$6,4,IF(O9=Lists!$F$7,5,IF(O9=Lists!$F$8,6,0))))))","v":0},null,{"$f":"IF(Q9=Lists!$F$3,1,IF(Q9=Lists!$F$5,2,IF(Q9=Lists!$F$4,3,IF(Q9=Lists!$F$6,4,IF(Q9=Lists!$F$7,5,IF(Q9=Lists!$F$8,6,0))))))","v":0},null,{"$f":"IF(S9=Lists!$F$3,1,IF(S9=Lists!$F$5,2,IF(S9=Lists!$F$4,3,IF(S9=Lists!$F$6,4,IF(S9=Lists!$F$7,5,IF(S9=Lists!$F$8,6,0))))))","v":0},null,{"$f":"IF(U9=Lists!$F$3,1,IF(U9=Lists!$F$5,2,IF(U9=Lists!$F$4,3,IF(U9=Lists!$F$6,4,IF(U9=Lists!$F$7,5,IF(U9=Lists!$F$8,6,0))))))","v":0},null,{"$f":"IF(W9=Lists!$F$3,1,IF(W9=Lists!$F$5,2,IF(W9=Lists!$F$4,3,IF(W9=Lists!$F$6,4,IF(W9=Lists!$F$7,5,IF(W9=Lists!$F$8,6,0))))))","v":0}]
[null,null,null,null,{"$f":"IF(E10=Lists!$F$3,1,IF(E10=Lists!$F$5,2,IF(E10=Lists!$F$4,3,IF(E10=Lists!$F$6,4,IF(E10=Lists!$F$7,5,IF(E10=Lists!$F$8,6,0))))))","v":0},null,{"$f":"IF(G10=Lists!$F$3,1,IF(G10=Lists!$F$5,2,IF(G10=Lists!$F$4,3,IF(G10=Lists!$F$6,4,IF(G10=Lists!$F$7,5,IF(G10=Lists!$F$8,6,0))))))","v":0},null,{"$f":"IF(I10=Lists!$F$3,1,IF(I10=Lists!$F$5,2,IF(I10=Lists!$F$4,3,IF(I10=Lists!$F$6,4,IF(I10=Lists!$F$7,5,IF(I10=Lists!$F$8,6,0))))))","v":0},null,{"$f":"IF(K10=Lists!$F$3,1,IF(K10=Lists!$F$5,2,IF(K10=Lists!$F$4,3,IF(K10=Lists!$F$6,4,IF(K10=Lists!$F$7,5,IF(K10=Lists!$F$8,6,0))))))","v":0},null,{"$f":"IF(M10=Lists!$F$3,1,IF(M10=Lists!$F$5,2,IF(M10=Lists!$F$4,3,IF(M10=Lists!$F$6,4,IF(M10=Lists!$F$7,5,IF(M10=Lists!$F$8,6,0))))))","v":0},null,{"$f":"IF(O10=Lists!$F$3,1,IF(O10=Lists!$F$5,2,IF(O10=Lists!$F$4,3,IF(O10=Lists!$F$6,4,IF(O10=Lists!$F$7,5,IF(O10=Lists!$F$8,6,0))))))","v":0},null,{"$f":"IF(Q10=Lists!$F$3,1,IF(Q10=Lists!$F$5,2,IF(Q10=Lists!$F$4,3,IF(Q10=Lists!$F$6,4,IF(Q10=Lists!$F$7,5,IF(Q10=Lists!$F$8,6,0))))))","v":0},null,{"$f":"IF(S10=Lists!$F$3,1,IF(S10=Lists!$F$5,2,IF(S10=Lists!$F$4,3,IF(S10=Lists!$F$6,4,IF(S10=Lists!$F$7,5,IF(S10=Lists!$F$8,6,0))))))","v":0},null,{"$f":"IF(U10=Lists!$F$3,1,IF(U10=Lists!$F$5,2,IF(U10=Lists!$F$4,3,IF(U10=Lists!$F$6,4,IF(U10=Lists!$F$7,5,IF(U10=Lists!$F$8,6,0))))))","v":0},null,{"$f":"IF(W10=Lists!$F$3,1,IF(W10=Lists!$F$5,2,IF(W10=Lists!$F$4,3,IF(W10=Lists!$F$6,4,IF(W10=Lists!$F$7,5,IF(W10=Lists!$F$8,6,0))))))","v":0}]
[null,null,null,null,{"$f":"IF(E11=Lists!$F$3,1,IF(E11=Lists!$F$5,2,IF(E11=Lists!$F$4,3,IF(E11=Lists!$F$6,4,IF(E11=Lists!$F$7,5,IF(E11=Lists!$F$8,6,0))))))","v":0},null,{"$f":"IF(G11=Lists!$F$3,1,IF(G11=Lists!$F$5,2,IF(G11=Lists!$F$4,3,IF(G11=Lists!$F$6,4,IF(G11=Lists!$F$7,5,IF(G11=Lists!$F$8,6,0))))))","v":0},null,{"$f":"IF(I11=Lists!$F$3,1,IF(I11=Lists!$F$5,2,IF(I11=Lists!$F$4,3,IF(I11=Lists!$F$6,4,IF(I11=Lists!$F$7,5,IF(I11=Lists!$F$8,6,0))))))","v":0},null,{"$f":"IF(K11=Lists!$F$3,1,IF(K11=Lists!$F$5,2,IF(K11=Lists!$F$4,3,IF(K11=Lists!$F$6,4,IF(K11=Lists!$F$7,5,IF(K11=Lists!$F$8,6,0))))))","v":0},null,{"$f":"IF(M11=Lists!$F$3,1,IF(M11=Lists!$F$5,2,IF(M11=Lists!$F$4,3,IF(M11=Lists!$F$6,4,IF(M11=Lists!$F$7,5,IF(M11=Lists!$F$8,6,0))))))","v":0},null,{"$f":"IF(O11=Lists!$F$3,1,IF(O11=Lists!$F$5,2,IF(O11=Lists!$F$4,3,IF(O11=Lists!$F$6,4,IF(O11=Lists!$F$7,5,IF(O11=Lists!$F$8,6,0))))))","v":0},null,{"$f":"IF(Q11=Lists!$F$3,1,IF(Q11=Lists!$F$5,2,IF(Q11=Lists!$F$4,3,IF(Q11=Lists!$F$6,4,IF(Q11=Lists!$F$7,5,IF(Q11=Lists!$F$8,6,0))))))","v":0},null,{"$f":"IF(S11=Lists!$F$3,1,IF(S11=Lists!$F$5,2,IF(S11=Lists!$F$4,3,IF(S11=Lists!$F$6,4,IF(S11=Lists!$F$7,5,IF(S11=Lists!$F$8,6,0))))))","v":0},null,{"$f":"IF(U11=Lists!$F$3,1,IF(U11=Lists!$F$5,2,IF(U11=Lists!$F$4,3,IF(U11=Lists!$F$6,4,IF(U11=Lists!$F$7,5,IF(U11=Lists!$F$8,6,0))))))","v":0},null,{"$f":"IF(W11=Lists!$F$3,1,IF(W11=Lists!$F$5,2,IF(W11=Lists!$F$4,3,IF(W11=Lists!$F$6,4,IF(W11=Lists!$F$7,5,IF(W11=Lists!$F$8,6,0))))))","v":0}]
[null,null,null,null,{"$f":"IF(E12=Lists!$F$3,1,IF(E12=Lists!$F$5,2,IF(E12=Lists!$F$4,3,IF(E12=Lists!$F$6,4,IF(E12=Lists!$F$7,5,IF(E12=Lists!$F$8,6,0))))))","v":0},null,{"$f":"IF(G12=Lists!$F$3,1,IF(G12=Lists!$F$5,2,IF(G12=Lists!$F$4,3,IF(G12=Lists!$F$6,4,IF(G12=Lists!$F$7,5,IF(G12=Lists!$F$8,6,0))))))","v":0},null,{"$f":"IF(I12=Lists!$F$3,1,IF(I12=Lists!$F$5,2,IF(I12=Lists!$F$4,3,IF(I12=Lists!$F$6,4,IF(I12=Lists!$F$7,5,IF(I12=Lists!$F$8,6,0))))))","v":0},null,{"$f":"IF(K12=Lists!$F$3,1,IF(K12=Lists!$F$5,2,IF(K12=Lists!$F$4,3,IF(K12=Lists!$F$6,4,IF(K12=Lists!$F$7,5,IF(K12=Lists!$F$8,6,0))))))","v":0},null,{"$f":"IF(M12=Lists!$F$3,1,IF(M12=Lists!$F$5,2,IF(M12=Lists!$F$4,3,IF(M12=Lists!$F$6,4,IF(M12=Lists!$F$7,5,IF(M12=Lists!$F$8,6,0))))))","v":0},null,{"$f":"IF(O12=Lists!$F$3,1,IF(O12=Lists!$F$5,2,IF(O12=Lists!$F$4,3,IF(O12=Lists!$F$6,4,IF(O12=Lists!$F$7,5,IF(O12=Lists!$F$8,6,0))))))","v":0},null,{"$f":"IF(Q12=Lists!$F$3,1,IF(Q12=Lists!$F$5,2,IF(Q12=Lists!$F$4,3,IF(Q12=Lists!$F$6,4,IF(Q12=Lists!$F$7,5,IF(Q12=Lists!$F$8,6,0))))))","v":0},null,{"$f":"IF(S12=Lists!$F$3,1,IF(S12=Lists!$F$5,2,IF(S12=Lists!$F$4,3,IF(S12=Lists!$F$6,4,IF(S12=Lists!$F$7,5,IF(S12=Lists!$F$8,6,0))))))","v":0},null,{"$f":"IF(U12=Lists!$F$3,1,IF(U12=Lists!$F$5,2,IF(U12=Lists!$F$4,3,IF(U12=Lists!$F$6,4,IF(U12=Lists!$F$7,5,IF(U12=Lists!$F$8,6,0))))))","v":0},null,{"$f":"IF(W12=Lists!$F$3,1,IF(W12=Lists!$F$5,2,IF(W12=Lists!$F$4,3,IF(W12=Lists!$F$6,4,IF(W12=Lists!$F$7,5,IF(W12=Lists!$F$8,6,0))))))","v":0}]
[null,null,null,null,{"$f":"IF(E13=Lists!$F$3,1,IF(E13=Lists!$F$5,2,IF(E13=Lists!$F$4,3,IF(E13=Lists!$F$6,4,IF(E13=Lists!$F$7,5,IF(E13=Lists!$F$8,6,0))))))","v":0},null,{"$f":"IF(G13=Lists!$F$3,1,IF(G13=Lists!$F$5,2,IF(G13=Lists!$F$4,3,IF(G13=Lists!$F$6,4,IF(G13=Lists!$F$7,5,IF(G13=Lists!$F$8,6,0))))))","v":0},null,{"$f":"IF(I13=Lists!$F$3,1,IF(I13=Lists!$F$5,2,IF(I13=Lists!$F$4,3,IF(I13=Lists!$F$6,4,IF(I13=Lists!$F$7,5,IF(I13=Lists!$F$8,6,0))))))","v":0},null,{"$f":"IF(K13=Lists!$F$3,1,IF(K13=Lists!$F$5,2,IF(K13=Lists!$F$4,3,IF(K13=Lists!$F$6,4,IF(K13=Lists!$F$7,5,IF(K13=Lists!$F$8,6,0))))))","v":0},null,{"$f":"IF(M13=Lists!$F$3,1,IF(M13=Lists!$F$5,2,IF(M13=Lists!$F$4,3,IF(M13=Lists!$F$6,4,IF(M13=Lists!$F$7,5,IF(M13=Lists!$F$8,6,0))))))","v":0},null,{"$f":"IF(O13=Lists!$F$3,1,IF(O13=Lists!$F$5,2,IF(O13=Lists!$F$4,3,IF(O13=Lists!$F$6,4,IF(O13=Lists!$F$7,5,IF(O13=Lists!$F$8,6,0))))))","v":0},null,{"$f":"IF(Q13=Lists!$F$3,1,IF(Q13=Lists!$F$5,2,IF(Q13=Lists!$F$4,3,IF(Q13=Lists!$F$6,4,IF(Q13=Lists!$F$7,5,IF(Q13=Lists!$F$8,6,0))))))","v":0},null,{"$f":"IF(S13=Lists!$F$3,1,IF(S13=Lists!$F$5,2,IF(S13=Lists!$F$4,3,IF(S13=Lists!$F$6,4,IF(S13=Lists!$F$7,5,IF(S13=Lists!$F$8,6,0))))))","v":0},null,{"$f":"IF(U13=Lists!$F$3,1,IF(U13=Lists!$F$5,2,IF(U13=Lists!$F$4,3,IF(U13=Lists!$F$6,4,IF(U13=Lists!$F$7,5,IF(U13=Lists!$F$8,6,0))))))","v":0},null,{"$f":"IF(W13=Lists!$F$3,1,IF(W13=Lists!$F$5,2,IF(W13=Lists!$F$4,3,IF(W13=Lists!$F$6,4,IF(W13=Lists!$F$7,5,IF(W13=Lists!$F$8,6,0))))))","v":0}]
[null,null,null,null,{"$f":"IF(E14=Lists!$F$3,1,IF(E14=Lists!$F$5,2,IF(E14=Lists!$F$4,3,IF(E14=Lists!$F$6,4,IF(E14=Lists!$F$7,5,IF(E14=Lists!$F$8,6,0))))))","v":0},null,{"$f":"IF(G14=Lists!$F$3,1,IF(G14=Lists!$F$5,2,IF(G14=Lists!$F$4,3,IF(G14=Lists!$F$6,4,IF(G14=Lists!$F$7,5,IF(G14=Lists!$F$8,6,0))))))","v":0},null,{"$f":"IF(I14=Lists!$F$3,1,IF(I14=Lists!$F$5,2,IF(I14=Lists!$F$4,3,IF(I14=Lists!$F$6,4,IF(I14=Lists!$F$7,5,IF(I14=Lists!$F$8,6,0))))))","v":0},null,{"$f":"IF(K14=Lists!$F$3,1,IF(K14=Lists!$F$5,2,IF(K14=Lists!$F$4,3,IF(K14=Lists!$F$6,4,IF(K14=Lists!$F$7,5,IF(K14=Lists!$F$8,6,0))))))","v":0},null,{"$f":"IF(M14=Lists!$F$3,1,IF(M14=Lists!$F$5,2,IF(M14=Lists!$F$4,3,IF(M14=Lists!$F$6,4,IF(M14=Lists!$F$7,5,IF(M14=Lists!$F$8,6,0))))))","v":0},null,{"$f":"IF(O14=Lists!$F$3,1,IF(O14=Lists!$F$5,2,IF(O14=Lists!$F$4,3,IF(O14=Lists!$F$6,4,IF(O14=Lists!$F$7,5,IF(O14=Lists!$F$8,6,0))))))","v":0},null,{"$f":"IF(Q14=Lists!$F$3,1,IF(Q14=Lists!$F$5,2,IF(Q14=Lists!$F$4,3,IF(Q14=Lists!$F$6,4,IF(Q14=Lists!$F$7,5,IF(Q14=Lists!$F$8,6,0))))))","v":0},null,{"$f":"IF(S14=Lists!$F$3,1,IF(S14=Lists!$F$5,2,IF(S14=Lists!$F$4,3,IF(S14=Lists!$F$6,4,IF(S14=Lists!$F$7,5,IF(S14=Lists!$F$8,6,0))))))","v":0},null,{"$f":"IF(U14=Lists!$F$3,1,IF(U14=Lists!$F$5,2,IF(U14=Lists!$F$4,3,IF(U14=Lists!$F$6,4,IF(U14=Lists!$F$7,5,IF(U14=Lists!$F$8,6,0))))))","v":0},null,{"$f":"IF(W14=Lists!$F$3,1,IF(W14=Lists!$F$5,2,IF(W14=Lists!$F$4,3,IF(W14=Lists!$F$6,4,IF(W14=Lists!$F$7,5,IF(W14=Lists!$F$8,6,0))))))","v":0}]
[null,null,null,null,{"$f":"IF(E15=Lists!$F$3,1,IF(E15=Lists!$F$5,2,IF(E15=Lists!$F$4,3,IF(E15=Lists!$F$6,4,IF(E15=Lists!$F$7,5,IF(E15=Lists!$F$8,6,0))))))","v":0},null,{"$f":"IF(G15=Lists!$F$3,1,IF(G15=Lists!$F$5,2,IF(G15=Lists!$F$4,3,IF(G15=Lists!$F$6,4,IF(G15=Lists!$F$7,5,IF(G15=Lists!$F$8,6,0))))))","v":0},null,{"$f":"IF(I15=Lists!$F$3,1,IF(I15=Lists!$F$5,2,IF(I15=Lists!$F$4,3,IF(I15=Lists!$F$6,4,IF(I15=Lists!$F$7,5,IF(I15=Lists!$F$8,6,0))))))","v":0},null,{"$f":"IF(K15=Lists!$F$3,1,IF(K15=Lists!$F$5,2,IF(K15=Lists!$F$4,3,IF(K15=Lists!$F$6,4,IF(K15=Lists!$F$7,5,IF(K15=Lists!$F$8,6,0))))))","v":0},null,{"$f":"IF(M15=Lists!$F$3,1,IF(M15=Lists!$F$5,2,IF(M15=Lists!$F$4,3,IF(M15=Lists!$F$6,4,IF(M15=Lists!$F$7,5,IF(M15=Lists!$F$8,6,0))))))","v":0},null,{"$f":"IF(O15=Lists!$F$3,1,IF(O15=Lists!$F$5,2,IF(O15=Lists!$F$4,3,IF(O15=Lists!$F$6,4,IF(O15=Lists!$F$7,5,IF(O15=Lists!$F$8,6,0))))))","v":0},null,{"$f":"IF(Q15=Lists!$F$3,1,IF(Q15=Lists!$F$5,2,IF(Q15=Lists!$F$4,3,IF(Q15=Lists!$F$6,4,IF(Q15=Lists!$F$7,5,IF(Q15=Lists!$F$8,6,0))))))","v":0},null,{"$f":"IF(S15=Lists!$F$3,1,IF(S15=Lists!$F$5,2,IF(S15=Lists!$F$4,3,IF(S15=Lists!$F$6,4,IF(S15=Lists!$F$7,5,IF(S15=Lists!$F$8,6,0))))))","v":0},null,{"$f":"IF(U15=Lists!$F$3,1,IF(U15=Lists!$F$5,2,IF(U15=Lists!$F$4,3,IF(U15=Lists!$F$6,4,IF(U15=Lists!$F$7,5,IF(U15=Lists!$F$8,6,0))))))","v":0},null,{"$f":"IF(W15=Lists!$F$3,1,IF(W15=Lists!$F$5,2,IF(W15=Lists!$F$4,3,IF(W15=Lists!$F$6,4,IF(W15=Lists!$F$7,5,IF(W15=Lists!$F$8,6,0))))))","v":0}]
[null,null,null,null,{"$f":"IF(E16=Lists!$F$3,1,IF(E16=Lists!$F$5,2,IF(E16=Lists!$F$4,3,IF(E16=Lists!$F$6,4,IF(E16=Lists!$F$7,5,IF(E16=Lists!$F$8,6,0))))))","v":0},null,{"$f":"IF(G16=Lists!$F$3,1,IF(G16=Lists!$F$5,2,IF(G16=Lists!$F$4,3,IF(G16=Lists!$F$6,4,IF(G16=Lists!$F$7,5,IF(G16=Lists!$F$8,6,0))))))","v":0},null,{"$f":"IF(I16=Lists!$F$3,1,IF(I16=Lists!$F$5,2,IF(I16=Lists!$F$4,3,IF(I16=Lists!$F$6,4,IF(I16=Lists!$F$7,5,IF(I16=Lists!$F$8,6,0))))))","v":0},null,{"$f":"IF(K16=Lists!$F$3,1,IF(K16=Lists!$F$5,2,IF(K16=Lists!$F$4,3,IF(K16=Lists!$F$6,4,IF(K16=Lists!$F$7,5,IF(K16=Lists!$F$8,6,0))))))","v":0},null,{"$f":"IF(M16=Lists!$F$3,1,IF(M16=Lists!$F$5,2,IF(M16=Lists!$F$4,3,IF(M16=Lists!$F$6,4,IF(M16=Lists!$F$7,5,IF(M16=Lists!$F$8,6,0))))))","v":0},null,{"$f":"IF(O16=Lists!$F$3,1,IF(O16=Lists!$F$5,2,IF(O16=Lists!$F$4,3,IF(O16=Lists!$F$6,4,IF(O16=Lists!$F$7,5,IF(O16=Lists!$F$8,6,0))))))","v":0},null,{"$f":"IF(Q16=Lists!$F$3,1,IF(Q16=Lists!$F$5,2,IF(Q16=Lists!$F$4,3,IF(Q16=Lists!$F$6,4,IF(Q16=Lists!$F$7,5,IF(Q16=Lists!$F$8,6,0))))))","v":0},null,{"$f":"IF(S16=Lists!$F$3,1,IF(S16=Lists!$F$5,2,IF(S16=Lists!$F$4,3,IF(S16=Lists!$F$6,4,IF(S16=Lists!$F$7,5,IF(S16=Lists!$F$8,6,0))))))","v":0},null,{"$f":"IF(U16=Lists!$F$3,1,IF(U16=Lists!$F$5,2,IF(U16=Lists!$F$4,3,IF(U16=Lists!$F$6,4,IF(U16=Lists!$F$7,5,IF(U16=Lists!$F$8,6,0))))))","v":0},null,{"$f":"IF(W16=Lists!$F$3,1,IF(W16=Lists!$F$5,2,IF(W16=Lists!$F$4,3,IF(W16=Lists!$F$6,4,IF(W16=Lists!$F$7,5,IF(W16=Lists!$F$8,6,0))))))","v":0}]
[null,null,null,null,{"$f":"IF(E17=Lists!$F$3,1,IF(E17=Lists!$F$5,2,IF(E17=Lists!$F$4,3,IF(E17=Lists!$F$6,4,IF(E17=Lists!$F$7,5,IF(E17=Lists!$F$8,6,0))))))","v":0},null,{"$f":"IF(G17=Lists!$F$3,1,IF(G17=Lists!$F$5,2,IF(G17=Lists!$F$4,3,IF(G17=Lists!$F$6,4,IF(G17=Lists!$F$7,5,IF(G17=Lists!$F$8,6,0))))))","v":0},null,{"$f":"IF(I17=Lists!$F$3,1,IF(I17=Lists!$F$5,2,IF(I17=Lists!$F$4,3,IF(I17=Lists!$F$6,4,IF(I17=Lists!$F$7,5,IF(I17=Lists!$F$8,6,0))))))","v":0},null,{"$f":"IF(K17=Lists!$F$3,1,IF(K17=Lists!$F$5,2,IF(K17=Lists!$F$4,3,IF(K17=Lists!$F$6,4,IF(K17=Lists!$F$7,5,IF(K17=Lists!$F$8,6,0))))))","v":0},null,{"$f":"IF(M17=Lists!$F$3,1,IF(M17=Lists!$F$5,2,IF(M17=Lists!$F$4,3,IF(M17=Lists!$F$6,4,IF(M17=Lists!$F$7,5,IF(M17=Lists!$F$8,6,0))))))","v":0},null,{"$f":"IF(O17=Lists!$F$3,1,IF(O17=Lists!$F$5,2,IF(O17=Lists!$F$4,3,IF(O17=Lists!$F$6,4,IF(O17=Lists!$F$7,5,IF(O17=Lists!$F$8,6,0))))))","v":0},null,{"$f":"IF(Q17=Lists!$F$3,1,IF(Q17=Lists!$F$5,2,IF(Q17=Lists!$F$4,3,IF(Q17=Lists!$F$6,4,IF(Q17=Lists!$F$7,5,IF(Q17=Lists!$F$8,6,0))))))","v":0},null,{"$f":"IF(S17=Lists!$F$3,1,IF(S17=Lists!$F$5,2,IF(S17=Lists!$F$4,3,IF(S17=Lists!$F$6,4,IF(S17=Lists!$F$7,5,IF(S17=Lists!$F$8,6,0))))))","v":0},null,{"$f":"IF(U17=Lists!$F$3,1,IF(U17=Lists!$F$5,2,IF(U17=Lists!$F$4,3,IF(U17=Lists!$F$6,4,IF(U17=Lists!$F$7,5,IF(U17=Lists!$F$8,6,0))))))","v":0},null,{"$f":"IF(W17=Lists!$F$3,1,IF(W17=Lists!$F$5,2,IF(W17=Lists!$F$4,3,IF(W17=Lists!$F$6,4,IF(W17=Lists!$F$7,5,IF(W17=Lists!$F$8,6,0))))))","v":0}]
[null,null,null,null,{"$f":"IF(E18=Lists!$F$3,1,IF(E18=Lists!$F$5,2,IF(E18=Lists!$F$4,3,IF(E18=Lists!$F$6,4,IF(E18=Lists!$F$7,5,IF(E18=Lists!$F$8,6,0))))))","v":0},null,{"$f":"IF(G18=Lists!$F$3,1,IF(G18=Lists!$F$5,2,IF(G18=Lists!$F$4,3,IF(G18=Lists!$F$6,4,IF(G18=Lists!$F$7,5,IF(G18=Lists!$F$8,6,0))))))","v":0},null,{"$f":"IF(I18=Lists!$F$3,1,IF(I18=Lists!$F$5,2,IF(I18=Lists!$F$4,3,IF(I18=Lists!$F$6,4,IF(I18=Lists!$F$7,5,IF(I18=Lists!$F$8,6,0))))))","v":0},null,{"$f":"IF(K18=Lists!$F$3,1,IF(K18=Lists!$F$5,2,IF(K18=Lists!$F$4,3,IF(K18=Lists!$F$6,4,IF(K18=Lists!$F$7,5,IF(K18=Lists!$F$8,6,0))))))","v":0},null,{"$f":"IF(M18=Lists!$F$3,1,IF(M18=Lists!$F$5,2,IF(M18=Lists!$F$4,3,IF(M18=Lists!$F$6,4,IF(M18=Lists!$F$7,5,IF(M18=Lists!$F$8,6,0))))))","v":0},null,{"$f":"IF(O18=Lists!$F$3,1,IF(O18=Lists!$F$5,2,IF(O18=Lists!$F$4,3,IF(O18=Lists!$F$6,4,IF(O18=Lists!$F$7,5,IF(O18=Lists!$F$8,6,0))))))","v":0},null,{"$f":"IF(Q18=Lists!$F$3,1,IF(Q18=Lists!$F$5,2,IF(Q18=Lists!$F$4,3,IF(Q18=Lists!$F$6,4,IF(Q18=Lists!$F$7,5,IF(Q18=Lists!$F$8,6,0))))))","v":0},null,{"$f":"IF(S18=Lists!$F$3,1,IF(S18=Lists!$F$5,2,IF(S18=Lists!$F$4,3,IF(S18=Lists!$F$6,4,IF(S18=Lists!$F$7,5,IF(S18=Lists!$F$8,6,0))))))","v":0},null,{"$f":"IF(U18=Lists!$F$3,1,IF(U18=Lists!$F$5,2,IF(U18=Lists!$F$4,3,IF(U18=Lists!$F$6,4,IF(U18=Lists!$F$7,5,IF(U18=Lists!$F$8,6,0))))))","v":0},null,{"$f":"IF(W18=Lists!$F$3,1,IF(W18=Lists!$F$5,2,IF(W18=Lists!$F$4,3,IF(W18=Lists!$F$6,4,IF(W18=Lists!$F$7,5,IF(W18=Lists!$F$8,6,0))))))","v":0}]
[null,null,null,null,{"$f":"IF(E19=Lists!$F$3,1,IF(E19=Lists!$F$5,2,IF(E19=Lists!$F$4,3,IF(E19=Lists!$F$6,4,IF(E19=Lists!$F$7,5,IF(E19=Lists!$F$8,6,0))))))","v":0},null,{"$f":"IF(G19=Lists!$F$3,1,IF(G19=Lists!$F$5,2,IF(G19=Lists!$F$4,3,IF(G19=Lists!$F$6,4,IF(G19=Lists!$F$7,5,IF(G19=Lists!$F$8,6,0))))))","v":0},null,{"$f":"IF(I19=Lists!$F$3,1,IF(I19=Lists!$F$5,2,IF(I19=Lists!$F$4,3,IF(I19=Lists!$F$6,4,IF(I19=Lists!$F$7,5,IF(I19=Lists!$F$8,6,0))))))","v":0},null,{"$f":"IF(K19=Lists!$F$3,1,IF(K19=Lists!$F$5,2,IF(K19=Lists!$F$4,3,IF(K19=Lists!$F$6,4,IF(K19=Lists!$F$7,5,IF(K19=Lists!$F$8,6,0))))))","v":0},null,{"$f":"IF(M19=Lists!$F$3,1,IF(M19=Lists!$F$5,2,IF(M19=Lists!$F$4,3,IF(M19=Lists!$F$6,4,IF(M19=Lists!$F$7,5,IF(M19=Lists!$F$8,6,0))))))","v":0},null,{"$f":"IF(O19=Lists!$F$3,1,IF(O19=Lists!$F$5,2,IF(O19=Lists!$F$4,3,IF(O19=Lists!$F$6,4,IF(O19=Lists!$F$7,5,IF(O19=Lists!$F$8,6,0))))))","v":0},null,{"$f":"IF(Q19=Lists!$F$3,1,IF(Q19=Lists!$F$5,2,IF(Q19=Lists!$F$4,3,IF(Q19=Lists!$F$6,4,IF(Q19=Lists!$F$7,5,IF(Q19=Lists!$F$8,6,0))))))","v":0},null,{"$f":"IF(S19=Lists!$F$3,1,IF(S19=Lists!$F$5,2,IF(S19=Lists!$F$4,3,IF(S19=Lists!$F$6,4,IF(S19=Lists!$F$7,5,IF(S19=Lists!$F$8,6,0))))))","v":0},null,{"$f":"IF(U19=Lists!$F$3,1,IF(U19=Lists!$F$5,2,IF(U19=Lists!$F$4,3,IF(U19=Lists!$F$6,4,IF(U19=Lists!$F$7,5,IF(U19=Lists!$F$8,6,0))))))","v":0},null,{"$f":"IF(W19=Lists!$F$3,1,IF(W19=Lists!$F$5,2,IF(W19=Lists!$F$4,3,IF(W19=Lists!$F$6,4,IF(W19=Lists!$F$7,5,IF(W19=Lists!$F$8,6,0))))))","v":0}]
[null,null,null,null,{"$f":"IF(E20=Lists!$F$3,1,IF(E20=Lists!$F$5,2,IF(E20=Lists!$F$4,3,IF(E20=Lists!$F$6,4,IF(E20=Lists!$F$7,5,IF(E20=Lists!$F$8,6,0))))))","v":0},null,{"$f":"IF(G20=Lists!$F$3,1,IF(G20=Lists!$F$5,2,IF(G20=Lists!$F$4,3,IF(G20=Lists!$F$6,4,IF(G20=Lists!$F$7,5,IF(G20=Lists!$F$8,6,0))))))","v":0},null,{"$f":"IF(I20=Lists!$F$3,1,IF(I20=Lists!$F$5,2,IF(I20=Lists!$F$4,3,IF(I20=Lists!$F$6,4,IF(I20=Lists!$F$7,5,IF(I20=Lists!$F$8,6,0))))))","v":0},null,{"$f":"IF(K20=Lists!$F$3,1,IF(K20=Lists!$F$5,2,IF(K20=Lists!$F$4,3,IF(K20=Lists!$F$6,4,IF(K20=Lists!$F$7,5,IF(K20=Lists!$F$8,6,0))))))","v":0},null,{"$f":"IF(M20=Lists!$F$3,1,IF(M20=Lists!$F$5,2,IF(M20=Lists!$F$4,3,IF(M20=Lists!$F$6,4,IF(M20=Lists!$F$7,5,IF(M20=Lists!$F$8,6,0))))))","v":0},null,{"$f":"IF(O20=Lists!$F$3,1,IF(O20=Lists!$F$5,2,IF(O20=Lists!$F$4,3,IF(O20=Lists!$F$6,4,IF(O20=Lists!$F$7,5,IF(O20=Lists!$F$8,6,0))))))","v":0},null,{"$f":"IF(Q20=Lists!$F$3,1,IF(Q20=Lists!$F$5,2,IF(Q20=Lists!$F$4,3,IF(Q20=Lists!$F$6,4,IF(Q20=Lists!$F$7,5,IF(Q20=Lists!$F$8,6,0))))))","v":0},null,{"$f":"IF(S20=Lists!$F$3,1,IF(S20=Lists!$F$5,2,IF(S20=Lists!$F$4,3,IF(S20=Lists!$F$6,4,IF(S20=Lists!$F$7,5,IF(S20=Lists!$F$8,6,0))))))","v":0},null,{"$f":"IF(U20=Lists!$F$3,1,IF(U20=Lists!$F$5,2,IF(U20=Lists!$F$4,3,IF(U20=Lists!$F$6,4,IF(U20=Lists!$F$7,5,IF(U20=Lists!$F$8,6,0))))))","v":0},null,{"$f":"IF(W20=Lists!$F$3,1,IF(W20=Lists!$F$5,2,IF(W20=Lists!$F$4,3,IF(W20=Lists!$F$6,4,IF(W20=Lists!$F$7,5,IF(W20=Lists!$F$8,6,0))))))","v":0}]
[null,null,null,null,{"$f":"IF(E21=Lists!$F$3,1,IF(E21=Lists!$F$5,2,IF(E21=Lists!$F$4,3,IF(E21=Lists!$F$6,4,IF(E21=Lists!$F$7,5,IF(E21=Lists!$F$8,6,0))))))","v":0},null,{"$f":"IF(G21=Lists!$F$3,1,IF(G21=Lists!$F$5,2,IF(G21=Lists!$F$4,3,IF(G21=Lists!$F$6,4,IF(G21=Lists!$F$7,5,IF(G21=Lists!$F$8,6,0))))))","v":0},null,{"$f":"IF(I21=Lists!$F$3,1,IF(I21=Lists!$F$5,2,IF(I21=Lists!$F$4,3,IF(I21=Lists!$F$6,4,IF(I21=Lists!$F$7,5,IF(I21=Lists!$F$8,6,0))))))","v":0},null,{"$f":"IF(K21=Lists!$F$3,1,IF(K21=Lists!$F$5,2,IF(K21=Lists!$F$4,3,IF(K21=Lists!$F$6,4,IF(K21=Lists!$F$7,5,IF(K21=Lists!$F$8,6,0))))))","v":0},null,{"$f":"IF(M21=Lists!$F$3,1,IF(M21=Lists!$F$5,2,IF(M21=Lists!$F$4,3,IF(M21=Lists!$F$6,4,IF(M21=Lists!$F$7,5,IF(M21=Lists!$F$8,6,0))))))","v":0},null,{"$f":"IF(O21=Lists!$F$3,1,IF(O21=Lists!$F$5,2,IF(O21=Lists!$F$4,3,IF(O21=Lists!$F$6,4,IF(O21=Lists!$F$7,5,IF(O21=Lists!$F$8,6,0))))))","v":0},null,{"$f":"IF(Q21=Lists!$F$3,1,IF(Q21=Lists!$F$5,2,IF(Q21=Lists!$F$4,3,IF(Q21=Lists!$F$6,4,IF(Q21=Lists!$F$7,5,IF(Q21=Lists!$F$8,6,0))))))","v":0},null,{"$f":"IF(S21=Lists!$F$3,1,IF(S21=Lists!$F$5,2,IF(S21=Lists!$F$4,3,IF(S21=Lists!$F$6,4,IF(S21=Lists!$F$7,5,IF(S21=Lists!$F$8,6,0))))))","v":0},null,{"$f":"IF(U21=Lists!$F$3,1,IF(U21=Lists!$F$5,2,IF(U21=Lists!$F$4,3,IF(U21=Lists!$F$6,4,IF(U21=Lists!$F$7,5,IF(U21=Lists!$F$8,6,0))))))","v":0},null,{"$f":"IF(W21=Lists!$F$3,1,IF(W21=Lists!$F$5,2,IF(W21=Lists!$F$4,3,IF(W21=Lists!$F$6,4,IF(W21=Lists!$F$7,5,IF(W21=Lists!$F$8,6,0))))))","v":0}]
[null,null,null,null,{"$f":"IF(E22=Lists!$F$3,1,IF(E22=Lists!$F$5,2,IF(E22=Lists!$F$4,3,IF(E22=Lists!$F$6,4,IF(E22=Lists!$F$7,5,IF(E22=Lists!$F$8,6,0))))))","v":0},null,{"$f":"IF(G22=Lists!$F$3,1,IF(G22=Lists!$F$5,2,IF(G22=Lists!$F$4,3,IF(G22=Lists!$F$6,4,IF(G22=Lists!$F$7,5,IF(G22=Lists!$F$8,6,0))))))","v":0},null,{"$f":"IF(I22=Lists!$F$3,1,IF(I22=Lists!$F$5,2,IF(I22=Lists!$F$4,3,IF(I22=Lists!$F$6,4,IF(I22=Lists!$F$7,5,IF(I22=Lists!$F$8,6,0))))))","v":0},null,{"$f":"IF(K22=Lists!$F$3,1,IF(K22=Lists!$F$5,2,IF(K22=Lists!$F$4,3,IF(K22=Lists!$F$6,4,IF(K22=Lists!$F$7,5,IF(K22=Lists!$F$8,6,0))))))","v":0},null,{"$f":"IF(M22=Lists!$F$3,1,IF(M22=Lists!$F$5,2,IF(M22=Lists!$F$4,3,IF(M22=Lists!$F$6,4,IF(M22=Lists!$F$7,5,IF(M22=Lists!$F$8,6,0))))))","v":0},null,{"$f":"IF(O22=Lists!$F$3,1,IF(O22=Lists!$F$5,2,IF(O22=Lists!$F$4,3,IF(O22=Lists!$F$6,4,IF(O22=Lists!$F$7,5,IF(O22=Lists!$F$8,6,0))))))","v":0},null,{"$f":"IF(Q22=Lists!$F$3,1,IF(Q22=Lists!$F$5,2,IF(Q22=Lists!$F$4,3,IF(Q22=Lists!$F$6,4,IF(Q22=Lists!$F$7,5,IF(Q22=Lists!$F$8,6,0))))))","v":0},null,{"$f":"IF(S22=Lists!$F$3,1,IF(S22=Lists!$F$5,2,IF(S22=Lists!$F$4,3,IF(S22=Lists!$F$6,4,IF(S22=Lists!$F$7,5,IF(S22=Lists!$F$8,6,0))))))","v":0},null,{"$f":"IF(U22=Lists!$F$3,1,IF(U22=Lists!$F$5,2,IF(U22=Lists!$F$4,3,IF(U22=Lists!$F$6,4,IF(U22=Lists!$F$7,5,IF(U22=Lists!$F$8,6,0))))))","v":0},null,{"$f":"IF(W22=Lists!$F$3,1,IF(W22=Lists!$F$5,2,IF(W22=Lists!$F$4,3,IF(W22=Lists!$F$6,4,IF(W22=Lists!$F$7,5,IF(W22=Lists!$F$8,6,0))))))","v":0}]
[null,null,null,null,{"$f":"IF(E23=Lists!$F$3,1,IF(E23=Lists!$F$5,2,IF(E23=Lists!$F$4,3,IF(E23=Lists!$F$6,4,IF(E23=Lists!$F$7,5,IF(E23=Lists!$F$8,6,0))))))","v":0},null,{"$f":"IF(G23=Lists!$F$3,1,IF(G23=Lists!$F$5,2,IF(G23=Lists!$F$4,3,IF(G23=Lists!$F$6,4,IF(G23=Lists!$F$7,5,IF(G23=Lists!$F$8,6,0))))))","v":0},null,{"$f":"IF(I23=Lists!$F$3,1,IF(I23=Lists!$F$5,2,IF(I23=Lists!$F$4,3,IF(I23=Lists!$F$6,4,IF(I23=Lists!$F$7,5,IF(I23=Lists!$F$8,6,0))))))","v":0},null,{"$f":"IF(K23=Lists!$F$3,1,IF(K23=Lists!$F$5,2,IF(K23=Lists!$F$4,3,IF(K23=Lists!$F$6,4,IF(K23=Lists!$F$7,5,IF(K23=Lists!$F$8,6,0))))))","v":0},null,{"$f":"IF(M23=Lists!$F$3,1,IF(M23=Lists!$F$5,2,IF(M23=Lists!$F$4,3,IF(M23=Lists!$F$6,4,IF(M23=Lists!$F$7,5,IF(M23=Lists!$F$8,6,0))))))","v":0},null,{"$f":"IF(O23=Lists!$F$3,1,IF(O23=Lists!$F$5,2,IF(O23=Lists!$F$4,3,IF(O23=Lists!$F$6,4,IF(O23=Lists!$F$7,5,IF(O23=Lists!$F$8,6,0))))))","v":0},null,{"$f":"IF(Q23=Lists!$F$3,1,IF(Q23=Lists!$F$5,2,IF(Q23=Lists!$F$4,3,IF(Q23=Lists!$F$6,4,IF(Q23=Lists!$F$7,5,IF(Q23=Lists!$F$8,6,0))))))","v":0},null,{"$f":"IF(S23=Lists!$F$3,1,IF(S23=Lists!$F$5,2,IF(S23=Lists!$F$4,3,IF(S23=Lists!$F$6,4,IF(S23=Lists!$F$7,5,IF(S23=Lists!$F$8,6,0))))))","v":0},null,{"$f":"IF(U23=Lists!$F$3,1,IF(U23=Lists!$F$5,2,IF(U23=Lists!$F$4,3,IF(U23=Lists!$F$6,4,IF(U23=Lists!$F$7,5,IF(U23=Lists!$F$8,6,0))))))","v":0},null,{"$f":"IF(W23=Lists!$F$3,1,IF(W23=Lists!$F$5,2,IF(W23=Lists!$F$4,3,IF(W23=Lists!$F$6,4,IF(W23=Lists!$F$7,5,IF(W23=Lists!$F$8,6,0))))))","v":0}]
[null,null,null,null,{"$f":"IF(E24=Lists!$F$3,1,IF(E24=Lists!$F$5,2,IF(E24=Lists!$F$4,3,IF(E24=Lists!$F$6,4,IF(E24=Lists!$F$7,5,IF(E24=Lists!$F$8,6,0))))))","v":0},null,{"$f":"IF(G24=Lists!$F$3,1,IF(G24=Lists!$F$5,2,IF(G24=Lists!$F$4,3,IF(G24=Lists!$F$6,4,IF(G24=Lists!$F$7,5,IF(G24=Lists!$F$8,6,0))))))","v":0},null,{"$f":"IF(I24=Lists!$F$3,1,IF(I24=Lists!$F$5,2,IF(I24=Lists!$F$4,3,IF(I24=Lists!$F$6,4,IF(I24=Lists!$F$7,5,IF(I24=Lists!$F$8,6,0))))))","v":0},null,{"$f":"IF(K24=Lists!$F$3,1,IF(K24=Lists!$F$5,2,IF(K24=Lists!$F$4,3,IF(K24=Lists!$F$6,4,IF(K24=Lists!$F$7,5,IF(K24=Lists!$F$8,6,0))))))","v":0},null,{"$f":"IF(M24=Lists!$F$3,1,IF(M24=Lists!$F$5,2,IF(M24=Lists!$F$4,3,IF(M24=Lists!$F$6,4,IF(M24=Lists!$F$7,5,IF(M24=Lists!$F$8,6,0))))))","v":0},null,{"$f":"IF(O24=Lists!$F$3,1,IF(O24=Lists!$F$5,2,IF(O24=Lists!$F$4,3,IF(O24=Lists!$F$6,4,IF(O24=Lists!$F$7,5,IF(O24=Lists!$F$8,6,0))))))","v":0},null,{"$f":"IF(Q24=Lists!$F$3,1,IF(Q24=Lists!$F$5,2,IF(Q24=Lists!$F$4,3,IF(Q24=Lists!$F$6,4,IF(Q24=Lists!$F$7,5,IF(Q24=Lists!$F$8,6,0))))))","v":0},null,{"$f":"IF(S24=Lists!$F$3,1,IF(S24=Lists!$F$5,2,IF(S24=Lists!$F$4,3,IF(S24=Lists!$F$6,4,IF(S24=Lists!$F$7,5,IF(S24=Lists!$F$8,6,0))))))","v":0},null,{"$f":"IF(U24=Lists!$F$3,1,IF(U24=Lists!$F$5,2,IF(U24=Lists!$F$4,3,IF(U24=Lists!$F$6,4,IF(U24=Lists!$F$7,5,IF(U24=Lists!$F$8,6,0))))))","v":0},null,{"$f":"IF(W24=Lists!$F$3,1,IF(W24=Lists!$F$5,2,IF(W24=Lists!$F$4,3,IF(W24=Lists!$F$6,4,IF(W24=Lists!$F$7,5,IF(W24=Lists!$F$8,6,0))))))","v":0}]
[null,null,null,null,{"$f":"IF(E25=Lists!$F$3,1,IF(E25=Lists!$F$5,2,IF(E25=Lists!$F$4,3,IF(E25=Lists!$F$6,4,IF(E25=Lists!$F$7,5,IF(E25=Lists!$F$8,6,0))))))","v":0},null,{"$f":"IF(G25=Lists!$F$3,1,IF(G25=Lists!$F$5,2,IF(G25=Lists!$F$4,3,IF(G25=Lists!$F$6,4,IF(G25=Lists!$F$7,5,IF(G25=Lists!$F$8,6,0))))))","v":0},null,{"$f":"IF(I25=Lists!$F$3,1,IF(I25=Lists!$F$5,2,IF(I25=Lists!$F$4,3,IF(I25=Lists!$F$6,4,IF(I25=Lists!$F$7,5,IF(I25=Lists!$F$8,6,0))))))","v":0},null,{"$f":"IF(K25=Lists!$F$3,1,IF(K25=Lists!$F$5,2,IF(K25=Lists!$F$4,3,IF(K25=Lists!$F$6,4,IF(K25=Lists!$F$7,5,IF(K25=Lists!$F$8,6,0))))))","v":0},null,{"$f":"IF(M25=Lists!$F$3,1,IF(M25=Lists!$F$5,2,IF(M25=Lists!$F$4,3,IF(M25=Lists!$F$6,4,IF(M25=Lists!$F$7,5,IF(M25=Lists!$F$8,6,0))))))","v":0},null,{"$f":"IF(O25=Lists!$F$3,1,IF(O25=Lists!$F$5,2,IF(O25=Lists!$F$4,3,IF(O25=Lists!$F$6,4,IF(O25=Lists!$F$7,5,IF(O25=Lists!$F$8,6,0))))))","v":0},null,{"$f":"IF(Q25=Lists!$F$3,1,IF(Q25=Lists!$F$5,2,IF(Q25=Lists!$F$4,3,IF(Q25=Lists!$F$6,4,IF(Q25=Lists!$F$7,5,IF(Q25=Lists!$F$8,6,0))))))","v":0},null,{"$f":"IF(S25=Lists!$F$3,1,IF(S25=Lists!$F$5,2,IF(S25=Lists!$F$4,3,IF(S25=Lists!$F$6,4,IF(S25=Lists!$F$7,5,IF(S25=Lists!$F$8,6,0))))))","v":0},null,{"$f":"IF(U25=Lists!$F$3,1,IF(U25=Lists!$F$5,2,IF(U25=Lists!$F$4,3,IF(U25=Lists!$F$6,4,IF(U25=Lists!$F$7,5,IF(U25=Lists!$F$8,6,0))))))","v":0},null,{"$f":"IF(W25=Lists!$F$3,1,IF(W25=Lists!$F$5,2,IF(W25=Lists!$F$4,3,IF(W25=Lists!$F$6,4,IF(W25=Lists!$F$7,5,IF(W25=Lists!$F$8,6,0))))))","v":0}]
[null,null,null,null,{"$f":"IF(E26=Lists!$F$3,1,IF(E26=Lists!$F$5,2,IF(E26=Lists!$F$4,3,IF(E26=Lists!$F$6,4,IF(E26=Lists!$F$7,5,IF(E26=Lists!$F$8,6,0))))))","v":0},null,{"$f":"IF(G26=Lists!$F$3,1,IF(G26=Lists!$F$5,2,IF(G26=Lists!$F$4,3,IF(G26=Lists!$F$6,4,IF(G26=Lists!$F$7,5,IF(G26=Lists!$F$8,6,0))))))","v":0},null,{"$f":"IF(I26=Lists!$F$3,1,IF(I26=Lists!$F$5,2,IF(I26=Lists!$F$4,3,IF(I26=Lists!$F$6,4,IF(I26=Lists!$F$7,5,IF(I26=Lists!$F$8,6,0))))))","v":0},null,{"$f":"IF(K26=Lists!$F$3,1,IF(K26=Lists!$F$5,2,IF(K26=Lists!$F$4,3,IF(K26=Lists!$F$6,4,IF(K26=Lists!$F$7,5,IF(K26=Lists!$F$8,6,0))))))","v":0},null,{"$f":"IF(M26=Lists!$F$3,1,IF(M26=Lists!$F$5,2,IF(M26=Lists!$F$4,3,IF(M26=Lists!$F$6,4,IF(M26=Lists!$F$7,5,IF(M26=Lists!$F$8,6,0))))))","v":0},null,{"$f":"IF(O26=Lists!$F$3,1,IF(O26=Lists!$F$5,2,IF(O26=Lists!$F$4,3,IF(O26=Lists!$F$6,4,IF(O26=Lists!$F$7,5,IF(O26=Lists!$F$8,6,0))))))","v":0},null,{"$f":"IF(Q26=Lists!$F$3,1,IF(Q26=Lists!$F$5,2,IF(Q26=Lists!$F$4,3,IF(Q26=Lists!$F$6,4,IF(Q26=Lists!$F$7,5,IF(Q26=Lists!$F$8,6,0))))))","v":0},null,{"$f":"IF(S26=Lists!$F$3,1,IF(S26=Lists!$F$5,2,IF(S26=Lists!$F$4,3,IF(S26=Lists!$F$6,4,IF(S26=Lists!$F$7,5,IF(S26=Lists!$F$8,6,0))))))","v":0},null,{"$f":"IF(U26=Lists!$F$3,1,IF(U26=Lists!$F$5,2,IF(U26=Lists!$F$4,3,IF(U26=Lists!$F$6,4,IF(U26=Lists!$F$7,5,IF(U26=Lists!$F$8,6,0))))))","v":0},null,{"$f":"IF(W26=Lists!$F$3,1,IF(W26=Lists!$F$5,2,IF(W26=Lists!$F$4,3,IF(W26=Lists!$F$6,4,IF(W26=Lists!$F$7,5,IF(W26=Lists!$F$8,6,0))))))","v":0}]
[null,null,null,null,{"$f":"IF(E27=Lists!$F$3,1,IF(E27=Lists!$F$5,2,IF(E27=Lists!$F$4,3,IF(E27=Lists!$F$6,4,IF(E27=Lists!$F$7,5,IF(E27=Lists!$F$8,6,0))))))","v":0},null,{"$f":"IF(G27=Lists!$F$3,1,IF(G27=Lists!$F$5,2,IF(G27=Lists!$F$4,3,IF(G27=Lists!$F$6,4,IF(G27=Lists!$F$7,5,IF(G27=Lists!$F$8,6,0))))))","v":0},null,{"$f":"IF(I27=Lists!$F$3,1,IF(I27=Lists!$F$5,2,IF(I27=Lists!$F$4,3,IF(I27=Lists!$F$6,4,IF(I27=Lists!$F$7,5,IF(I27=Lists!$F$8,6,0))))))","v":0},null,{"$f":"IF(K27=Lists!$F$3,1,IF(K27=Lists!$F$5,2,IF(K27=Lists!$F$4,3,IF(K27=Lists!$F$6,4,IF(K27=Lists!$F$7,5,IF(K27=Lists!$F$8,6,0))))))","v":0},null,{"$f":"IF(M27=Lists!$F$3,1,IF(M27=Lists!$F$5,2,IF(M27=Lists!$F$4,3,IF(M27=Lists!$F$6,4,IF(M27=Lists!$F$7,5,IF(M27=Lists!$F$8,6,0))))))","v":0},null,{"$f":"IF(O27=Lists!$F$3,1,IF(O27=Lists!$F$5,2,IF(O27=Lists!$F$4,3,IF(O27=Lists!$F$6,4,IF(O27=Lists!$F$7,5,IF(O27=Lists!$F$8,6,0))))))","v":0},null,{"$f":"IF(Q27=Lists!$F$3,1,IF(Q27=Lists!$F$5,2,IF(Q27=Lists!$F$4,3,IF(Q27=Lists!$F$6,4,IF(Q27=Lists!$F$7,5,IF(Q27=Lists!$F$8,6,0))))))","v":0},null,{"$f":"IF(S27=Lists!$F$3,1,IF(S27=Lists!$F$5,2,IF(S27=Lists!$F$4,3,IF(S27=Lists!$F$6,4,IF(S27=Lists!$F$7,5,IF(S27=Lists!$F$8,6,0))))))","v":0},null,{"$f":"IF(U27=Lists!$F$3,1,IF(U27=Lists!$F$5,2,IF(U27=Lists!$F$4,3,IF(U27=Lists!$F$6,4,IF(U27=Lists!$F$7,5,IF(U27=Lists!$F$8,6,0))))))","v":0},null,{"$f":"IF(W27=Lists!$F$3,1,IF(W27=Lists!$F$5,2,IF(W27=Lists!$F$4,3,IF(W27=Lists!$F$6,4,IF(W27=Lists!$F$7,5,IF(W27=Lists!$F$8,6,0))))))","v":0}]
[null,null,null,null,{"$f":"IF(E28=Lists!$F$3,1,IF(E28=Lists!$F$5,2,IF(E28=Lists!$F$4,3,IF(E28=Lists!$F$6,4,IF(E28=Lists!$F$7,5,IF(E28=Lists!$F$8,6,0))))))","v":0},null,{"$f":"IF(G28=Lists!$F$3,1,IF(G28=Lists!$F$5,2,IF(G28=Lists!$F$4,3,IF(G28=Lists!$F$6,4,IF(G28=Lists!$F$7,5,IF(G28=Lists!$F$8,6,0))))))","v":0},null,{"$f":"IF(I28=Lists!$F$3,1,IF(I28=Lists!$F$5,2,IF(I28=Lists!$F$4,3,IF(I28=Lists!$F$6,4,IF(I28=Lists!$F$7,5,IF(I28=Lists!$F$8,6,0))))))","v":0},null,{"$f":"IF(K28=Lists!$F$3,1,IF(K28=Lists!$F$5,2,IF(K28=Lists!$F$4,3,IF(K28=Lists!$F$6,4,IF(K28=Lists!$F$7,5,IF(K28=Lists!$F$8,6,0))))))","v":0},null,{"$f":"IF(M28=Lists!$F$3,1,IF(M28=Lists!$F$5,2,IF(M28=Lists!$F$4,3,IF(M28=Lists!$F$6,4,IF(M28=Lists!$F$7,5,IF(M28=Lists!$F$8,6,0))))))","v":0},null,{"$f":"IF(O28=Lists!$F$3,1,IF(O28=Lists!$F$5,2,IF(O28=Lists!$F$4,3,IF(O28=Lists!$F$6,4,IF(O28=Lists!$F$7,5,IF(O28=Lists!$F$8,6,0))))))","v":0},null,{"$f":"IF(Q28=Lists!$F$3,1,IF(Q28=Lists!$F$5,2,IF(Q28=Lists!$F$4,3,IF(Q28=Lists!$F$6,4,IF(Q28=Lists!$F$7,5,IF(Q28=Lists!$F$8,6,0))))))","v":0},null,{"$f":"IF(S28=Lists!$F$3,1,IF(S28=Lists!$F$5,2,IF(S28=Lists!$F$4,3,IF(S28=Lists!$F$6,4,IF(S28=Lists!$F$7,5,IF(S28=Lists!$F$8,6,0))))))","v":0},null,{"$f":"IF(U28=Lists!$F$3,1,IF(U28=Lists!$F$5,2,IF(U28=Lists!$F$4,3,IF(U28=Lists!$F$6,4,IF(U28=Lists!$F$7,5,IF(U28=Lists!$F$8,6,0))))))","v":0},null,{"$f":"IF(W28=Lists!$F$3,1,IF(W28=Lists!$F$5,2,IF(W28=Lists!$F$4,3,IF(W28=Lists!$F$6,4,IF(W28=Lists!$F$7,5,IF(W28=Lists!$F$8,6,0))))))","v":0}]
[null,null,null,null,{"$f":"IF(E29=Lists!$F$3,1,IF(E29=Lists!$F$5,2,IF(E29=Lists!$F$4,3,IF(E29=Lists!$F$6,4,IF(E29=Lists!$F$7,5,IF(E29=Lists!$F$8,6,0))))))","v":0},null,{"$f":"IF(G29=Lists!$F$3,1,IF(G29=Lists!$F$5,2,IF(G29=Lists!$F$4,3,IF(G29=Lists!$F$6,4,IF(G29=Lists!$F$7,5,IF(G29=Lists!$F$8,6,0))))))","v":0},null,{"$f":"IF(I29=Lists!$F$3,1,IF(I29=Lists!$F$5,2,IF(I29=Lists!$F$4,3,IF(I29=Lists!$F$6,4,IF(I29=Lists!$F$7,5,IF(I29=Lists!$F$8,6,0))))))","v":0},null,{"$f":"IF(K29=Lists!$F$3,1,IF(K29=Lists!$F$5,2,IF(K29=Lists!$F$4,3,IF(K29=Lists!$F$6,4,IF(K29=Lists!$F$7,5,IF(K29=Lists!$F$8,6,0))))))","v":0},null,{"$f":"IF(M29=Lists!$F$3,1,IF(M29=Lists!$F$5,2,IF(M29=Lists!$F$4,3,IF(M29=Lists!$F$6,4,IF(M29=Lists!$F$7,5,IF(M29=Lists!$F$8,6,0))))))","v":0},null,{"$f":"IF(O29=Lists!$F$3,1,IF(O29=Lists!$F$5,2,IF(O29=Lists!$F$4,3,IF(O29=Lists!$F$6,4,IF(O29=Lists!$F$7,5,IF(O29=Lists!$F$8,6,0))))))","v":0},null,{"$f":"IF(Q29=Lists!$F$3,1,IF(Q29=Lists!$F$5,2,IF(Q29=Lists!$F$4,3,IF(Q29=Lists!$F$6,4,IF(Q29=Lists!$F$7,5,IF(Q29=Lists!$F$8,6,0))))))","v":0},null,{"$f":"IF(S29=Lists!$F$3,1,IF(S29=Lists!$F$5,2,IF(S29=Lists!$F$4,3,IF(S29=Lists!$F$6,4,IF(S29=Lists!$F$7,5,IF(S29=Lists!$F$8,6,0))))))","v":0},null,{"$f":"IF(U29=Lists!$F$3,1,IF(U29=Lists!$F$5,2,IF(U29=Lists!$F$4,3,IF(U29=Lists!$F$6,4,IF(U29=Lists!$F$7,5,IF(U29=Lists!$F$8,6,0))))))","v":0},null,{"$f":"IF(W29=Lists!$F$3,1,IF(W29=Lists!$F$5,2,IF(W29=Lists!$F$4,3,IF(W29=Lists!$F$6,4,IF(W29=Lists!$F$7,5,IF(W29=Lists!$F$8,6,0))))))","v":0}]
[null,null,null,null,{"$f":"IF(E30=Lists!$F$3,1,IF(E30=Lists!$F$5,2,IF(E30=Lists!$F$4,3,IF(E30=Lists!$F$6,4,IF(E30=Lists!$F$7,5,IF(E30=Lists!$F$8,6,0))))))","v":0},null,{"$f":"IF(G30=Lists!$F$3,1,IF(G30=Lists!$F$5,2,IF(G30=Lists!$F$4,3,IF(G30=Lists!$F$6,4,IF(G30=Lists!$F$7,5,IF(G30=Lists!$F$8,6,0))))))","v":0},null,{"$f":"IF(I30=Lists!$F$3,1,IF(I30=Lists!$F$5,2,IF(I30=Lists!$F$4,3,IF(I30=Lists!$F$6,4,IF(I30=Lists!$F$7,5,IF(I30=Lists!$F$8,6,0))))))","v":0},null,{"$f":"IF(K30=Lists!$F$3,1,IF(K30=Lists!$F$5,2,IF(K30=Lists!$F$4,3,IF(K30=Lists!$F$6,4,IF(K30=Lists!$F$7,5,IF(K30=Lists!$F$8,6,0))))))","v":0},null,{"$f":"IF(M30=Lists!$F$3,1,IF(M30=Lists!$F$5,2,IF(M30=Lists!$F$4,3,IF(M30=Lists!$F$6,4,IF(M30=Lists!$F$7,5,IF(M30=Lists!$F$8,6,0))))))","v":0},null,{"$f":"IF(O30=Lists!$F$3,1,IF(O30=Lists!$F$5,2,IF(O30=Lists!$F$4,3,IF(O30=Lists!$F$6,4,IF(O30=Lists!$F$7,5,IF(O30=Lists!$F$8,6,0))))))","v":0},null,{"$f":"IF(Q30=Lists!$F$3,1,IF(Q30=Lists!$F$5,2,IF(Q30=Lists!$F$4,3,IF(Q30=Lists!$F$6,4,IF(Q30=Lists!$F$7,5,IF(Q30=Lists!$F$8,6,0))))))","v":0},null,{"$f":"IF(S30=Lists!$F$3,1,IF(S30=Lists!$F$5,2,IF(S30=Lists!$F$4,3,IF(S30=Lists!$F$6,4,IF(S30=Lists!$F$7,5,IF(S30=Lists!$F$8,6,0))))))","v":0},null,{"$f":"IF(U30=Lists!$F$3,1,IF(U30=Lists!$F$5,2,IF(U30=Lists!$F$4,3,IF(U30=Lists!$F$6,4,IF(U30=Lists!$F$7,5,IF(U30=Lists!$F$8,6,0))))))","v":0},null,{"$f":"IF(W30=Lists!$F$3,1,IF(W30=Lists!$F$5,2,IF(W30=Lists!$F$4,3,IF(W30=Lists!$F$6,4,IF(W30=Lists!$F$7,5,IF(W30=Lists!$F$8,6,0))))))","v":0}]
[null,null,null,null,{"$f":"IF(E31=Lists!$F$3,1,IF(E31=Lists!$F$5,2,IF(E31=Lists!$F$4,3,IF(E31=Lists!$F$6,4,IF(E31=Lists!$F$7,5,IF(E31=Lists!$F$8,6,0))))))","v":0},null,{"$f":"IF(G31=Lists!$F$3,1,IF(G31=Lists!$F$5,2,IF(G31=Lists!$F$4,3,IF(G31=Lists!$F$6,4,IF(G31=Lists!$F$7,5,IF(G31=Lists!$F$8,6,0))))))","v":0},null,{"$f":"IF(I31=Lists!$F$3,1,IF(I31=Lists!$F$5,2,IF(I31=Lists!$F$4,3,IF(I31=Lists!$F$6,4,IF(I31=Lists!$F$7,5,IF(I31=Lists!$F$8,6,0))))))","v":0},null,{"$f":"IF(K31=Lists!$F$3,1,IF(K31=Lists!$F$5,2,IF(K31=Lists!$F$4,3,IF(K31=Lists!$F$6,4,IF(K31=Lists!$F$7,5,IF(K31=Lists!$F$8,6,0))))))","v":0},null,{"$f":"IF(M31=Lists!$F$3,1,IF(M31=Lists!$F$5,2,IF(M31=Lists!$F$4,3,IF(M31=Lists!$F$6,4,IF(M31=Lists!$F$7,5,IF(M31=Lists!$F$8,6,0))))))","v":0},null,{"$f":"IF(O31=Lists!$F$3,1,IF(O31=Lists!$F$5,2,IF(O31=Lists!$F$4,3,IF(O31=Lists!$F$6,4,IF(O31=Lists!$F$7,5,IF(O31=Lists!$F$8,6,0))))))","v":0},null,{"$f":"IF(Q31=Lists!$F$3,1,IF(Q31=Lists!$F$5,2,IF(Q31=Lists!$F$4,3,IF(Q31=Lists!$F$6,4,IF(Q31=Lists!$F$7,5,IF(Q31=Lists!$F$8,6,0))))))","v":0},null,{"$f":"IF(S31=Lists!$F$3,1,IF(S31=Lists!$F$5,2,IF(S31=Lists!$F$4,3,IF(S31=Lists!$F$6,4,IF(S31=Lists!$F$7,5,IF(S31=Lists!$F$8,6,0))))))","v":0},null,{"$f":"IF(U31=Lists!$F$3,1,IF(U31=Lists!$F$5,2,IF(U31=Lists!$F$4,3,IF(U31=Lists!$F$6,4,IF(U31=Lists!$F$7,5,IF(U31=Lists!$F$8,6,0))))))","v":0},null,{"$f":"IF(W31=Lists!$F$3,1,IF(W31=Lists!$F$5,2,IF(W31=Lists!$F$4,3,IF(W31=Lists!$F$6,4,IF(W31=Lists!$F$7,5,IF(W31=Lists!$F$8,6,0))))))","v":0}]
[null,null,null,null,{"$f":"IF(E32=Lists!$F$3,1,IF(E32=Lists!$F$5,2,IF(E32=Lists!$F$4,3,IF(E32=Lists!$F$6,4,IF(E32=Lists!$F$7,5,IF(E32=Lists!$F$8,6,0))))))","v":0},null,{"$f":"IF(G32=Lists!$F$3,1,IF(G32=Lists!$F$5,2,IF(G32=Lists!$F$4,3,IF(G32=Lists!$F$6,4,IF(G32=Lists!$F$7,5,IF(G32=Lists!$F$8,6,0))))))","v":0},null,{"$f":"IF(I32=Lists!$F$3,1,IF(I32=Lists!$F$5,2,IF(I32=Lists!$F$4,3,IF(I32=Lists!$F$6,4,IF(I32=Lists!$F$7,5,IF(I32=Lists!$F$8,6,0))))))","v":0},null,{"$f":"IF(K32=Lists!$F$3,1,IF(K32=Lists!$F$5,2,IF(K32=Lists!$F$4,3,IF(K32=Lists!$F$6,4,IF(K32=Lists!$F$7,5,IF(K32=Lists!$F$8,6,0))))))","v":0},null,{"$f":"IF(M32=Lists!$F$3,1,IF(M32=Lists!$F$5,2,IF(M32=Lists!$F$4,3,IF(M32=Lists!$F$6,4,IF(M32=Lists!$F$7,5,IF(M32=Lists!$F$8,6,0))))))","v":0},null,{"$f":"IF(O32=Lists!$F$3,1,IF(O32=Lists!$F$5,2,IF(O32=Lists!$F$4,3,IF(O32=Lists!$F$6,4,IF(O32=Lists!$F$7,5,IF(O32=Lists!$F$8,6,0))))))","v":0},null,{"$f":"IF(Q32=Lists!$F$3,1,IF(Q32=Lists!$F$5,2,IF(Q32=Lists!$F$4,3,IF(Q32=Lists!$F$6,4,IF(Q32=Lists!$F$7,5,IF(Q32=Lists!$F$8,6,0))))))","v":0},null,{"$f":"IF(S32=Lists!$F$3,1,IF(S32=Lists!$F$5,2,IF(S32=Lists!$F$4,3,IF(S32=Lists!$F$6,4,IF(S32=Lists!$F$7,5,IF(S32=Lists!$F$8,6,0))))))","v":0},null,{"$f":"IF(U32=Lists!$F$3,1,IF(U32=Lists!$F$5,2,IF(U32=Lists!$F$4,3,IF(U32=Lists!$F$6,4,IF(U32=Lists!$F$7,5,IF(U32=Lists!$F$8,6,0))))))","v":0},null,{"$f":"IF(W32=Lists!$F$3,1,IF(W32=Lists!$F$5,2,IF(W32=Lists!$F$4,3,IF(W32=Lists!$F$6,4,IF(W32=Lists!$F$7,5,IF(W32=Lists!$F$8,6,0))))))","v":0}]
[null,null,null,null,{"$f":"IF(E33=Lists!$F$3,1,IF(E33=Lists!$F$5,2,IF(E33=Lists!$F$4,3,IF(E33=Lists!$F$6,4,IF(E33=Lists!$F$7,5,IF(E33=Lists!$F$8,6,0))))))","v":0},null,{"$f":"IF(G33=Lists!$F$3,1,IF(G33=Lists!$F$5,2,IF(G33=Lists!$F$4,3,IF(G33=Lists!$F$6,4,IF(G33=Lists!$F$7,5,IF(G33=Lists!$F$8,6,0))))))","v":0},null,{"$f":"IF(I33=Lists!$F$3,1,IF(I33=Lists!$F$5,2,IF(I33=Lists!$F$4,3,IF(I33=Lists!$F$6,4,IF(I33=Lists!$F$7,5,IF(I33=Lists!$F$8,6,0))))))","v":0},null,{"$f":"IF(K33=Lists!$F$3,1,IF(K33=Lists!$F$5,2,IF(K33=Lists!$F$4,3,IF(K33=Lists!$F$6,4,IF(K33=Lists!$F$7,5,IF(K33=Lists!$F$8,6,0))))))","v":0},null,{"$f":"IF(M33=Lists!$F$3,1,IF(M33=Lists!$F$5,2,IF(M33=Lists!$F$4,3,IF(M33=Lists!$F$6,4,IF(M33=Lists!$F$7,5,IF(M33=Lists!$F$8,6,0))))))","v":0},null,{"$f":"IF(O33=Lists!$F$3,1,IF(O33=Lists!$F$5,2,IF(O33=Lists!$F$4,3,IF(O33=Lists!$F$6,4,IF(O33=Lists!$F$7,5,IF(O33=Lists!$F$8,6,0))))))","v":0},null,{"$f":"IF(Q33=Lists!$F$3,1,IF(Q33=Lists!$F$5,2,IF(Q33=Lists!$F$4,3,IF(Q33=Lists!$F$6,4,IF(Q33=Lists!$F$7,5,IF(Q33=Lists!$F$8,6,0))))))","v":0},null,{"$f":"IF(S33=Lists!$F$3,1,IF(S33=Lists!$F$5,2,IF(S33=Lists!$F$4,3,IF(S33=Lists!$F$6,4,IF(S33=Lists!$F$7,5,IF(S33=Lists!$F$8,6,0))))))","v":0},null,{"$f":"IF(U33=Lists!$F$3,1,IF(U33=Lists!$F$5,2,IF(U33=Lists!$F$4,3,IF(U33=Lists!$F$6,4,IF(U33=Lists!$F$7,5,IF(U33=Lists!$F$8,6,0))))))","v":0},null,{"$f":"IF(W33=Lists!$F$3,1,IF(W33=Lists!$F$5,2,IF(W33=Lists!$F$4,3,IF(W33=Lists!$F$6,4,IF(W33=Lists!$F$7,5,IF(W33=Lists!$F$8,6,0))))))","v":0}]
[null,null,null,null,{"$f":"IF(E34=Lists!$F$3,1,IF(E34=Lists!$F$5,2,IF(E34=Lists!$F$4,3,IF(E34=Lists!$F$6,4,IF(E34=Lists!$F$7,5,IF(E34=Lists!$F$8,6,0))))))","v":0},null,{"$f":"IF(G34=Lists!$F$3,1,IF(G34=Lists!$F$5,2,IF(G34=Lists!$F$4,3,IF(G34=Lists!$F$6,4,IF(G34=Lists!$F$7,5,IF(G34=Lists!$F$8,6,0))))))","v":0},null,{"$f":"IF(I34=Lists!$F$3,1,IF(I34=Lists!$F$5,2,IF(I34=Lists!$F$4,3,IF(I34=Lists!$F$6,4,IF(I34=Lists!$F$7,5,IF(I34=Lists!$F$8,6,0))))))","v":0},null,{"$f":"IF(K34=Lists!$F$3,1,IF(K34=Lists!$F$5,2,IF(K34=Lists!$F$4,3,IF(K34=Lists!$F$6,4,IF(K34=Lists!$F$7,5,IF(K34=Lists!$F$8,6,0))))))","v":0},null,{"$f":"IF(M34=Lists!$F$3,1,IF(M34=Lists!$F$5,2,IF(M34=Lists!$F$4,3,IF(M34=Lists!$F$6,4,IF(M34=Lists!$F$7,5,IF(M34=Lists!$F$8,6,0))))))","v":0},null,{"$f":"IF(O34=Lists!$F$3,1,IF(O34=Lists!$F$5,2,IF(O34=Lists!$F$4,3,IF(O34=Lists!$F$6,4,IF(O34=Lists!$F$7,5,IF(O34=Lists!$F$8,6,0))))))","v":0},null,{"$f":"IF(Q34=Lists!$F$3,1,IF(Q34=Lists!$F$5,2,IF(Q34=Lists!$F$4,3,IF(Q34=Lists!$F$6,4,IF(Q34=Lists!$F$7,5,IF(Q34=Lists!$F$8,6,0))))))","v":0},null,{"$f":"IF(S34=Lists!$F$3,1,IF(S34=Lists!$F$5,2,IF(S34=Lists!$F$4,3,IF(S34=Lists!$F$6,4,IF(S34=Lists!$F$7,5,IF(S34=Lists!$F$8,6,0))))))","v":0},null,{"$f":"IF(U34=Lists!$F$3,1,IF(U34=Lists!$F$5,2,IF(U34=Lists!$F$4,3,IF(U34=Lists!$F$6,4,IF(U34=Lists!$F$7,5,IF(U34=Lists!$F$8,6,0))))))","v":0},null,{"$f":"IF(W34=Lists!$F$3,1,IF(W34=Lists!$F$5,2,IF(W34=Lists!$F$4,3,IF(W34=Lists!$F$6,4,IF(W34=Lists!$F$7,5,IF(W34=Lists!$F$8,6,0))))))","v":0}]
[null,null,null,null,{"$f":"IF(E35=Lists!$F$3,1,IF(E35=Lists!$F$5,2,IF(E35=Lists!$F$4,3,IF(E35=Lists!$F$6,4,IF(E35=Lists!$F$7,5,IF(E35=Lists!$F$8,6,0))))))","v":0},null,{"$f":"IF(G35=Lists!$F$3,1,IF(G35=Lists!$F$5,2,IF(G35=Lists!$F$4,3,IF(G35=Lists!$F$6,4,IF(G35=Lists!$F$7,5,IF(G35=Lists!$F$8,6,0))))))","v":0},null,{"$f":"IF(I35=Lists!$F$3,1,IF(I35=Lists!$F$5,2,IF(I35=Lists!$F$4,3,IF(I35=Lists!$F$6,4,IF(I35=Lists!$F$7,5,IF(I35=Lists!$F$8,6,0))))))","v":0},null,{"$f":"IF(K35=Lists!$F$3,1,IF(K35=Lists!$F$5,2,IF(K35=Lists!$F$4,3,IF(K35=Lists!$F$6,4,IF(K35=Lists!$F$7,5,IF(K35=Lists!$F$8,6,0))))))","v":0},null,{"$f":"IF(M35=Lists!$F$3,1,IF(M35=Lists!$F$5,2,IF(M35=Lists!$F$4,3,IF(M35=Lists!$F$6,4,IF(M35=Lists!$F$7,5,IF(M35=Lists!$F$8,6,0))))))","v":0},null,{"$f":"IF(O35=Lists!$F$3,1,IF(O35=Lists!$F$5,2,IF(O35=Lists!$F$4,3,IF(O35=Lists!$F$6,4,IF(O35=Lists!$F$7,5,IF(O35=Lists!$F$8,6,0))))))","v":0},null,{"$f":"IF(Q35=Lists!$F$3,1,IF(Q35=Lists!$F$5,2,IF(Q35=Lists!$F$4,3,IF(Q35=Lists!$F$6,4,IF(Q35=Lists!$F$7,5,IF(Q35=Lists!$F$8,6,0))))))","v":0},null,{"$f":"IF(S35=Lists!$F$3,1,IF(S35=Lists!$F$5,2,IF(S35=Lists!$F$4,3,IF(S35=Lists!$F$6,4,IF(S35=Lists!$F$7,5,IF(S35=Lists!$F$8,6,0))))))","v":0},null,{"$f":"IF(U35=Lists!$F$3,1,IF(U35=Lists!$F$5,2,IF(U35=Lists!$F$4,3,IF(U35=Lists!$F$6,4,IF(U35=Lists!$F$7,5,IF(U35=Lists!$F$8,6,0))))))","v":0},null,{"$f":"IF(W35=Lists!$F$3,1,IF(W35=Lists!$F$5,2,IF(W35=Lists!$F$4,3,IF(W35=Lists!$F$6,4,IF(W35=Lists!$F$7,5,IF(W35=Lists!$F$8,6,0))))))","v":0}]
[null,null,null,null,{"$f":"IF(E36=Lists!$F$3,1,IF(E36=Lists!$F$5,2,IF(E36=Lists!$F$4,3,IF(E36=Lists!$F$6,4,IF(E36=Lists!$F$7,5,IF(E36=Lists!$F$8,6,0))))))","v":0},null,{"$f":"IF(G36=Lists!$F$3,1,IF(G36=Lists!$F$5,2,IF(G36=Lists!$F$4,3,IF(G36=Lists!$F$6,4,IF(G36=Lists!$F$7,5,IF(G36=Lists!$F$8,6,0))))))","v":0},null,{"$f":"IF(I36=Lists!$F$3,1,IF(I36=Lists!$F$5,2,IF(I36=Lists!$F$4,3,IF(I36=Lists!$F$6,4,IF(I36=Lists!$F$7,5,IF(I36=Lists!$F$8,6,0))))))","v":0},null,{"$f":"IF(K36=Lists!$F$3,1,IF(K36=Lists!$F$5,2,IF(K36=Lists!$F$4,3,IF(K36=Lists!$F$6,4,IF(K36=Lists!$F$7,5,IF(K36=Lists!$F$8,6,0))))))","v":0},null,{"$f":"IF(M36=Lists!$F$3,1,IF(M36=Lists!$F$5,2,IF(M36=Lists!$F$4,3,IF(M36=Lists!$F$6,4,IF(M36=Lists!$F$7,5,IF(M36=Lists!$F$8,6,0))))))","v":0},null,{"$f":"IF(O36=Lists!$F$3,1,IF(O36=Lists!$F$5,2,IF(O36=Lists!$F$4,3,IF(O36=Lists!$F$6,4,IF(O36=Lists!$F$7,5,IF(O36=Lists!$F$8,6,0))))))","v":0},null,{"$f":"IF(Q36=Lists!$F$3,1,IF(Q36=Lists!$F$5,2,IF(Q36=Lists!$F$4,3,IF(Q36=Lists!$F$6,4,IF(Q36=Lists!$F$7,5,IF(Q36=Lists!$F$8,6,0))))))","v":0},null,{"$f":"IF(S36=Lists!$F$3,1,IF(S36=Lists!$F$5,2,IF(S36=Lists!$F$4,3,IF(S36=Lists!$F$6,4,IF(S36=Lists!$F$7,5,IF(S36=Lists!$F$8,6,0))))))","v":0},null,{"$f":"IF(U36=Lists!$F$3,1,IF(U36=Lists!$F$5,2,IF(U36=Lists!$F$4,3,IF(U36=Lists!$F$6,4,IF(U36=Lists!$F$7,5,IF(U36=Lists!$F$8,6,0))))))","v":0},null,{"$f":"IF(W36=Lists!$F$3,1,IF(W36=Lists!$F$5,2,IF(W36=Lists!$F$4,3,IF(W36=Lists!$F$6,4,IF(W36=Lists!$F$7,5,IF(W36=Lists!$F$8,6,0))))))","v":0}]

{"sheet":"Database","index":5,"n_rows":144,"n_cols":48,"rows_kept":144,"cut":false,"hidden":true,"merged":[[3,15,3,19],[3,20,3,24],[3,25,3,29],[3,30,3,34],[3,35,3,39],[3,1,3,2],[3,3,3,5],[3,6,3,8],[3,9,3,11],[3,12,3,14]]}
[null,null,null,null,null,null,null,null,null,null,null,null,null,null,null,"EXISTING Installation / Reuse IDU",null,"New Indoor Units / New VRVIII Equiv. / Hi CoP VRVIII"]
["ODU Model",null,"Tonnes",null,null,null,null,null,null,null,null,null,null,null,null,"VRV K","VRV G H","VRVIII",{"$f":"VLOOKUP(Output!J2,Translation!$A$2:$BF$16,31,FALSE)","v":"£/kWh"},{"$f":"VLOOKUP(Output!J2,Translation!$A$2:$BF$16,15,FALSE)","v":"Carbon Equivalent"},"Cool h/y","Heat h/y","Intermediate hours","Diversity Cooling","Diversity Heating","Diversity Intermediate"]
[null,{"$f":"VLOOKUP(Output!J2,Translation!$A$2:$BF$16,29,FALSE)","v":"£/annum"},{"$f":"VLOOKUP(Output!J2,Translation!$A$2:$BF$16,30,FALSE)","v":"CO2/annum"},null,null,null,null,null,null,null,null,null,null,null,null,2.3884313079391765E-2,1.9094567954867241E-2,2.0459834671378189E-2,{"$f":"Output!H2","v":0.11},0.51700000000000002,{"$f":"Output!C2*Output!B2*Output!E2*Database!X3","v":269.5},{"$f":"Output!B2*Output!C2*Output!F2*Database!Y3","v":341.25},{"$f":"Output!B2*Output!C2*Output!G2*Z3","v":288.75},0.55000000000000004,0.65,{"$f":"(0.35+0.4)/2","v":0.375}]
[null,{"$f":"VLOOKUP(Output!$J$2,Translation!$A$2:$BF$16,7,FALSE)","v":"Existing Installation"},null,{"$f":"VLOOKUP(Output!$J$2,Translation!$A$2:$BF$16,10,FALSE)","v":"VRVQ + New IDUs"},null,null,{"$f":"VLOOKUP(Output!$J$2,Translation!$A$2:$BF$16,8,FALSE)","v":"VRVQ + Old IDUs"},null,null,{"$f":"VLOOKUP(Output!$J$2,Translation!$A$2:$BF$16,11,FALSE)","v":"Totally new VRV"},null,null,{"$f":"VLOOKUP(Output!$J$2,Translation!$A$2:$AU$6,12,FALSE)","v":"New Hi CoP VRVIII "},null,null,{"$f":"B4","v":"Existing Installation"},null,null,null,null,{"$f":"D4","v":"VRVQ + New IDUs"},null,null,null,null,{"$f":"G4","v":"VRVQ + Old IDUs"},null,null,null,null,{"$f":"J4","v":"Totally new VRV"},null,null,null,null,"Hi CoP VRVIII"]
[1,2,3,4,5,6,7,8,9,10,11,12,13,14,15,16,17,18,19,20,21,22,23,24,25,26,27,28,29,30,31,32,33,34,35,36,37,38,39,40,41,42,43,44]
["ODU Model",{"$f":"B3","v":"£/annum"},{"$f":"C3","v":"CO2/annum"},"ODU Model",{"$f":"B3","v":"£/annum"},{"$f":"C3","v":"CO2/annum"},"ODU Model",{"$f":"B3","v":"£/annum"},{"$f":"C3","v":"CO2/annum"},"ODU Model",{"$f":"B3","v":"£/annum"},{"$f":"C3","v":"CO2/annum"},"ODU Model",{"$f":"B3","v":"£/annum"},{"$f":"C3","v":"CO2/annum"},"ODU cool","ODU heat","IDU PI","Duty","kW / year","ODU cool","ODU heat","IDU PI","Duty","kW / year","ODU cool","ODU heat","IDU PI","Duty","kW / year","ODU cool","ODU heat","IDU PI","Duty","kW / year","ODU cool","ODU heat","IDU PI","Duty","kW / year",null,0.5,1.3]
[{"$f":"VLOOKUP(Output!J2,Translation!$A$2:$AL$6,21,FALSE)","v":"Click here >>>"},null,null,null,null,null,null,null,null,null,null,null,null,null,null,null,null,null,null,null,null,null,null,null,null,null,null,null,null,null,null,null,null,null,null,null,null,null,null,null,"Quantity","Min Index","Max Index","Max Unit"]
["RSXY5G/H",{"$f":"T8*$S$3","v":0},{"$f":"T8*($T$3/1000)","v":0},"RQYQ140P",{"$f":"Y8*$S$3","v":0},{"$f":"Y8*($T$3/1000)","v":0},null,null,null,null,null,null,null,null,null,6.1,5.58,{"$f":"S8*$P$3","v":0.33438038311148471},14,{"$f":"((P8*$U$3)+(Q8*$V$3))*AO8","v":0},3.36,3.91,{"$f":"X8*$R$3","v":0.28643768539929465},14,{"$f":"((U8*$U$3)+(V8*$V$3))*AO8","v":0},null,null,null,null,null,null,null,null,null,null,null,null,null,null,null,{"$f":"COUNTIF(Output!$D$5:$V$5,Database!A8)","v":0},62.5,162.5,8,null,3.52,3.9997781794609537,"RXYQ5P"]
["RSXY8G/H",0,0,{"$f":"G9","v":"RXYQQ8T"},{"$f":"Y9*$S$3","v":0},{"$f":"Y9*($T$3/1000)","v":0},"RXYQQ8T",{"$f":"AD9*$S$3","v":0},{"$f":"AD9*($T$3/1000)","v":0},"RYYQ8T",{"$f":"AI9*$S$3","v":0},{"$f":"AI9*($T$3/1000)","v":0},null,null,null,9.43,8.14,{"$f":"S9*$P$3","v":0.53500861297837554},22.4,{"$f":"((P9*$U$3)+(Q9*$V$3))*AO9","v":0},{"$f":"AE9","v":4.1680000000000001},{"$f":"AF9","v":5.51},{"$f":"X9*$R$3","v":0.4583002966388714},{"$f":"AH9","v":22.4},{"$f":"((U9*$U$3)+(V9*$V$3))*AO9","v":0},{"$f":"AE9","v":4.1680000000000001},{"$f":"AF9","v":5.51},{"$f":"AC9*$R$3","v":0.4583002966388714},{"$f":"AH9","v":22.4},{"$f":"((Z9*$U$3)+(AA9*$V$3))*AO9","v":0},{"$f":"5.21*0.8","v":4.1680000000000001},5.51,{"$f":"AH9*$R$3","v":0.4583002966388714},22.4,{"$f":"((AE9*$U$3)+(AF9*$V$3))*AO9","v":0},null,null,null,null,null,{"$f":"COUNTIF(Output!$D$5:$V$5,Database!A9)","v":0},100,260,8,null,5.22,5.559691669450725,"RXYQ8P8"]
["RSXY10G/H",0,0,{"$f":"G10","v":"RXYQQ10T"},{"$f":"Y10*$S$3","v":0},{"$f":"Y10*($T$3/1000)","v":0},"RXYQQ10T",0,0,"RYYQ10T",{"$f":"AI10*$S$3","v":0},{"$f":"AI10*($T$3/1000)","v":0},null,null,null,11.8,9.5399999999999991,{"$f":"S10*$P$3","v":0.66876076622296943},28,0,{"$f":"AE10","v":5.84},{"$f":"AF10","v":7.38},{"$f":"X10*$R$3","v":0.5728753707985893},{"$f":"AH10","v":28},0,{"$f":"AE10","v":5.84},{"$f":"AF10","v":7.38},{"$f":"AC10*$R$3","v":0.5728753707985893},{"$f":"AH10","v":28},0,{"$f":"7.3*0.8","v":5.84},7.38,{"$f":"AH10*$R$3","v":0.5728753707985893},28,0,null,null,null,null,null,{"$f":"COUNTIF(Output!$D$5:$V$5,Database!A10)","v":0},125,325,8,null,7.42,7.6995619549255281,"RXYQ10P"]
["RSEY8G/H",0,0,"RQCEQ180_280P",{"$f":"Y11*$S$3","v":0},{"$f":"Y11*($T$3/1000)","v":0},{"$f":"D11","v":"RQCEQ180_280P"},0,0,"REYQ8P9",{"$f":"AI11*$S$3","v":0},{"$f":"AI11*($T$3/1000)","v":0},null,null,null,9.4,8.14,0.53500861297837554,22.4,0,6,7,{"$f":"X11*$R$3","v":0.5728753707985893},28,0,{"$f":"U11","v":6},{"$f":"V11","v":7},{"$f":"AC11*$R$3","v":0.5728753707985893},{"$f":"X11","v":28},0,5.2,5.71,{"$f":"AH11*$R$3","v":0.4583002966388714},22.4,0,null,null,null,null,null,{"$f":"COUNTIF(Output!$D$5:$V$5,Database!A11)","v":0},100,260,8,null,5.2,5.7096833511805114,"REYQ8P9"]
["RSEY10G/H",0,0,"RQCEQ280P",{"$f":"Y12*$S$3","v":0},{"$f":"Y12*($T$3/1000)","v":0},{"$f":"D12","v":"RQCEQ280P"},0,0,"REYQ10P9",{"$f":"AI12*$S$3","v":0},{"$f":"AI12*($T$3/1000)","v":0},null,null,null,11.8,9.5399999999999991,0.66876076622296943,28,0,7.04,8,{"$f":"X12*$R$3","v":0.5728753707985893},28,0,{"$f":"U12","v":7.04},{"$f":"V12","v":8},0.5728753707985893,{"$f":"X12","v":28},0,7.09,7.38,{"$f":"AH12*$R$3","v":0.5728753707985893},28,0,null,null,null,null,null,{"$f":"COUNTIF(Output!$D$5:$V$5,Database!A12)","v":0},125,325,8,null,7.09,7.3795801593961556,"REYQ10P8"]
["RSXY5K7",0,0,{"$f":"G13","v":"RXYQQ8T"},{"$f":"Y13*$S$3","v":0},{"$f":"Y13*($T$3/1000)","v":0},"RXYQQ8T",{"$f":"AD13*$S$3","v":0},{"$f":"AD13*($T$3/1000)","v":0},{"$f":"J14","v":"RYYQ8T"},{"$f":"AI13*$S$3","v":0},{"$f":"AI13*($T$3/1000)","v":0},null,null,null,6.1,5.4,0.33438038311148471,14,0,{"$f":"AE13","v":0},{"$f":"AF13","v":0},{"$f":"X13*$R$3","v":0.43784046196749321},{"$f":"AH13","v":21.4},0,{"$f":"AE13","v":0},{"$f":"AF13","v":0},{"$f":"AC13*$R$3","v":0.43784046196749321},{"$f":"AH13","v":21.4},{"$f":"((Z13*$U$3)+(AA13*$V$3))*AO13","v":0},{"$f":"AE8","v":0},0,{"$f":"AH13*$R$3","v":0.43784046196749321},21.4,{"$f":"((AE13*$U$3)+(AF13*$V$3))*AO13","v":0},null,null,null,null,null,{"$f":"COUNTIF(Output!$D$5:$V$5,Database!A13)","v":0},62.5,162.5,8,null,3.52,3.9997781794609537,{"$f":"AV8","v":"RXYQ5P"}]
["RSXY8K7",598.62110000000007,2.8135191700000002,{"$f":"G14","v":"RXYQQ8T"},330.39198500000003,1.5528423295,"RXYQQ8T",330.39198500000003,1.5528423295,{"$f":"J9","v":"RYYQ8T"},{"$f":"AI14*$S$3","v":330.39198500000003},{"$f":"AI14*($T$3/1000)","v":1.5528423295},null,null,null,9.43,8.5,0.53500861297837554,22.4,5442.01,{"$f":"AE14","v":4.1680000000000001},{"$f":"AF14","v":5.51},0.4583002966388714,{"$f":"AH14","v":22.4},3003.5635000000002,4.1680000000000001,5.51,0.4583002966388714,22.4,{"$f":"((Z14*$U$3)+(AA14*$V$3))*AO14","v":3003.5635000000002},4.1680000000000001,5.51,{"$f":"AH14*$R$3","v":0.4583002966388714},22.4,3003.5635000000002,null,null,null,null,null,{"$f":"COUNTIF(Output!$D$5:$V$5,Database!A14)","v":1},100,260,13,null,5.22,5.559691669450725,{"$f":"AV9","v":"RXYQ8P8"}]
["RSXY10K7",0,0,"RXYQQ10T",0,0,"RXYQQ10T",0,0,{"$f":"J10","v":"RYYQ10T"},0,0,null,null,null,11.8,10.5,0.66876076622296943,28,0,5.84,7.38,0.5728753707985893,28,0,5.84,7.38,0.5728753707985893,28,0,5.84,7.38,0.5728753707985893,28,0,null,null,null,null,null,{"$f":"COUNTIF(Output!$D$5:$V$5,Database!A15)","v":0},125,325,16,null,7.42,7.6995619549255281,{"$f":"AV10","v":"RXYQ10P"}]
["RXY16K",0,0,"RXYQQ16T",0,0,"RXYQQ16T",0,0,"RYYQ16T",0,0,"RXYHQ16P",{"$f":"AN16*$S$3","v":0},{"$f":"AN16*($T$3/1000)","v":0},17,13.5,1.096289970344082,45.9,0,10.4,12.8,0.92069256021201851,45,0,10.4,12.8,0.92069256021201851,45,0,{"$f":"13*0.8","v":10.4},12.8,0.92069256021201851,45,0,10.49,11.11,{"$f":"AM16*$R$3","v":0.9094396511427606},44.45,{"$f":"((AJ16*$U$3)+(AK16*$V$3)+(AL16*$W$3))*AO16","v":0},{"$f":"COUNTIF(Output!$D$5:$V$5,Database!A16)","v":0},200,520,20,null,14.2,12.89928000463556,"RXYQ16PA"]
["RXY18K",0,0,"RXYQQ18T",0,0,"RXYQQ18T",0,0,"RYYQ18T",0,0,"RXYHQ18P",0,0,19.7,14.8,1.232430554896615,51.6,0,11.76,14.4,1.0229917335689094,50,0,11.76,14.4,1.0229917335689094,50,0,{"$f":"14.7*0.8","v":11.76},14.4,1.0229917335689094,50,0,12.25,13.23,1.041200986426436,50.89,0,{"$f":"COUNTIF(Output!$D$5:$V$5,Database!A17)","v":0},225,585,20,null,16.2,15.299146052009615,"RXYQ18PA"]
["RXY20K",0,0,"RXYQQ20T",0,0,"RXYQQ20T",0,0,"RYYQ20T",0,0,"RXYHQ20P",0,0,21.9,16.100000000000001,1.368571139449148,57.3,0,14.8,17,1.1457507415971786,56,0,14.8,17,1.1457507415971786,56,0,{"$f":"18.5*0.8","v":14.8},17,1.1457507415971786,56,0,13.8,14,1.1437047581300408,55.9,0,{"$f":"COUNTIF(Output!$D$5:$V$5,Database!A18)","v":0},250,650,20,null,14.71,14.951311073013825,"RXYQ20P8"]
["RXY24K",0,0,"RXYQQ24T",0,0,"RXYQQ24T",0,0,"RYYQ24T",0,0,"RXYHQ24P",0,0,27.2,20.399999999999999,1.6432407398621534,68.8,0,14.56,18.3,1.37899285685089,67.400000000000006,0,14.56,18.3,1.37899285685089,67.400000000000006,0,{"$f":"18.2*0.8","v":14.56},18.3,1.37899285685089,67.400000000000006,0,15.62,16.670000000000002,1.3708089229823386,67,0,{"$f":"COUNTIF(Output!$D$5:$V$5,Database!A19)","v":0},300,780,30,null,19.2,18.899999999999999,"RXYQ24P8"]
["RXY26K",0,0,"RXYQQ26T",0,0,"RXYQQ26T",0,0,"RYYQ26T",0,0,"RXYHQ26P",0,0,29.1,20.9,1.7817697557226255,74.599999999999994,0,16,20.3,1.5037978483462968,73.5,0,16,20.3,1.5037978483462968,73.5,0,{"$f":"20*0.8","v":16},20.3,1.5037978483462968,73.5,0,17.46,18.78,1.4608321955364028,71.400000000000006,0,{"$f":"COUNTIF(Output!$D$5:$V$5,Database!A20)","v":0},325,845,30,null,20.94,20.684126942527822,"RXYQ26P8"]
["RXY28K",0,0,"RXYQQ28T",0,0,"RXYQQ28T",0,0,"RYYQ28T",0,0,"RXYHQ28P",0,0,31.2,23.8,1.9155219089672195,80.2,0,17.600000000000001,21.9,1.6060970217031878,78.5,0,17.600000000000001,21.9,1.6060970217031878,78.5,0,{"$f":"22*0.8","v":17.600000000000001},21.9,1.6060970217031878,78.5,0,18.690000000000001,19.82,1.5911613423930817,77.77,0,{"$f":"COUNTIF(Output!$D$5:$V$5,Database!A21)","v":0},350,910,30,null,23.62,22.998707433802064,"RXYQ28P8"]
["RXY30K",0,0,"RXYQQ30T",0,0,"RXYQQ30T",0,0,"RYYQ30T",0,0,"RXYHQ30P",0,0,33.9,25.8,2.0540509248276919,86,0,18.96,23.5,1.7083961950600788,83.5,0,18.96,23.5,1.7083961950600788,83.5,0,{"$f":"23.7*0.8","v":18.96},23.5,1.7083961950600788,83.5,0,20.83,21.81,1.6879363603887005,82.5,0,{"$f":"COUNTIF(Output!$D$5:$V$5,Database!A22)","v":0},375,975,30,null,25.78,24.698610807754417,"RXYQ30P8"]
[]
["RSEY8KL",0,0,"RQCEQ180_280P",{"$f":"Y24*$S$3","v":0},{"$f":"Y24*($T$3/1000)","v":0},"RQCEQ180_280P",{"$f":"AD24*$S$3","v":0},{"$f":"AD24*($T$3/1000)","v":0},{"$f":"J11","v":"REYQ8P9"},{"$f":"AI24*$S$3","v":0},{"$f":"AI24*($T$3/1000)","v":0},null,null,null,9.43,8.48,0.53500861297837554,22.4,0,6,7,{"$f":"X24*$R$3","v":0.45011636277032013},22,0,6,7,{"$f":"AC24*$P$3","v":0.52545488774661886},22,{"$f":"((Z24*$U$3)+(AA24*$V$3))*AO24","v":0},{"$f":"AE11","v":5.2},{"$f":"AF11","v":5.71},{"$f":"AH24*$R$3","v":0.4583002966388714},{"$f":"AH11","v":22.4},{"$f":"((AE24*$U$3)+(AF24*$V$3))*AO24","v":0},null,null,null,null,null,{"$f":"COUNTIF(Output!$D$5:$V$5,Database!A24)","v":0},100,260,8,null,5.2,5.7096833511805114,"REYQ8P9"]
["RSEY10KL",0,0,"RQCEQ280P",0,0,"RQCEQ280P",0,0,{"$f":"J12","v":"REYQ10P9"},0,0,null,null,null,11.8,10.5,0.66876076622296943,28,0,7.04,8,0.5728753707985893,28,0,7.04,8,0.66876076622296943,28,{"$f":"((Z25*$U$3)+(AA25*$V$3))*AO25","v":0},{"$f":"AE12","v":7.09},{"$f":"AF12","v":7.38},0.5728753707985893,{"$f":"AH12","v":28},{"$f":"((AE25*$U$3)+(AF25*$V$3))*AO25","v":0},null,null,null,null,null,{"$f":"COUNTIF(Output!$D$5:$V$5,Database!A25)","v":0},125,325,8,null,7.09,7.3795801593961556,"REYQ10P8"]
["REY16K",0,0,"RQCEQ460P",0,0,"RQCEQ460P",0,0,"REYQ16P9",0,0,null,null,null,17,13.5,1.096289970344082,45.9,0,12.2,13.4,0.92069256021201851,45,0,12.2,13.4,1.0747940885726295,45,0,14.4,12.8,0.92069256021201851,45,0,null,null,null,null,null,{"$f":"COUNTIF(Output!$D$5:$V$5,Database!A26)","v":0},200,520,20,null,14.1,12.799285585994975,"REYQ16P8"]
["REY18K",0,0,"RQCEQ500P",0,0,"RQCEQ500P",0,0,"REYQ18P9",0,0,null,null,null,19.7,14.8,1.232430554896615,51.6,0,13.9,14.7,1.0229917335689094,50,0,13.9,14.7,1.1942156539695883,50,0,12.7,13.4,1.0311756674374606,50.4,0,null,null,null,null,null,{"$f":"COUNTIF(Output!$D$5:$V$5,Database!A27)","v":0},225,585,20,null,12.7,13.399252097838486,"REYQ18P8"]
["REY20K",0,0,"RQCEQ540P",0,0,"RQCEQ540P",0,0,"REYQ20P9",0,0,null,null,null,21.9,16.100000000000001,1.368571139449148,57.3,0,15.5,16.100000000000001,1.1048310722544221,54,0,15.5,16.100000000000001,1.2897529062871553,54,0,14.9,15.2,1.1437047581300408,55.9,0,null,null,null,null,null,{"$f":"COUNTIF(Output!$D$5:$V$5,Database!A28)","v":0},250,650,20,null,14.9,15.199144005360102,"REYQ20P8"]
["REY24K",0,0,"RQCEQ712P",0,0,"RQCEQ712P",0,0,"REYQ24P9",0,0,null,null,null,27.2,20.399999999999999,1.6432407398621534,68.8,0,21.2,20.7,1.4567402286021272,71.2,0,21.2,20.7,1.7005630912526937,71.2,0,19.2,18.899999999999999,1.3708089229823386,67,0,null,null,null,null,null,{"$f":"COUNTIF(Output!$D$5:$V$5,Database!A29)","v":0},300,780,30,null,19.2,18.898947381364255,"REYQ24P8"]
["REY26K",0,0,"RQCEQ744P",0,0,"RQCEQ744P",0,0,"REYQ26P9",0,0,null,null,null,29.1,20.9,1.7817697557226255,74.599999999999994,0,23.3,21.2,1.514027765681986,74,0,23.3,21.2,1.7674391678749906,74,0,21.6,20.6,1.4935679310106078,73,0,null,null,null,null,null,{"$f":"COUNTIF(Output!$D$5:$V$5,Database!A30)","v":0},325,845,30,null,21.6,20.598852505071513,"REYQ26P8"]
["REY28K",0,0,"RQCEQ816P",0,0,"RQCEQ816P",0,0,"REYQ28P9",0,0,null,null,null,31.2,23.8,1.9155219089672195,80.2,0,27.1,23.1,1.6572466083816333,81,0,27.1,23.1,1.9346293594307329,81,0,23.8,22.3,1.6060970217031878,78.5,0,null,null,null,null,null,{"$f":"COUNTIF(Output!$D$5:$V$5,Database!A31)","v":0},350,910,30,null,23.8,22.298746772773306,"REYQ28P8"]
["REY30K",0,0,"RQCEQ848P",0,0,"RQCEQ848P",0,0,"REYQ30P9",0,0,null,null,null,33.9,25.8,2.0540509248276919,86,0,29.2,23.6,1.7349939801328704,84.8,0,29.2,23.6,2.0253897491324215,84.8,0,26.6,25.8,1.739085947067146,85,0,null,null,null,null,null,{"$f":"COUNTIF(Output!$D$5:$V$5,Database!A32)","v":0},375,975,30,null,26.6,24.198638929054933,"REYQ30P8"]
[]
["RSXYP5K7",0,0,{"$f":"G34","v":"RXYQQ8T"},{"$f":"Y34*$S$3","v":0},{"$f":"Y34*($T$3/1000)","v":0},{"$f":"G13","v":"RXYQQ8T"},{"$f":"AD34*$S$3","v":0},{"$f":"AD34*($T$3/1000)","v":0},{"$f":"J35","v":"RYYQ8T"},{"$f":"AI34*$S$3","v":0},{"$f":"AI34*($T$3/1000)","v":0},null,null,null,6.1,5.74,0.33438038311148471,14,0,{"$f":"U13","v":0},{"$f":"V13","v":0},{"$f":"X34*$R$3","v":0.43784046196749321},{"$f":"X13","v":21.4},0,{"$f":"Z13","v":0},{"$f":"AA13","v":0},0.51112429989898378,{"$f":"AC13","v":21.4},{"$f":"((Z34*$U$3)+(AA34*$V$3))*AO34","v":0},{"$f":"AE8","v":0},0,{"$f":"AH34*$R$3","v":0},{"$f":"AH8","v":0},{"$f":"((AE34*$U$3)+(AF34*$V$3))*AO34","v":0},null,null,null,null,null,{"$f":"COUNTIF(Output!$D$5:$V$5,Database!A34)","v":0},62.5,162.5,8,null,3.52,3.9997781794609537,"RXYQ5P"]
["RSXYP8K7",0,0,{"$f":"G35","v":"RXYQQ8T"},0,0,{"$f":"G14","v":"RXYQQ8T"},0,0,{"$f":"J9","v":"RYYQ8T"},0,0,null,null,null,9.43,8.7899999999999991,0.53500861297837554,22.4,0,{"$f":"U14","v":4.1680000000000001},5.51,0.4583002966388714,{"$f":"X14","v":22.4},0,{"$f":"Z14","v":4.1680000000000001},5.51,0.53500861297837554,{"$f":"AC14","v":22.4},{"$f":"((Z35*$U$3)+(AA35*$V$3))*AO35","v":0},4.1680000000000001,5.51,{"$f":"AH35*$R$3","v":0.4583002966388714},{"$f":"AH9","v":22.4},{"$f":"((AE35*$U$3)+(AF35*$V$3))*AO35","v":0},null,null,null,null,null,{"$f":"COUNTIF(Output!$D$5:$V$5,Database!A35)","v":0},100,260,13,null,5.22,5.559691669450725,"RXYQ8P8"]
["RSXYP10K7",0,0,"RXYQQ10T",0,0,"RXYQQ10T",0,0,"RYYQ10T",0,0,null,null,null,11.8,11.2,0.66876076622296943,28,0,5.84,7.38,0.5728753707985893,28,0,5.84,7.38,0.66876076622296943,28,0,{"$f":"AE10","v":5.84},7.38,0.5728753707985893,{"$f":"AH10","v":28},0,null,null,null,null,null,{"$f":"COUNTIF(Output!$D$5:$V$5,Database!A36)","v":0},125,325,16,null,7.42,7.6995619549255281,"RXYQ10P"]
["RSXYP16J",0,0,"RXYQQ16T",0,0,"RXYQQ16T",0,0,{"$f":"J16","v":"RYYQ16T"},0,0,"RXYHQ16P",{"$f":"AN37*$S$3","v":0},{"$f":"AN37*($T$3/1000)","v":0},15.7,14.2,1.0461329128773593,43.8,0,10.4,12.8,0.92069256021201851,45,0,10.4,12.8,1.0747940885726295,45,0,{"$f":"AE16","v":10.4},{"$f":"AF16","v":12.8},0.92069256021201851,{"$f":"AH16","v":45},0,10.49,11.479359259939242,{"$f":"AM37*$R$3","v":0.9094396511427606},44.45,{"$f":"((AJ37*$U$3)+(AK37*$V$3)+(AL37*$W$3))*AO37","v":0},{"$f":"COUNTIF(Output!$D$5:$V$5,Database!A37)","v":0},200,520,20,null,14.2,12.89928000463556,"RXYQ16PA"]
["RSXYP18J",0,0,"RXYQQ18T",0,0,"RXYQQ18T",0,0,{"$f":"J17","v":"RYYQ18T"},0,0,"RXYHQ18P",0,0,18.100000000000001,15.5,1.1774966348140139,49.3,0,11.76,14.4,1.0229917335689094,50,0,11.76,14.4,1.1942156539695883,50,0,{"$f":"AE17","v":11.76},14.4,1.0229917335689094,{"$f":"AH17","v":50},0,12.25,12.919278888363674,1.041200986426436,50.89,0,{"$f":"COUNTIF(Output!$D$5:$V$5,Database!A38)","v":0},225,585,20,null,16.2,15.299146052009615,"RXYQ18PA"]
["RSXYP20J",0,0,"RXYQQ20T",0,0,"RXYQQ20T",0,0,"RYYQ20T",0,0,"RXYHQ20P",0,0,20.2,16.899999999999999,1.3064719254427295,54.7,0,14.8,17,1.1457507415971786,56,0,14.8,17,1.3375215324459389,56,0,{"$f":"AE18","v":14.8},17,1.1457507415971786,56,0,13.8,14.799176080885758,1.1437047581300408,55.9,0,{"$f":"COUNTIF(Output!$D$5:$V$5,Database!A39)","v":0},250,650,20,null,14.71,14.951311073013825,"RXYQ20P8"]
["RSXYP24J",0,0,"RXYQQ24T",0,0,"RXYQQ24T",0,0,"RYYQ24T",0,0,"RXYHQ24P",0,0,25,21.4,1.5691993693160391,65.7,0,14.56,18.3,1.37899285685089,67.400000000000006,0,14.56,18.3,1.609802701551005,67.400000000000006,0,{"$f":"AE19","v":14.56},18.3,1.37899285685089,67.400000000000006,0,15.62,18.118990822768271,1.3845170122121622,67.67,0,{"$f":"COUNTIF(Output!$D$5:$V$5,Database!A40)","v":0},300,780,32,null,19.2,18.899999999999999,"RXYQ24P8"]
["RSXYP26J",0,0,"RXYQQ26T",0,0,"RXYQQ26T",0,0,"RYYQ26T",0,0,"RXYHQ26P",0,0,26.9,21.9,1.7005630912526937,71.2,0,16,20.3,1.5037978483462968,73.5,0,16,20.3,1.7554970113352948,73.5,0,{"$f":"AE20","v":16},20.3,1.5037978483462968,73.5,0,17.46,18.658960570127885,1.4608321955364028,71.400000000000006,0,{"$f":"COUNTIF(Output!$D$5:$V$5,Database!A41)","v":0},325,845,32,null,20.94,20.684126942527822,"RXYQ26P8"]
["RSXYP28J",0,0,"RXYQQ28T",0,0,"RXYQQ28T",0,0,"RYYQ28T",0,0,"RXYHQ28P",0,0,28.7,23.9,1.829538381881409,76.599999999999994,0,17.600000000000001,21.9,1.6060970217031878,78.5,0,17.600000000000001,21.9,1.8749185767322536,78.5,0,{"$f":"AE21","v":17.600000000000001},21.9,1.6060970217031878,78.5,0,18.690000000000001,20.098870409540066,1.61162117706446,78.77,0,{"$f":"COUNTIF(Output!$D$5:$V$5,Database!A42)","v":0},350,910,32,null,23.62,22.998707433802064,"RXYQ28P8"]
["RSXYP30J",0,0,"RXYQQ30T",0,0,"RXYQQ30T",0,0,"RYYQ30T",0,0,"RXYHQ30P",0,0,31.2,27.1,1.9609021038180638,82.1,0,18.96,23.5,1.7083961950600788,83.5,0,18.96,23.5,1.9943401421292124,83.5,0,{"$f":"AE22","v":18.96},23.5,1.7083961950600788,83.5,0,20.83,21.978773217200747,1.6879363603887005,82.5,0,{"$f":"COUNTIF(Output!$D$5:$V$5,Database!A43)","v":0},375,975,32,null,25.78,24.698610807754417,"RXYQ30P8"]
[]
["RSEYP8KJ",0,0,"RQCEQ180_280P",{"$f":"Y45*$S$3","v":0},{"$f":"Y45*($T$3/1000)","v":0},"RQCEQ180_280P",{"$f":"AD45*$S$3","v":0},{"$f":"AD45*($T$3/1000)","v":0},{"$f":"J24","v":"REYQ8P9"},{"$f":"AI45*$S$3","v":0},{"$f":"AI45*($T$3/1000)","v":0},null,null,null,9.43,8.7899999999999991,0.53500861297837554,22.4,0,6,7,{"$f":"X45*$R$3","v":0.45011636277032013},22,0,6,7,0.52545488774661886,22,{"$f":"((Z45*$U$3)+(AA45*$V$3))*AO45","v":0},{"$f":"AE24","v":5.2},{"$f":"AF24","v":5.71},{"$f":"AH45*$R$3","v":0.4583002966388714},{"$f":"AH24","v":22.4},{"$f":"((AE45*$U$3)+(AF45*$V$3))*AO45","v":0},null,null,null,null,null,{"$f":"COUNTIF(Output!$D$5:$V$5,Database!A45)","v":0},100,260,13,null,5.2,5.7096833511805114,"REYQ8P9"]
["RSEYP10KJ",0,0,"RQCEQ280P",0,0,"RQCEQ280P",0,0,{"$f":"J25","v":"REYQ10P9"},0,0,null,null,null,11.8,11.2,0.66876076622296943,28,0,7.04,8,0.5728753707985893,28,0,7.04,8,0.66876076622296943,28,{"$f":"((Z46*$U$3)+(AA46*$V$3))*AO46","v":0},{"$f":"AE25","v":7.09},7.38,0.5728753707985893,{"$f":"AH25","v":28},{"$f":"((AE46*$U$3)+(AF46*$V$3))*AO46","v":0},null,null,null,null,null,{"$f":"COUNTIF(Output!$D$5:$V$5,Database!A46)","v":0},125,325,16,null,7.09,7.3795801593961556,"REYQ10P8"]
["RSEYP16KJ",0,0,"RQCEQ460P",0,0,"RQCEQ460P",0,0,"REYQ16P9",0,0,"REYHQ16P",{"$f":"AN47*$S$3","v":0},{"$f":"AN47*($T$3/1000)","v":0},15.7,14.2,1.0461329128773593,43.8,0,12.2,13.4,0.92069256021201851,45,0,12.2,13.4,1.0747940885726295,45,0,{"$f":"AE26","v":14.4},12.8,0.92069256021201851,45,0,10.5,11.49935814366736,{"$f":"AM47*$R$3","v":0.92069256021201851},45,{"$f":"((AJ47*$U$3)+(AK47*$V$3)+(AL47*$W$3))*AO47","v":0},{"$f":"COUNTIF(Output!$D$5:$V$5,Database!A47)","v":0},200,520,20,null,14.1,12.799285585994975,"REYQ16P8"]
["RSEYP18KJ",0,0,"RQCEQ500P",0,0,"RQCEQ500P",0,0,"REYQ18P9",0,0,null,null,null,18.7,15.5,1.1774966348140139,49.3,0,13.9,14.7,1.0229917335689094,50,0,13.9,14.7,1.1942156539695883,50,0,{"$f":"AE27","v":12.7},13.4,1.0311756674374606,50.4,0,null,null,null,null,null,{"$f":"COUNTIF(Output!$D$5:$V$5,Database!A48)","v":0},225,585,20,null,12.7,13.399252097838486,"REYQ18P8"]
["RSEYP20KJ",0,0,"RQCEQ540P",0,0,"RQCEQ540P",0,0,"REYQ20P9",0,0,"REYHQ20P",{"$f":"AN49*$S$3","v":0},{"$f":"AN49*($T$3/1000)","v":0},21.8,16.899999999999999,1.3064719254427295,54.7,0,15.5,16.100000000000001,1.1048310722544221,54,0,15.5,16.100000000000001,1.2897529062871553,54,0,{"$f":"AE28","v":14.9},15.2,1.1437047581300408,55.9,0,13.9,14.299194689253255,{"$f":"AM49*$R$3","v":1.1457507415971786},56,{"$f":"((AJ49*$U$3)+(AK49*$V$3)+(AL49*$W$3))*AO49","v":0},{"$f":"COUNTIF(Output!$D$5:$V$5,Database!A49)","v":0},250,650,20,null,14.9,15.199144005360102,"REYQ20P8"]
["RSEYP24KJ",0,0,"RQCEQ712P",0,0,"RQCEQ712P",0,0,"REYQ24P9",0,0,"REYHQ24P",{"$f":"AN50*$S$3","v":0},{"$f":"AN50*($T$3/1000)","v":0},25,21.4,1.5691993693160391,65.7,0,21.2,20.7,1.4567402286021272,71.2,0,21.2,20.7,1.7005630912526937,71.2,0,{"$f":"AE29","v":19.2},18.899999999999999,1.3708089229823386,67,0,17.2,17.199042061347363,{"$f":"AM50*$R$3","v":1.3708089229823386},67,{"$f":"((AJ50*$U$3)+(AK50*$V$3)+(AL50*$W$3))*AO50","v":0},{"$f":"COUNTIF(Output!$D$5:$V$5,Database!A50)","v":0},300,780,32,null,19.2,18.898947381364255,"REYQ24P8"]
["RSEYP26KJ",0,0,"RQCEQ744P",0,0,"RQCEQ744P",0,0,"REYQ26P9",0,0,null,null,null,26.9,21.9,1.7005630912526937,71.2,0,23.3,21.2,1.514027765681986,74,0,23.3,21.2,1.7674391678749906,74,0,{"$f":"AE30","v":21.6},20.6,1.4935679310106078,73,0,null,null,null,null,null,{"$f":"COUNTIF(Output!$D$5:$V$5,Database!A51)","v":0},325,845,32,null,21.6,20.598852505071513,"REYQ26P8"]
["RSEYP28KJ",0,0,"RQCEQ816P",0,0,"RQCEQ816P",0,0,"REYQ28P9",0,0,null,null,null,28.7,23.9,1.829538381881409,76.599999999999994,0,27.1,23.1,1.6572466083816333,81,0,27.1,23.1,1.9346293594307329,81,0,{"$f":"AE31","v":23.8},22.3,1.6060970217031878,78.5,0,null,null,null,null,null,{"$f":"COUNTIF(Output!$D$5:$V$5,Database!A52)","v":0},350,910,32,null,23.8,22.298746772773306,"REYQ28P8"]
["RSEYP30KJ",0,0,"RQCEQ848P",0,0,"RQCEQ848P",0,0,"REYQ30P9",0,0,null,null,null,31.2,27.1,1.9609021038180638,82.1,0,29.2,23.6,1.7349939801328704,84.8,0,29.2,23.6,2.0253897491324215,84.8,0,{"$f":"AE32","v":26.6},25.8,1.739085947067146,{"$f":"AH32","v":85},0,null,null,null,null,null,{"$f":"COUNTIF(Output!$D$5:$V$5,Database!A53)","v":0},375,975,32,null,26.6,24.198638929054933,"REYQ30P8"]
[null,null,null,null,null,null,null,null,null,null,null,null,null,null,null,null,null,null,null,{"$f":"COUNTIF(T8:T53,\">0\")","v":1},null,null,null,null,{"$f":"COUNTIF(Y8:Y53,\">0\")","v":1},null,null,null,null,{"$f":"COUNTIF(AD8:AD53,\">0\")","v":1},null,null,null,null,{"$f":"COUNTIF(AI8:AI53,\">0\")","v":1},null,null,null,null,{"$f":"COUNTIF(AN8:AN53,\">0\")","v":0}]
["RQYQ140P",0,0,null,null,null,null,null,null,null,null,null,null,null,null,3.52,4,{"$f":"S55*$R$3","v":0.28643768539929465},14,0]
["RQYQ180P",0,0,null,null,null,null,null,null,null,null,null,null,null,null,5.17,5.37,0.36827702408480739,18,0]
["RQCYQ280P",0,0,null,null,null,null,null,null,null,null,null,null,null,null,7.04,8,0.5728753707985893,28,0]
["RQCYQ360P",0,0,null,null,null,null,null,null,null,null,null,null,null,null,10.3,10.7,0.73655404816961478,36,0]
["RQCYQ460P",0,0,null,null,null,null,null,null,null,null,null,null,null,null,12.2,13.4,0.94115239488339664,46,0]
["RQCYQ500P",0,0,null,null,null,null,null,null,null,null,null,null,null,null,13.9,14.7,1.0229917335689094,50,0]
["RQCYQ540P",0,0,null,null,null,null,null,null,null,null,null,null,null,null,15.5,16.100000000000001,1.1048310722544221,54,0]
["RQYP615A",0,0,null,null,null,null,null,null,null,null,null,null,null,null,17.7,18.8,1.2582798322897586,61.5,0]
["RQYP680A",0,0,null,null,null,null,null,null,null,null,null,null,null,null,19.2,20.8,1.3912687576537168,68,0]
["RQYP730A",0,0,null,null,null,null,null,null,null,null,null,null,null,null,21.2,22.2,1.4935679310106078,73,0]
["RQYP785A",0,0,null,null,null,null,null,null,null,null,null,null,null,null,23.7,23.8,1.6060970217031878,78.5,0]
["RQYP850A",0,0,null,null,null,null,null,null,null,null,null,null,null,null,25.2,25.8,1.739085947067146,85,0]
[]
["RQCEQ280P",0,0,null,null,null,null,null,null,null,null,null,null,null,null,7.04,8,0.5728753707985893,28,0]
["RQCEQ360P",0,0,null,null,null,null,null,null,null,null,null,null,null,null,10.3,10.7,0.73655404816961478,36,0]
["RQCEQ460P",0,0,null,null,null,null,null,null,null,null,null,null,null,null,12.2,13.4,0.92069256021201851,45,0]
["RQCEQ500P",0,0,null,null,null,null,null,null,null,null,null,null,null,null,13.9,14.7,1.0229917335689094,50,0]
["RQCEQ540P",{"$f":"T72*$S$3","v":0},{"$f":"T72*($T$3/1000)","v":0},null,null,null,null,null,null,null,null,null,null,null,null,15.5,16.100000000000001,1.1048310722544221,54,0]
["RQCEQ636P",0,0,null,null,null,null,null,null,null,null,null,null,null,null,21.9,17.7,1.3012454850996529,63.6,{"$f":"((P73*$U$3)+(Q73*$V$3))*AO73","v":0}]
["RQCEQ712P",0,0,null,null,null,null,null,null,null,null,null,null,null,null,21.2,20.7,1.4567402286021272,71.2,0]
["RQCEQ744P",0,0,null,null,null,null,null,null,null,null,null,null,null,null,23.3,21.2,1.514027765681986,74,0]
["RQCEQ816P",0,0,null,null,null,null,null,null,null,null,null,null,null,null,27.1,23.1,1.6572466083816333,81,0]
["RQCEQ848P",0,0,null,null,null,null,null,null,null,null,null,null,null,null,29.2,23.6,1.7349939801328704,84.8,0]
[]
["RXYQ5P",{"$f":"T79*$S$3","v":0},{"$f":"T79*($T$3/1000)","v":0},null,null,null,null,null,null,null,null,null,null,null,null,3.52,3.9997781794609537,{"$f":"S79*$R$3","v":0.28643768539929465},14,0]
["RXYQ8P8",0,0,null,null,null,null,null,null,null,null,null,null,null,null,5.22,5.559691669450725,0.4583002966388714,22.4,0]
["RXYQ10P",0,0,null,null,null,null,null,null,null,null,null,null,null,null,7.42,7.6995619549255281,0.5728753707985893,28,0]
["RXYQ12P",0,0,null,null,null,null,null,null,null,null,null,null,null,null,9.6199999999999992,9.4494623992267837,0.68540446149116929,33.5,0]
["RXYQ14PA",0,0,null,null,null,null,null,null,null,null,null,null,null,null,12.4,11.29936930638619,0.81839338685512752,40,0]
["RXYQ16PA",0,0,null,null,null,null,null,null,null,null,null,null,null,null,14.2,12.89928000463556,0.92069256021201851,45,0]
["RXYQ18PA",0,0,null,null,null,null,null,null,null,null,null,null,null,null,16.2,15.299146052009615,1.0025318988975314,49,0]
["RXYQ20P8",0,0,null,null,null,null,null,null,null,null,null,null,null,null,14.71,14.951311073013825,1.1437047581300408,55.9,0]
["RXYQ22P8",0,0,null,null,null,null,null,null,null,null,null,null,null,null,16.989999999999998,17.099027198600851,1.2582798322897586,61.5,0]
["RXYQ24P8",0,0,null,null,null,null,null,null,null,null,null,null,null,null,19.2,18.899999999999999,1.3708089229823386,67,0]
["RXYQ26P8",0,0,null,null,null,null,null,null,null,null,null,null,null,null,20.94,20.684126942527822,1.4608321955364028,71.400000000000006,0]
["RXYQ28P8",0,0,null,null,null,null,null,null,null,null,null,null,null,null,23.62,22.998707433802064,1.5754072696961205,77,0]
["RXYQ30P8",0,0,null,null,null,null,null,null,null,null,null,null,null,null,25.78,24.698610807754417,1.6879363603887005,82.5,0]
["RXYQ32P8",0,0,null,null,null,null,null,null,null,null,null,null,null,null,28.62,26.598515358395808,1.8209252857526588,89,0]
["RXYQ34P8",0,0,null,null,null,null,null,null,null,null,null,null,null,null,30.42,28.198426056645175,1.9232244591095498,94,0]
["RXYQ36P8",0,0,null,null,null,null,null,null,null,null,null,null,null,null,32.450000000000003,30.598292104019229,2.0050637977950627,98,0]
["RXYQ38P8",0,0,null,null,null,null,null,null,null,null,null,null,null,null,30.61,30.098312077271814,2.1482826404947097,105,0]
["RXYQ40P8",0,0,null,null,null,null,null,null,null,null,null,null,null,null,33.229999999999997,32.39819396236588,2.2710416485229787,111,0]
["RXYQ42P8",0,0,null,null,null,null,null,null,null,null,null,null,null,null,35.369999999999997,34.198093505747089,2.3733408218798697,116,0]
["RXYQ44P8",0,0,null,null,null,null,null,null,null,null,null,null,null,null,36.92,34.198093505747089,2.4551801605653827,120,0]
["RXYQ46P8",0,0,null,null,null,null,null,null,null,null,null,null,null,null,39.75,38.297853360872523,2.5779391685936517,126,0]
["RXYQ48P8",0,0,null,null,null,null,null,null,null,null,null,null,null,null,42.04,39.947759542263832,2.7006981766219211,132,0]
["RXYQ50P8",0,0,null,null,null,null,null,null,null,null,null,null,null,null,44.81,41.897661410405419,2.8234571846501901,138,0]
["RXYQ52P8",0,0,null,null,null,null,null,null,null,null,null,null,null,null,46.88,43.497572108654794,2.9257563580070811,143,0]
["RXYQ54P8",0,0,null,null,null,null,null,null,null,null,null,null,null,null,48.7,45.947435365349151,3.0075956966925936,147,0]
[]
[]
["RXYHQ12P",{"$f":"T106*$S$3","v":0},{"$f":"T106*($T$3/1000)","v":0},null,null,null,null,null,null,null,null,null,null,null,null,8.61,9.4494623992267837,{"$f":"S106*$R$3","v":0.68540446149116929},33.5,0]
["RXYHQ16P",0,0,null,null,null,null,null,null,null,null,null,null,null,null,10.49,11.11,0.9094396511427606,44.45,0]
["RXYHQ18P",0,0,null,null,null,null,null,null,null,null,null,null,null,null,12.25,13.23,1.041200986426436,50.89,0]
["RXYHQ20P",0,0,null,null,null,null,null,null,null,null,null,null,null,null,13.8,14,1.1437047581300408,55.9,0]
["RXYHQ22P",0,0,null,null,null,null,null,null,null,null,null,null,null,null,16.02,16.239085614477997,1.2582798322897586,61.5,0]
["RXYHQ24P",0,0,null,null,null,null,null,null,null,null,null,null,null,null,15.62,16.670000000000002,1.3845170122121622,67.67,0]
["RXYHQ26P",0,0,null,null,null,null,null,null,null,null,null,null,null,null,17.46,18.78,1.4608321955364028,71.400000000000006,0]
["RXYHQ28P",0,0,null,null,null,null,null,null,null,null,null,null,null,null,18.690000000000001,19.82,1.61162117706446,78.77,0]
["RXYHQ30P",0,0,null,null,null,null,null,null,null,null,null,null,null,null,20.83,21.81,1.6879363603887005,82.5,0]
["RXYHQ32P",0,0,null,null,null,null,null,null,null,null,null,null,null,null,22.31,23.418692845625174,1.8209252857526588,89,0]
["RXYHQ34P",0,0,null,null,null,null,null,null,null,null,null,null,null,null,24.42,25.298587916068193,1.9232244591095498,94,0]
["RXYHQ36P",0,0,null,null,null,null,null,null,null,null,null,null,null,null,25.91,27.178482986511195,2.0050637977950627,98,0]
[]
["REYQ8P9",{"$f":"T119*$S$3","v":0},{"$f":"T119*($T$3/1000)","v":0},null,null,null,null,null,null,null,null,null,null,null,null,5.2,5.7096833511805114,{"$f":"S119*$R$3","v":0.4583002966388714},22.4,0]
["REYQ10P8",0,0,null,null,null,null,null,null,null,null,null,null,null,null,7.09,7.3795801593961556,0.5728753707985893,28,0]
["REYQ12P9",0,0,null,null,null,null,null,null,null,null,null,null,null,null,8.7200000000000006,8.8394971014989174,0.68540446149116929,33.5,0]
["REYQ14P8",0,0,null,null,null,null,null,null,null,null,null,null,null,null,11.4,10.99938605046443,0.81839338685512752,40,0]
["REYQ16P8",0,0,null,null,null,null,null,null,null,null,null,null,null,null,14.1,12.799285585994975,0.92069256021201851,45,0]
["REYQ18P8",0,0,null,null,null,null,null,null,null,null,null,null,null,null,12.7,13.399252097838486,1.0311756674374606,50.4,0]
["REYQ20P8",0,0,null,null,null,null,null,null,null,null,null,null,null,null,14.9,15.199144005360102,1.1437047581300408,55.9,0]
["REYQ22P8",0,0,null,null,null,null,null,null,null,null,null,null,null,null,17,17.099027198600851,1.2582798322897586,61.5,0]
["REYQ24P8",0,0,null,null,null,null,null,null,null,null,null,null,null,null,19.2,18.898947381364255,1.3708089229823386,67,0]
["REYQ26P8",0,0,null,null,null,null,null,null,null,null,null,null,null,null,21.6,20.598852505071513,1.4935679310106078,73,0]
["REYQ28P8",0,0,null,null,null,null,null,null,null,null,null,null,null,null,23.8,22.298746772773306,1.6060970217031878,78.5,0]
["REYQ30P8",0,0,null,null,null,null,null,null,null,null,null,null,null,null,26.6,24.198638929054933,1.739085947067146,85,0]
["REYQ32P8",0,0,null,null,null,null,null,null,null,null,null,null,null,null,28.4,25.798560009271121,1.841385120424037,90,0]
["REYQ34P8",0,0,null,null,null,null,null,null,null,null,null,null,null,null,26.9,26.298532102474049,1.9518682276494794,95.4,0]
["REYQ36P8",0,0,null,null,null,null,null,null,null,null,null,null,null,null,29.1,28.098431638004588,2.0647801678903619,100.91871225034082,0]
["REYQ38P8",0,0,null,null,null,null,null,null,null,null,null,null,null,null,31.2,29.998317684988514,2.1892023098374662,107,0]
["REYQ40P8",0,0,null,null,null,null,null,null,null,null,null,null,null,null,33.4,31.798227407507255,2.2915014831943572,112,0]
["REYQ42P8",0,0,null,null,null,null,null,null,null,null,null,null,null,null,35.799999999999997,33.498132527559278,2.4142604912226262,118,0]
["REYQ44P8",0,0,null,null,null,null,null,null,null,null,null,null,null,null,38,35.198037647313427,2.5370194992508952,124,{"$f":"((P137*$U$3)+(Q137*$V$3))*AO137","v":0}]
["REYQ46P8",0,0,null,null,null,null,null,null,null,null,null,null,null,null,40.799999999999997,37.097920618495316,2.6597785072791646,130,0]
["REYQ48P8",0,0,null,null,null,null,null,null,null,null,null,null,null,null,42.6,38.697829644195501,2.7620776806360556,135,0]
[]
["REYHQ16P",{"$f":"T141*$S$3","v":0},{"$f":"T141*($T$3/1000)","v":0},null,null,null,null,null,null,null,null,null,null,null,null,10.5,11.49935814366736,{"$f":"S141*$R$3","v":0.92069256021201851},45,0]
["REYHQ20P",{"$f":"T142*$S$3","v":0},{"$f":"T142*($T$3/1000)","v":0},null,null,null,null,null,null,null,null,null,null,null,null,13.9,14.299194689253255,{"$f":"S142*$R$3","v":1.1457507415971786},56,0]
["REYHQ22P",{"$f":"T143*$S$3","v":0},{"$f":"T143*($T$3/1000)","v":0},null,null,null,null,null,null,null,null,null,null,null,null,16,16.299072709777416,{"$f":"S143*$R$3","v":1.2582798322897586},61.5,0]
["REYHQ24P",{"$f":"T144*$S$3","v":0},{"$f":"T144*($T$3/1000)","v":0},null,null,null,null,null,null,null,null,null,null,null,null,17.2,17.199042061347363,{"$f":"S144*$R$3","v":1.3708089229823386},67,0]

{"sheet":"Indoor","index":6,"n_rows":192,"n_cols":62,"rows_kept":192,"cut":false,"hidden":true,"merged":[[74,43,74,44],[74,49,74,50],[74,55,74,56],[0,43,0,44],[0,49,0,50],[0,55,0,56],[152,0,161,0],[162,0,171,0],[172,0,181,0],[182,0,191,0],[0,1,0,2],[0,37,0,38],[74,1,74,2],[74,7,74,8],[74,13,74,14],[74,19,74,20],[74,25,74,26],[74,31,74,32],[74,37,74,38],[0,31,0,32],[0,7,0,8],[0,13,0,14],[0,19,0,20],[0,25,0,26]]}
["OLD IDU","Outdoor Unit 1",null,"Cooling","Heating","Inter.","Tot PI","Outdoor Unit 2",null,"Cooling","Heating","Inter.","Tot PI","Outdoor Unit 3",null,"Cooling","Heating","Inter.","Tot PI","Outdoor Unit 4",null,"Cooling","Heating","Inter.","Tot PI","Outdoor Unit 5",null,"Cooling","Heating","Inter.","Tot PI","Outdoor Unit 6",null,"Cooling","Heating","Inter.","Tot PI","Outdoor Unit 7",null,"Cooling","Heating","Inter.","Tot PI","Outdoor Unit 8",null,"Cooling","Heating","Inter.","Tot PI","Outdoor Unit 9",null,"Cooling","Heating","Inter.","Tot PI","Outdoor Unit 10",null,"Cooling","Heating","Inter.","Tot PI","Total"]
[{"$f":"Lists!$F$6","v":"Wall Mounted"},20,{"$f":"COUNTIFS(Output!$E$5:$E$36,Indoor!A2,Output!$D$6:$D$37,Indoor!B2)","v":0},null,null,{"$f":"(D2+E2)/2","v":0},{"$f":"(((D2*Database!$U$3)+(E2*Database!$V$3)+(F2*Database!$W$3))*C2)","v":0},20,{"$f":"COUNTIFS(Output!$G$5:$G$36,Indoor!A2,Output!$F$6:$F$37,Indoor!H2)","v":0},{"$f":"D2","v":0},{"$f":"E2","v":0},{"$f":"F2","v":0},{"$f":"(((J2*Database!$U$3)+(K2*Database!$V$3)+(L2*Database!$W$3))*I2)","v":0},20,{"$f":"COUNTIFS(Output!$I$5:$I$36,Indoor!A2,Output!$H$6:$H$37,Indoor!N2)","v":0},{"$f":"D2","v":0},{"$f":"E2","v":0},0,{"$f":"(((P2*Database!$U$3)+(Q2*Database!$V$3)+(R2*Database!$W$3))*O2)","v":0},20,{"$f":"COUNTIFS(Output!$K$5:$K$36,Indoor!A2,Output!$J$6:$J$37,Indoor!T2)","v":0},{"$f":"D2","v":0},{"$f":"E2","v":0},0,{"$f":"(((V2*Database!$U$3)+(W2*Database!$V$3)+(X2*Database!$W$3))*U2)","v":0},20,{"$f":"COUNTIFS(Output!$M$5:$M$36,Indoor!A2,Output!$L$6:$L$37,Indoor!Z2)","v":0},{"$f":"D2","v":0},{"$f":"E2","v":0},0,{"$f":"(((AB2*Database!$U$3)+(AC2*Database!$V$3)+(AD2*Database!$W$3))*AA2)","v":0},20,{"$f":"COUNTIFS(Output!$O$5:$O$36,Indoor!A2,Output!$N$6:$N$37,Indoor!AF2)","v":0},{"$f":"D2","v":0},{"$f":"E2","v":0},0,{"$f":"(((AH2*Database!$U$3)+(AI2*Database!$V$3)+(AJ2*Database!$W$3))*AG2)","v":0},20,{"$f":"COUNTIFS(Output!$Q$5:$Q$36,Indoor!A2,Output!$P$6:$P$37,Indoor!AL2)","v":0},{"$f":"D2","v":0},{"$f":"E2","v":0},0,{"$f":"(((AN2*Database!$U$3)+(AO2*Database!$V$3)+(AP2*Database!$W$3))*AM2)","v":0},20,{"$f":"COUNTIFS(Output!$S$5:$S$36,Indoor!A2,Output!$R$6:$R$37,Indoor!AR2)","v":0},{"$f":"D2","v":0},{"$f":"E2","v":0},0,{"$f":"(((AT2*Database!$U$3)+(AU2*Database!$V$3)+(AV2*Database!$W$3))*AS2)","v":0},20,{"$f":"COUNTIFS(Output!$U$5:$U$36,Indoor!A2,Output!$T$6:$T$37,Indoor!AX2)","v":0},{"$f":"D2","v":0},{"$f":"E2","v":0},0,{"$f":"(((AZ2*Database!$U$3)+(BA2*Database!$V$3)+(BB2*Database!$W$3))*AY2)","v":0},20,{"$f":"COUNTIFS(Output!$W$5:$W$36,Indoor!A2,Output!$V$6:$V$37,Indoor!BD2)","v":0},{"$f":"D2","v":0},{"$f":"E2","v":0},{"$f":"F2","v":0},{"$f":"(((BF2*Database!$U$3)+(BG2*Database!$V$3)+(BH2*Database!$W$3))*BE2)","v":0},{"$f":"SUM(BE2+AY2+AS2+AM2+AG2+AA2+U2+O2+I2+C2)","v":0}]
[{"$f":"Lists!$F$6","v":"Wall Mounted"},25,{"$f":"COUNTIFS(Output!$E$5:$E$36,Indoor!A3,Output!$D$6:$D$37,Indoor!B3)","v":0},2.5999999999999999E-2,2.5999999999999999E-2,{"$f":"(D3+E3)/2","v":2.5999999999999999E-2},{"$f":"(((D3*Database!$U$3)+(E3*Database!$V$3)+(F3*Database!$W$3))*C3)","v":0},25,{"$f":"COUNTIFS(Output!$G$5:$G$36,Indoor!A3,Output!$F$6:$F$37,Indoor!H3)","v":0},{"$f":"D3","v":2.5999999999999999E-2},2.5999999999999999E-2,2.5999999999999999E-2,{"$f":"(((J3*Database!$U$3)+(K3*Database!$V$3)+(L3*Database!$W$3))*I3)","v":0},25,{"$f":"COUNTIFS(Output!$I$5:$I$36,Indoor!A3,Output!$H$6:$H$37,Indoor!N3)","v":0},{"$f":"D3","v":2.5999999999999999E-2},2.5999999999999999E-2,2.5999999999999999E-2,{"$f":"(((P3*Database!$U$3)+(Q3*Database!$V$3)+(R3*Database!$W$3))*O3)","v":0},25,{"$f":"COUNTIFS(Output!$K$5:$K$36,Indoor!A3,Output!$J$6:$J$37,Indoor!T3)","v":0},{"$f":"D3","v":2.5999999999999999E-2},2.5999999999999999E-2,2.5999999999999999E-2,{"$f":"(((V3*Database!$U$3)+(W3*Database!$V$3)+(X3*Database!$W$3))*U3)","v":0},25,{"$f":"COUNTIFS(Output!$M$5:$M$36,Indoor!A3,Output!$L$6:$L$37,Indoor!Z3)","v":0},{"$f":"D3","v":2.5999999999999999E-2},2.5999999999999999E-2,2.5999999999999999E-2,{"$f":"(((AB3*Database!$U$3)+(AC3*Database!$V$3)+(AD3*Database!$W$3))*AA3)","v":0},25,{"$f":"COUNTIFS(Output!$O$5:$O$36,Indoor!A3,Output!$N$6:$N$37,Indoor!AF3)","v":0},{"$f":"D3","v":2.5999999999999999E-2},2.5999999999999999E-2,2.5999999999999999E-2,{"$f":"(((AH3*Database!$U$3)+(AI3*Database!$V$3)+(AJ3*Database!$W$3))*AG3)","v":0},25,{"$f":"COUNTIFS(Output!$Q$5:$Q$36,Indoor!A3,Output!$P$6:$P$37,Indoor!AL3)","v":0},{"$f":"D3","v":2.5999999999999999E-2},2.5999999999999999E-2,2.5999999999999999E-2,{"$f":"(((AN3*Database!$U$3)+(AO3*Database!$V$3)+(AP3*Database!$W$3))*AM3)","v":0},25,{"$f":"COUNTIFS(Output!$S$5:$S$36,Indoor!A3,Output!$R$6:$R$37,Indoor!AR3)","v":0},{"$f":"D3","v":2.5999999999999999E-2},2.5999999999999999E-2,2.5999999999999999E-2,{"$f":"(((AT3*Database!$U$3)+(AU3*Database!$V$3)+(AV3*Database!$W$3))*AS3)","v":0},25,{"$f":"COUNTIFS(Output!$U$5:$U$36,Indoor!A3,Output!$T$6:$T$37,Indoor!AX3)","v":0},{"$f":"D3","v":2.5999999999999999E-2},2.5999999999999999E-2,2.5999999999999999E-2,{"$f":"(((AZ3*Database!$U$3)+(BA3*Database!$V$3)+(BB3*Database!$W$3))*AY3)","v":0},25,{"$f":"COUNTIFS(Output!$W$5:$W$36,Indoor!A3,Output!$V$6:$V$37,Indoor!BD3)","v":0},{"$f":"D3","v":2.5999999999999999E-2},2.5999999999999999E-2,2.5999999999999999E-2,{"$f":"(((BF3*Database!$U$3)+(BG3*Database!$V$3)+(BH3*Database!$W$3))*BE3)","v":0},0]
[{"$f":"Lists!$F$6","v":"Wall Mounted"},31.25,{"$f":"COUNTIFS(Output!$E$5:$E$36,Indoor!A4,Output!$D$6:$D$37,Indoor!B4)","v":0},2.8000000000000001E-2,2.8000000000000001E-2,2.8000000000000001E-2,{"$f":"(((D4*Database!$U$3)+(E4*Database!$V$3)+(F4*Database!$W$3))*C4)","v":0},31.25,{"$f":"COUNTIFS(Output!$G$5:$G$36,Indoor!A4,Output!$F$6:$F$37,Indoor!H4)","v":0},2.8000000000000001E-2,2.8000000000000001E-2,2.8000000000000001E-2,{"$f":"(((J4*Database!$U$3)+(K4*Database!$V$3)+(L4*Database!$W$3))*I4)","v":0},31.25,{"$f":"COUNTIFS(Output!$I$5:$I$36,Indoor!A4,Output!$H$6:$H$37,Indoor!N4)","v":0},2.8000000000000001E-2,2.8000000000000001E-2,2.8000000000000001E-2,{"$f":"(((P4*Database!$U$3)+(Q4*Database!$V$3)+(R4*Database!$W$3))*O4)","v":0},31.25,{"$f":"COUNTIFS(Output!$K$5:$K$36,Indoor!A4,Output!$J$6:$J$37,Indoor!T4)","v":0},2.8000000000000001E-2,2.8000000000000001E-2,2.8000000000000001E-2,{"$f":"(((V4*Database!$U$3)+(W4*Database!$V$3)+(X4*Database!$W$3))*U4)","v":0},31.25,{"$f":"COUNTIFS(Output!$M$5:$M$36,Indoor!A4,Output!$L$6:$L$37,Indoor!Z4)","v":0},2.8000000000000001E-2,2.8000000000000001E-2,2.8000000000000001E-2,{"$f":"(((AB4*Database!$U$3)+(AC4*Database!$V$3)+(AD4*Database!$W$3))*AA4)","v":0},31.25,{"$f":"COUNTIFS(Output!$O$5:$O$36,Indoor!A4,Output!$N$6:$N$37,Indoor!AF4)","v":0},2.8000000000000001E-2,2.8000000000000001E-2,2.8000000000000001E-2,{"$f":"(((AH4*Database!$U$3)+(AI4*Database!$V$3)+(AJ4*Database!$W$3))*AG4)","v":0},31.25,{"$f":"COUNTIFS(Output!$Q$5:$Q$36,Indoor!A4,Output!$P$6:$P$37,Indoor!AL4)","v":0},2.8000000000000001E-2,2.8000000000000001E-2,2.8000000000000001E-2,{"$f":"(((AN4*Database!$U$3)+(AO4*Database!$V$3)+(AP4*Database!$W$3))*AM4)","v":0},31.25,{"$f":"COUNTIFS(Output!$S$5:$S$36,Indoor!A4,Output!$R$6:$R$37,Indoor!AR4)","v":0},2.8000000000000001E-2,2.8000000000000001E-2,2.8000000000000001E-2,{"$f":"(((AT4*Database!$U$3)+(AU4*Database!$V$3)+(AV4*Database!$W$3))*AS4)","v":0},31.25,{"$f":"COUNTIFS(Output!$U$5:$U$36,Indoor!A4,Output!$T$6:$T$37,Indoor!AX4)","v":0},2.8000000000000001E-2,2.8000000000000001E-2,2.8000000000000001E-2,{"$f":"(((AZ4*Database!$U$3)+(BA4*Database!$V$3)+(BB4*Database!$W$3))*AY4)","v":0},31.25,{"$f":"COUNTIFS(Output!$W$5:$W$36,Indoor!A4,Output!$V$6:$V$37,Indoor!BD4)","v":0},2.8000000000000001E-2,2.8000000000000001E-2,2.8000000000000001E-2,{"$f":"(((BF4*Database!$U$3)+(BG4*Database!$V$3)+(BH4*Database!$W$3))*BE4)","v":0},0]
[{"$f":"Lists!$F$6","v":"Wall Mounted"},40,{"$f":"COUNTIFS(Output!$E$5:$E$36,Indoor!A5,Output!$D$6:$D$37,Indoor!B5)","v":0},3.5999999999999997E-2,3.5999999999999997E-2,3.5999999999999997E-2,{"$f":"(((D5*Database!$U$3)+(E5*Database!$V$3)+(F5*Database!$W$3))*C5)","v":0},40,{"$f":"COUNTIFS(Output!$G$5:$G$36,Indoor!A5,Output!$F$6:$F$37,Indoor!H5)","v":0},3.5999999999999997E-2,3.5999999999999997E-2,3.5999999999999997E-2,{"$f":"(((J5*Database!$U$3)+(K5*Database!$V$3)+(L5*Database!$W$3))*I5)","v":0},40,{"$f":"COUNTIFS(Output!$I$5:$I$36,Indoor!A5,Output!$H$6:$H$37,Indoor!N5)","v":0},3.5999999999999997E-2,3.5999999999999997E-2,3.5999999999999997E-2,{"$f":"(((P5*Database!$U$3)+(Q5*Database!$V$3)+(R5*Database!$W$3))*O5)","v":0},40,{"$f":"COUNTIFS(Output!$K$5:$K$36,Indoor!A5,Output!$J$6:$J$37,Indoor!T5)","v":0},3.5999999999999997E-2,3.5999999999999997E-2,3.5999999999999997E-2,{"$f":"(((V5*Database!$U$3)+(W5*Database!$V$3)+(X5*Database!$W$3))*U5)","v":0},40,{"$f":"COUNTIFS(Output!$M$5:$M$36,Indoor!A5,Output!$L$6:$L$37,Indoor!Z5)","v":0},3.5999999999999997E-2,3.5999999999999997E-2,3.5999999999999997E-2,{"$f":"(((AB5*Database!$U$3)+(AC5*Database!$V$3)+(AD5*Database!$W$3))*AA5)","v":0},40,{"$f":"COUNTIFS(Output!$O$5:$O$36,Indoor!A5,Output!$N$6:$N$37,Indoor!AF5)","v":0},3.5999999999999997E-2,3.5999999999999997E-2,3.5999999999999997E-2,{"$f":"(((AH5*Database!$U$3)+(AI5*Database!$V$3)+(AJ5*Database!$W$3))*AG5)","v":0},40,{"$f":"COUNTIFS(Output!$Q$5:$Q$36,Indoor!A5,Output!$P$6:$P$37,Indoor!AL5)","v":0},3.5999999999999997E-2,3.5999999999999997E-2,3.5999999999999997E-2,{"$f":"(((AN5*Database!$U$3)+(AO5*Database!$V$3)+(AP5*Database!$W$3))*AM5)","v":0},40,{"$f":"COUNTIFS(Output!$S$5:$S$36,Indoor!A5,Output!$R$6:$R$37,Indoor!AR5)","v":0},3.5999999999999997E-2,3.5999999999999997E-2,3.5999999999999997E-2,{"$f":"(((AT5*Database!$U$3)+(AU5*Database!$V$3)+(AV5*Database!$W$3))*AS5)","v":0},40,{"$f":"COUNTIFS(Output!$U$5:$U$36,Indoor!A5,Output!$T$6:$T$37,Indoor!AX5)","v":0},3.5999999999999997E-2,3.5999999999999997E-2,3.5999999999999997E-2,{"$f":"(((AZ5*Database!$U$3)+(BA5*Database!$V$3)+(BB5*Database!$W$3))*AY5)","v":0},40,{"$f":"COUNTIFS(Output!$W$5:$W$36,Indoor!A5,Output!$V$6:$V$37,Indoor!BD5)","v":0},3.5999999999999997E-2,3.5999999999999997E-2,3.5999999999999997E-2,{"$f":"(((BF5*Database!$U$3)+(BG5*Database!$V$3)+(BH5*Database!$W$3))*BE5)","v":0},0]
[{"$f":"Lists!$F$6","v":"Wall Mounted"},50,{"$f":"COUNTIFS(Output!$E$5:$E$36,Indoor!A6,Output!$D$6:$D$37,Indoor!B6)","v":0},3.5000000000000003E-2,3.5000000000000003E-2,3.5000000000000003E-2,{"$f":"(((D6*Database!$U$3)+(E6*Database!$V$3)+(F6*Database!$W$3))*C6)","v":0},50,{"$f":"COUNTIFS(Output!$G$5:$G$36,Indoor!A6,Output!$F$6:$F$37,Indoor!H6)","v":0},3.5000000000000003E-2,3.5000000000000003E-2,3.5000000000000003E-2,{"$f":"(((J6*Database!$U$3)+(K6*Database!$V$3)+(L6*Database!$W$3))*I6)","v":0},50,{"$f":"COUNTIFS(Output!$I$5:$I$36,Indoor!A6,Output!$H$6:$H$37,Indoor!N6)","v":0},3.5000000000000003E-2,3.5000000000000003E-2,3.5000000000000003E-2,{"$f":"(((P6*Database!$U$3)+(Q6*Database!$V$3)+(R6*Database!$W$3))*O6)","v":0},50,{"$f":"COUNTIFS(Output!$K$5:$K$36,Indoor!A6,Output!$J$6:$J$37,Indoor!T6)","v":0},3.5000000000000003E-2,3.5000000000000003E-2,3.5000000000000003E-2,{"$f":"(((V6*Database!$U$3)+(W6*Database!$V$3)+(X6*Database!$W$3))*U6)","v":0},50,{"$f":"COUNTIFS(Output!$M$5:$M$36,Indoor!A6,Output!$L$6:$L$37,Indoor!Z6)","v":0},3.5000000000000003E-2,3.5000000000000003E-2,3.5000000000000003E-2,{"$f":"(((AB6*Database!$U$3)+(AC6*Database!$V$3)+(AD6*Database!$W$3))*AA6)","v":0},50,{"$f":"COUNTIFS(Output!$O$5:$O$36,Indoor!A6,Output!$N$6:$N$37,Indoor!AF6)","v":0},3.5000000000000003E-2,3.5000000000000003E-2,3.5000000000000003E-2,{"$f":"(((AH6*Database!$U$3)+(AI6*Database!$V$3)+(AJ6*Database!$W$3))*AG6)","v":0},50,{"$f":"COUNTIFS(Output!$Q$5:$Q$36,Indoor!A6,Output!$P$6:$P$37,Indoor!AL6)","v":0},3.5000000000000003E-2,3.5000000000000003E-2,3.5000000000000003E-2,{"$f":"(((AN6*Database!$U$3)+(AO6*Database!$V$3)+(AP6*Database!$W$3))*AM6)","v":0},50,{"$f":"COUNTIFS(Output!$S$5:$S$36,Indoor!A6,Output!$R$6:$R$37,Indoor!AR6)","v":0},3.5000000000000003E-2,3.5000000000000003E-2,3.5000000000000003E-2,{"$f":"(((AT6*Database!$U$3)+(AU6*Database!$V$3)+(AV6*Database!$W$3))*AS6)","v":0},50,{"$f":"COUNTIFS(Output!$U$5:$U$36,Indoor!A6,Output!$T$6:$T$37,Indoor!AX6)","v":0},3.5000000000000003E-2,3.5000000000000003E-2,3.5000000000000003E-2,{"$f":"(((AZ6*Database!$U$3)+(BA6*Database!$V$3)+(BB6*Database!$W$3))*AY6)","v":0},50,{"$f":"COUNTIFS(Output!$W$5:$W$36,Indoor!A6,Output!$V$6:$V$37,Indoor!BD6)","v":0},3.5000000000000003E-2,3.5000000000000003E-2,3.5000000000000003E-2,{"$f":"(((BF6*Database!$U$3)+(BG6*Database!$V$3)+(BH6*Database!$W$3))*BE6)","v":0},0]
[{"$f":"Lists!$F$6","v":"Wall Mounted"},63,{"$f":"COUNTIFS(Output!$E$5:$E$36,Indoor!A7,Output!$D$6:$D$37,Indoor!B7)","v":0},4.3999999999999997E-2,4.3999999999999997E-2,4.3999999999999997E-2,{"$f":"(((D7*Database!$U$3)+(E7*Database!$V$3)+(F7*Database!$W$3))*C7)","v":0},63,{"$f":"COUNTIFS(Output!$G$5:$G$36,Indoor!A7,Output!$F$6:$F$37,Indoor!H7)","v":0},4.3999999999999997E-2,4.3999999999999997E-2,4.3999999999999997E-2,{"$f":"(((J7*Database!$U$3)+(K7*Database!$V$3)+(L7*Database!$W$3))*I7)","v":0},63,{"$f":"COUNTIFS(Output!$I$5:$I$36,Indoor!A7,Output!$H$6:$H$37,Indoor!N7)","v":0},4.3999999999999997E-2,4.3999999999999997E-2,4.3999999999999997E-2,{"$f":"(((P7*Database!$U$3)+(Q7*Database!$V$3)+(R7*Database!$W$3))*O7)","v":0},63,{"$f":"COUNTIFS(Output!$K$5:$K$36,Indoor!A7,Output!$J$6:$J$37,Indoor!T7)","v":0},4.3999999999999997E-2,4.3999999999999997E-2,4.3999999999999997E-2,{"$f":"(((V7*Database!$U$3)+(W7*Database!$V$3)+(X7*Database!$W$3))*U7)","v":0},63,{"$f":"COUNTIFS(Output!$M$5:$M$36,Indoor!A7,Output!$L$6:$L$37,Indoor!Z7)","v":0},4.3999999999999997E-2,4.3999999999999997E-2,4.3999999999999997E-2,{"$f":"(((AB7*Database!$U$3)+(AC7*Database!$V$3)+(AD7*Database!$W$3))*AA7)","v":0},63,{"$f":"COUNTIFS(Output!$O$5:$O$36,Indoor!A7,Output!$N$6:$N$37,Indoor!AF7)","v":0},4.3999999999999997E-2,4.3999999999999997E-2,4.3999999999999997E-2,{"$f":"(((AH7*Database!$U$3)+(AI7*Database!$V$3)+(AJ7*Database!$W$3))*AG7)","v":0},63,{"$f":"COUNTIFS(Output!$Q$5:$Q$36,Indoor!A7,Output!$P$6:$P$37,Indoor!AL7)","v":0},4.3999999999999997E-2,4.3999999999999997E-2,4.3999999999999997E-2,{"$f":"(((AN7*Database!$U$3)+(AO7*Database!$V$3)+(AP7*Database!$W$3))*AM7)","v":0},63,{"$f":"COUNTIFS(Output!$S$5:$S$36,Indoor!A7,Output!$R$6:$R$37,Indoor!AR7)","v":0},4.3999999999999997E-2,4.3999999999999997E-2,4.3999999999999997E-2,{"$f":"(((AT7*Database!$U$3)+(AU7*Database!$V$3)+(AV7*Database!$W$3))*AS7)","v":0},63,{"$f":"COUNTIFS(Output!$U$5:$U$36,Indoor!A7,Output!$T$6:$T$37,Indoor!AX7)","v":0},4.3999999999999997E-2,4.3999999999999997E-2,4.3999999999999997E-2,{"$f":"(((AZ7*Database!$U$3)+(BA7*Database!$V$3)+(BB7*Database!$W$3))*AY7)","v":0},63,{"$f":"COUNTIFS(Output!$W$5:$W$36,Indoor!A7,Output!$V$6:$V$37,Indoor!BD7)","v":0},4.3999999999999997E-2,4.3999999999999997E-2,4.3999999999999997E-2,{"$f":"(((BF7*Database!$U$3)+(BG7*Database!$V$3)+(BH7*Database!$W$3))*BE7)","v":0},0]
[{"$f":"Lists!$F$6","v":"Wall Mounted"},80,{"$f":"COUNTIFS(Output!$E$5:$E$36,Indoor!A8,Output!$D$6:$D$37,Indoor!B8)","v":0},null,null,0,{"$f":"(((D8*Database!$U$3)+(E8*Database!$V$3)+(F8*Database!$W$3))*C8)","v":0},80,{"$f":"COUNTIFS(Output!$G$5:$G$36,Indoor!A8,Output!$F$6:$F$37,Indoor!H8)","v":0},0,0,0,{"$f":"(((J8*Database!$U$3)+(K8*Database!$V$3)+(L8*Database!$W$3))*I8)","v":0},80,{"$f":"COUNTIFS(Output!$I$5:$I$36,Indoor!A8,Output!$H$6:$H$37,Indoor!N8)","v":0},0,0,0,{"$f":"(((P8*Database!$U$3)+(Q8*Database!$V$3)+(R8*Database!$W$3))*O8)","v":0},80,{"$f":"COUNTIFS(Output!$K$5:$K$36,Indoor!A8,Output!$J$6:$J$37,Indoor!T8)","v":0},0,0,0,{"$f":"(((V8*Database!$U$3)+(W8*Database!$V$3)+(X8*Database!$W$3))*U8)","v":0},80,{"$f":"COUNTIFS(Output!$M$5:$M$36,Indoor!A8,Output!$L$6:$L$37,Indoor!Z8)","v":0},0,0,0,{"$f":"(((AB8*Database!$U$3)+(AC8*Database!$V$3)+(AD8*Database!$W$3))*AA8)","v":0},80,{"$f":"COUNTIFS(Output!$O$5:$O$36,Indoor!A8,Output!$N$6:$N$37,Indoor!AF8)","v":0},0,0,0,{"$f":"(((AH8*Database!$U$3)+(AI8*Database!$V$3)+(AJ8*Database!$W$3))*AG8)","v":0},80,{"$f":"COUNTIFS(Output!$Q$5:$Q$36,Indoor!A8,Output!$P$6:$P$37,Indoor!AL8)","v":0},0,0,0,{"$f":"(((AN8*Database!$U$3)+(AO8*Database!$V$3)+(AP8*Database!$W$3))*AM8)","v":0},80,{"$f":"COUNTIFS(Output!$S$5:$S$36,Indoor!A8,Output!$R$6:$R$37,Indoor!AR8)","v":0},0,0,0,{"$f":"(((AT8*Database!$U$3)+(AU8*Database!$V$3)+(AV8*Database!$W$3))*AS8)","v":0},80,{"$f":"COUNTIFS(Output!$U$5:$U$36,Indoor!A8,Output!$T$6:$T$37,Indoor!AX8)","v":0},0,0,0,{"$f":"(((AZ8*Database!$U$3)+(BA8*Database!$V$3)+(BB8*Database!$W$3))*AY8)","v":0},80,{"$f":"COUNTIFS(Output!$W$5:$W$36,Indoor!A8,Output!$V$6:$V$37,Indoor!BD8)","v":0},0,0,0,{"$f":"(((BF8*Database!$U$3)+(BG8*Database!$V$3)+(BH8*Database!$W$3))*BE8)","v":0},0]
[{"$f":"Lists!$F$6","v":"Wall Mounted"},100,{"$f":"COUNTIFS(Output!$E$5:$E$36,Indoor!A9,Output!$D$6:$D$37,Indoor!B9)","v":0},null,null,0,{"$f":"(((D9*Database!$U$3)+(E9*Database!$V$3)+(F9*Database!$W$3))*C9)","v":0},100,{"$f":"COUNTIFS(Output!$G$5:$G$36,Indoor!A9,Output!$F$6:$F$37,Indoor!H9)","v":0},0,0,0,{"$f":"(((J9*Database!$U$3)+(K9*Database!$V$3)+(L9*Database!$W$3))*I9)","v":0},100,{"$f":"COUNTIFS(Output!$I$5:$I$36,Indoor!A9,Output!$H$6:$H$37,Indoor!N9)","v":0},0,0,0,{"$f":"(((P9*Database!$U$3)+(Q9*Database!$V$3)+(R9*Database!$W$3))*O9)","v":0},100,{"$f":"COUNTIFS(Output!$K$5:$K$36,Indoor!A9,Output!$J$6:$J$37,Indoor!T9)","v":0},0,0,0,{"$f":"(((V9*Database!$U$3)+(W9*Database!$V$3)+(X9*Database!$W$3))*U9)","v":0},100,{"$f":"COUNTIFS(Output!$M$5:$M$36,Indoor!A9,Output!$L$6:$L$37,Indoor!Z9)","v":0},0,0,0,{"$f":"(((AB9*Database!$U$3)+(AC9*Database!$V$3)+(AD9*Database!$W$3))*AA9)","v":0},100,{"$f":"COUNTIFS(Output!$O$5:$O$36,Indoor!A9,Output!$N$6:$N$37,Indoor!AF9)","v":0},0,0,0,{"$f":"(((AH9*Database!$U$3)+(AI9*Database!$V$3)+(AJ9*Database!$W$3))*AG9)","v":0},100,{"$f":"COUNTIFS(Output!$Q$5:$Q$36,Indoor!A9,Output!$P$6:$P$37,Indoor!AL9)","v":0},0,0,0,{"$f":"(((AN9*Database!$U$3)+(AO9*Database!$V$3)+(AP9*Database!$W$3))*AM9)","v":0},100,{"$f":"COUNTIFS(Output!$S$5:$S$36,Indoor!A9,Output!$R$6:$R$37,Indoor!AR9)","v":0},0,0,0,{"$f":"(((AT9*Database!$U$3)+(AU9*Database!$V$3)+(AV9*Database!$W$3))*AS9)","v":0},100,{"$f":"COUNTIFS(Output!$U$5:$U$36,Indoor!A9,Output!$T$6:$T$37,Indoor!AX9)","v":0},0,0,0,{"$f":"(((AZ9*Database!$U$3)+(BA9*Database!$V$3)+(BB9*Database!$W$3))*AY9)","v":0},100,{"$f":"COUNTIFS(Output!$W$5:$W$36,Indoor!A9,Output!$V$6:$V$37,Indoor!BD9)","v":0},0,0,0,{"$f":"(((BF9*Database!$U$3)+(BG9*Database!$V$3)+(BH9*Database!$W$3))*BE9)","v":0},0]
[{"$f":"Lists!$F$6","v":"Wall Mounted"},125,{"$f":"COUNTIFS(Output!$E$5:$E$36,Indoor!A10,Output!$D$6:$D$37,Indoor!B10)","v":0},null,null,0,{"$f":"(((D10*Database!$U$3)+(E10*Database!$V$3)+(F10*Database!$W$3))*C10)","v":0},125,{"$f":"COUNTIFS(Output!$G$5:$G$36,Indoor!A10,Output!$F$6:$F$37,Indoor!H10)","v":0},0,0,0,{"$f":"(((J10*Database!$U$3)+(K10*Database!$V$3)+(L10*Database!$W$3))*I10)","v":0},125,{"$f":"COUNTIFS(Output!$I$5:$I$36,Indoor!A10,Output!$H$6:$H$37,Indoor!N10)","v":0},0,0,0,{"$f":"(((P10*Database!$U$3)+(Q10*Database!$V$3)+(R10*Database!$W$3))*O10)","v":0},125,{"$f":"COUNTIFS(Output!$K$5:$K$36,Indoor!A10,Output!$J$6:$J$37,Indoor!T10)","v":0},0,0,0,{"$f":"(((V10*Database!$U$3)+(W10*Database!$V$3)+(X10*Database!$W$3))*U10)","v":0},125,{"$f":"COUNTIFS(Output!$M$5:$M$36,Indoor!A10,Output!$L$6:$L$37,Indoor!Z10)","v":0},0,0,0,{"$f":"(((AB10*Database!$U$3)+(AC10*Database!$V$3)+(AD10*Database!$W$3))*AA10)","v":0},125,{"$f":"COUNTIFS(Output!$O$5:$O$36,Indoor!A10,Output!$N$6:$N$37,Indoor!AF10)","v":0},0,0,0,{"$f":"(((AH10*Database!$U$3)+(AI10*Database!$V$3)+(AJ10*Database!$W$3))*AG10)","v":0},125,{"$f":"COUNTIFS(Output!$Q$5:$Q$36,Indoor!A10,Output!$P$6:$P$37,Indoor!AL10)","v":0},0,0,0,{"$f":"(((AN10*Database!$U$3)+(AO10*Database!$V$3)+(AP10*Database!$W$3))*AM10)","v":0},125,{"$f":"COUNTIFS(Output!$S$5:$S$36,Indoor!A10,Output!$R$6:$R$37,Indoor!AR10)","v":0},0,0,0,{"$f":"(((AT10*Database!$U$3)+(AU10*Database!$V$3)+(AV10*Database!$W$3))*AS10)","v":0},125,{"$f":"COUNTIFS(Output!$U$5:$U$36,Indoor!A10,Output!$T$6:$T$37,Indoor!AX10)","v":0},0,0,0,{"$f":"(((AZ10*Database!$U$3)+(BA10*Database!$V$3)+(BB10*Database!$W$3))*AY10)","v":0},125,{"$f":"COUNTIFS(Output!$W$5:$W$36,Indoor!A10,Output!$V$6:$V$37,Indoor!BD10)","v":0},0,0,0,{"$f":"(((BF10*Database!$U$3)+(BG10*Database!$V$3)+(BH10*Database!$W$3))*BE10)","v":0},0]
[{"$f":"Lists!$F$6","v":"Wall Mounted"},200,{"$f":"COUNTIFS(Output!$E$5:$E$36,Indoor!A11,Output!$D$6:$D$37,Indoor!B11)","v":0},null,null,0,{"$f":"(((D11*Database!$U$3)+(E11*Database!$V$3)+(F11*Database!$W$3))*C11)","v":0},200,{"$f":"COUNTIFS(Output!$G$5:$G$36,Indoor!A11,Output!$F$6:$F$37,Indoor!H11)","v":0},0,0,0,{"$f":"(((J11*Database!$U$3)+(K11*Database!$V$3)+(L11*Database!$W$3))*I11)","v":0},200,{"$f":"COUNTIFS(Output!$I$5:$I$36,Indoor!A11,Output!$H$6:$H$37,Indoor!N11)","v":0},0,0,0,{"$f":"(((P11*Database!$U$3)+(Q11*Database!$V$3)+(R11*Database!$W$3))*O11)","v":0},200,{"$f":"COUNTIFS(Output!$K$5:$K$36,Indoor!A11,Output!$J$6:$J$37,Indoor!T11)","v":0},0,0,0,{"$f":"(((V11*Database!$U$3)+(W11*Database!$V$3)+(X11*Database!$W$3))*U11)","v":0},200,{"$f":"COUNTIFS(Output!$M$5:$M$36,Indoor!A11,Output!$L$6:$L$37,Indoor!Z11)","v":0},0,0,0,{"$f":"(((AB11*Database!$U$3)+(AC11*Database!$V$3)+(AD11*Database!$W$3))*AA11)","v":0},200,{"$f":"COUNTIFS(Output!$O$5:$O$36,Indoor!A11,Output!$N$6:$N$37,Indoor!AF11)","v":0},0,0,0,{"$f":"(((AH11*Database!$U$3)+(AI11*Database!$V$3)+(AJ11*Database!$W$3))*AG11)","v":0},200,{"$f":"COUNTIFS(Output!$Q$5:$Q$36,Indoor!A11,Output!$P$6:$P$37,Indoor!AL11)","v":0},0,0,0,{"$f":"(((AN11*Database!$U$3)+(AO11*Database!$V$3)+(AP11*Database!$W$3))*AM11)","v":0},200,{"$f":"COUNTIFS(Output!$S$5:$S$36,Indoor!A11,Output!$R$6:$R$37,Indoor!AR11)","v":0},0,0,0,{"$f":"(((AT11*Database!$U$3)+(AU11*Database!$V$3)+(AV11*Database!$W$3))*AS11)","v":0},200,{"$f":"COUNTIFS(Output!$U$5:$U$36,Indoor!A11,Output!$T$6:$T$37,Indoor!AX11)","v":0},0,0,0,{"$f":"(((AZ11*Database!$U$3)+(BA11*Database!$V$3)+(BB11*Database!$W$3))*AY11)","v":0},200,{"$f":"COUNTIFS(Output!$W$5:$W$36,Indoor!A11,Output!$V$6:$V$37,Indoor!BD11)","v":0},0,0,0,{"$f":"(((BF11*Database!$U$3)+(BG11*Database!$V$3)+(BH11*Database!$W$3))*BE11)","v":0},0]
[{"$f":"Lists!$F$6","v":"Wall Mounted"},250,{"$f":"COUNTIFS(Output!$E$5:$E$36,Indoor!A12,Output!$D$6:$D$37,Indoor!B12)","v":0},null,null,0,{"$f":"(((D12*Database!$U$3)+(E12*Database!$V$3)+(F12*Database!$W$3))*C12)","v":0},250,{"$f":"COUNTIFS(Output!$G$5:$G$36,Indoor!A12,Output!$F$6:$F$37,Indoor!H12)","v":0},0,0,0,{"$f":"(((J12*Database!$U$3)+(K12*Database!$V$3)+(L12*Database!$W$3))*I12)","v":0},250,{"$f":"COUNTIFS(Output!$I$5:$I$36,Indoor!A12,Output!$H$6:$H$37,Indoor!N12)","v":0},0,0,0,{"$f":"(((P12*Database!$U$3)+(Q12*Database!$V$3)+(R12*Database!$W$3))*O12)","v":0},250,{"$f":"COUNTIFS(Output!$K$5:$K$36,Indoor!A12,Output!$J$6:$J$37,Indoor!T12)","v":0},0,0,0,{"$f":"(((V12*Database!$U$3)+(W12*Database!$V$3)+(X12*Database!$W$3))*U12)","v":0},250,{"$f":"COUNTIFS(Output!$M$5:$M$36,Indoor!A12,Output!$L$6:$L$37,Indoor!Z12)","v":0},0,0,0,{"$f":"(((AB12*Database!$U$3)+(AC12*Database!$V$3)+(AD12*Database!$W$3))*AA12)","v":0},250,{"$f":"COUNTIFS(Output!$O$5:$O$36,Indoor!A12,Output!$N$6:$N$37,Indoor!AF12)","v":0},0,0,0,{"$f":"(((AH12*Database!$U$3)+(AI12*Database!$V$3)+(AJ12*Database!$W$3))*AG12)","v":0},250,{"$f":"COUNTIFS(Output!$Q$5:$Q$36,Indoor!A12,Output!$P$6:$P$37,Indoor!AL12)","v":0},0,0,0,{"$f":"(((AN12*Database!$U$3)+(AO12*Database!$V$3)+(AP12*Database!$W$3))*AM12)","v":0},250,{"$f":"COUNTIFS(Output!$S$5:$S$36,Indoor!A12,Output!$R$6:$R$37,Indoor!AR12)","v":0},0,0,0,{"$f":"(((AT12*Database!$U$3)+(AU12*Database!$V$3)+(AV12*Database!$W$3))*AS12)","v":0},250,{"$f":"COUNTIFS(Output!$U$5:$U$36,Indoor!A12,Output!$T$6:$T$37,Indoor!AX12)","v":0},0,0,0,{"$f":"(((AZ12*Database!$U$3)+(BA12*Database!$V$3)+(BB12*Database!$W$3))*AY12)","v":0},250,{"$f":"COUNTIFS(Output!$W$5:$W$36,Indoor!A12,Output!$V$6:$V$37,Indoor!BD12)","v":0},0,0,0,{"$f":"(((BF12*Database!$U$3)+(BG12*Database!$V$3)+(BH12*Database!$W$3))*BE12)","v":0},0]
[null,null,{"$f":"SUM(C2:C12)","v":0},null,null,null,null,null,{"$f":"SUM(I2:I12)","v":0},null,null,null,null,null,{"$f":"SUM(O2:O12)","v":0},null,null,null,null,null,{"$f":"SUM(U2:U12)","v":0},null,null,null,null,null,{"$f":"SUM(AA2:AA12)","v":0},null,null,null,null,null,{"$f":"SUM(AG2:AG12)","v":0},null,null,null,null,null,{"$f":"SUM(AM2:AM12)","v":0},null,null,null,null,null,{"$f":"SUM(AS2:AS12)","v":0},null,null,null,null,null,{"$f":"SUM(AY2:AY12)","v":0},null,null,null,null,null,{"$f":"SUM(BE2:BE12)","v":0}]
[{"$f":"Lists!$F$3","v":"Ceiling Mounted Cassette"},20,{"$f":"COUNTIFS(Output!$E$5:$E$36,Indoor!A14,Output!$D$6:$D$37,Indoor!B14)","v":0},null,null,0,{"$f":"(((D14*Database!$U$3)+(E14*Database!$V$3)+(F14*Database!$W$3))*C14)","v":0},20,{"$f":"COUNTIFS(Output!$G$5:$G$36,Indoor!A14,Output!$F$6:$F$37,Indoor!H14)","v":0},0,0,0,{"$f":"(((J14*Database!$U$3)+(K14*Database!$V$3)+(L14*Database!$W$3))*I14)","v":0},20,{"$f":"COUNTIFS(Output!$I$5:$I$36,Indoor!A14,Output!$H$6:$H$37,Indoor!N14)","v":0},0,0,0,{"$f":"(((P14*Database!$U$3)+(Q14*Database!$V$3)+(R14*Database!$W$3))*O14)","v":0},20,{"$f":"COUNTIFS(Output!$K$5:$K$36,Indoor!A14,Output!$J$6:$J$37,Indoor!T14)","v":0},0,0,0,{"$f":"(((V14*Database!$U$3)+(W14*Database!$V$3)+(X14*Database!$W$3))*U14)","v":0},20,{"$f":"COUNTIFS(Output!$M$5:$M$36,Indoor!A14,Output!$L$6:$L$37,Indoor!Z14)","v":0},0,0,0,{"$f":"(((AB14*Database!$U$3)+(AC14*Database!$V$3)+(AD14*Database!$W$3))*AA14)","v":0},20,{"$f":"COUNTIFS(Output!$O$5:$O$36,Indoor!A14,Output!$N$6:$N$37,Indoor!AF14)","v":0},0,0,0,{"$f":"(((AH14*Database!$U$3)+(AI14*Database!$V$3)+(AJ14*Database!$W$3))*AG14)","v":0},20,{"$f":"COUNTIFS(Output!$Q$5:$Q$36,Indoor!A14,Output!$P$6:$P$37,Indoor!AL14)","v":0},0,0,0,{"$f":"(((AN14*Database!$U$3)+(AO14*Database!$V$3)+(AP14*Database!$W$3))*AM14)","v":0},20,{"$f":"COUNTIFS(Output!$S$5:$S$36,Indoor!A14,Output!$R$6:$R$37,Indoor!AR14)","v":0},0,0,0,{"$f":"(((AT14*Database!$U$3)+(AU14*Database!$V$3)+(AV14*Database!$W$3))*AS14)","v":0},20,{"$f":"COUNTIFS(Output!$U$5:$U$36,Indoor!A14,Output!$T$6:$T$37,Indoor!AX14)","v":0},0,0,0,{"$f":"(((AZ14*Database!$U$3)+(BA14*Database!$V$3)+(BB14*Database!$W$3))*AY14)","v":0},20,{"$f":"COUNTIFS(Output!$W$5:$W$36,Indoor!A14,Output!$V$6:$V$37,Indoor!BD14)","v":0},0,0,0,{"$f":"(((BF14*Database!$U$3)+(BG14*Database!$V$3)+(BH14*Database!$W$3))*BE14)","v":0},{"$f":"SUM(BE14+AY14+AS14+AM14+AG14+AA14+U14+O14+I14+C14)","v":0}]
[{"$f":"Lists!$F$3","v":"Ceiling Mounted Cassette"},25,{"$f":"COUNTIFS(Output!$E$5:$E$36,Indoor!A15,Output!$D$6:$D$37,Indoor!B15)","v":0},null,null,0,{"$f":"(((D15*Database!$U$3)+(E15*Database!$V$3)+(F15*Database!$W$3))*C15)","v":0},25,{"$f":"COUNTIFS(Output!$G$5:$G$36,Indoor!A15,Output!$F$6:$F$37,Indoor!H15)","v":0},0,0,0,{"$f":"(((J15*Database!$U$3)+(K15*Database!$V$3)+(L15*Database!$W$3))*I15)","v":0},25,{"$f":"COUNTIFS(Output!$I$5:$I$36,Indoor!A15,Output!$H$6:$H$37,Indoor!N15)","v":0},0,0,0,{"$f":"(((P15*Database!$U$3)+(Q15*Database!$V$3)+(R15*Database!$W$3))*O15)","v":0},25,{"$f":"COUNTIFS(Output!$K$5:$K$36,Indoor!A15,Output!$J$6:$J$37,Indoor!T15)","v":0},0,0,0,{"$f":"(((V15*Database!$U$3)+(W15*Database!$V$3)+(X15*Database!$W$3))*U15)","v":0},25,{"$f":"COUNTIFS(Output!$M$5:$M$36,Indoor!A15,Output!$L$6:$L$37,Indoor!Z15)","v":0},0,0,0,{"$f":"(((AB15*Database!$U$3)+(AC15*Database!$V$3)+(AD15*Database!$W$3))*AA15)","v":0},25,{"$f":"COUNTIFS(Output!$O$5:$O$36,Indoor!A15,Output!$N$6:$N$37,Indoor!AF15)","v":0},0,0,0,{"$f":"(((AH15*Database!$U$3)+(AI15*Database!$V$3)+(AJ15*Database!$W$3))*AG15)","v":0},25,{"$f":"COUNTIFS(Output!$Q$5:$Q$36,Indoor!A15,Output!$P$6:$P$37,Indoor!AL15)","v":0},0,0,0,{"$f":"(((AN15*Database!$U$3)+(AO15*Database!$V$3)+(AP15*Database!$W$3))*AM15)","v":0},25,{"$f":"COUNTIFS(Output!$S$5:$S$36,Indoor!A15,Output!$R$6:$R$37,Indoor!AR15)","v":0},0,0,0,{"$f":"(((AT15*Database!$U$3)+(AU15*Database!$V$3)+(AV15*Database!$W$3))*AS15)","v":0},25,{"$f":"COUNTIFS(Output!$U$5:$U$36,Indoor!A15,Output!$T$6:$T$37,Indoor!AX15)","v":0},0,0,0,{"$f":"(((AZ15*Database!$U$3)+(BA15*Database!$V$3)+(BB15*Database!$W$3))*AY15)","v":0},25,{"$f":"COUNTIFS(Output!$W$5:$W$36,Indoor!A15,Output!$V$6:$V$37,Indoor!BD15)","v":0},0,0,0,{"$f":"(((BF15*Database!$U$3)+(BG15*Database!$V$3)+(BH15*Database!$W$3))*BE15)","v":0},0]
[{"$f":"Lists!$F$3","v":"Ceiling Mounted Cassette"},31.25,{"$f":"COUNTIFS(Output!$E$5:$E$36,Indoor!A16,Output!$D$6:$D$37,Indoor!B16)","v":0},0.14000000000000001,0.107,0.1235,{"$f":"(((D16*Database!$U$3)+(E16*Database!$V$3)+(F16*Database!$W$3))*C16)","v":0},31.25,{"$f":"COUNTIFS(Output!$G$5:$G$36,Indoor!A16,Output!$F$6:$F$37,Indoor!H16)","v":0},0.14000000000000001,0.107,0.1235,{"$f":"(((J16*Database!$U$3)+(K16*Database!$V$3)+(L16*Database!$W$3))*I16)","v":0},31.25,{"$f":"COUNTIFS(Output!$I$5:$I$36,Indoor!A16,Output!$H$6:$H$37,Indoor!N16)","v":0},0.14000000000000001,0.107,0.1235,{"$f":"(((P16*Database!$U$3)+(Q16*Database!$V$3)+(R16*Database!$W$3))*O16)","v":0},31.25,{"$f":"COUNTIFS(Output!$K$5:$K$36,Indoor!A16,Output!$J$6:$J$37,Indoor!T16)","v":0},0.14000000000000001,0.107,0.1235,{"$f":"(((V16*Database!$U$3)+(W16*Database!$V$3)+(X16*Database!$W$3))*U16)","v":0},31.25,{"$f":"COUNTIFS(Output!$M$5:$M$36,Indoor!A16,Output!$L$6:$L$37,Indoor!Z16)","v":0},0.14000000000000001,0.107,0.1235,{"$f":"(((AB16*Database!$U$3)+(AC16*Database!$V$3)+(AD16*Database!$W$3))*AA16)","v":0},31.25,{"$f":"COUNTIFS(Output!$O$5:$O$36,Indoor!A16,Output!$N$6:$N$37,Indoor!AF16)","v":0},0.14000000000000001,0.107,0.1235,{"$f":"(((AH16*Database!$U$3)+(AI16*Database!$V$3)+(AJ16*Database!$W$3))*AG16)","v":0},31.25,{"$f":"COUNTIFS(Output!$Q$5:$Q$36,Indoor!A16,Output!$P$6:$P$37,Indoor!AL16)","v":0},0.14000000000000001,0.107,0.1235,{"$f":"(((AN16*Database!$U$3)+(AO16*Database!$V$3)+(AP16*Database!$W$3))*AM16)","v":0},31.25,{"$f":"COUNTIFS(Output!$S$5:$S$36,Indoor!A16,Output!$R$6:$R$37,Indoor!AR16)","v":0},0.14000000000000001,0.107,0.1235,{"$f":"(((AT16*Database!$U$3)+(AU16*Database!$V$3)+(AV16*Database!$W$3))*AS16)","v":0},31.25,{"$f":"COUNTIFS(Output!$U$5:$U$36,Indoor!A16,Output!$T$6:$T$37,Indoor!AX16)","v":0},0.14000000000000001,0.107,0.1235,{"$f":"(((AZ16*Database!$U$3)+(BA16*Database!$V$3)+(BB16*Database!$W$3))*AY16)","v":0},31.25,{"$f":"COUNTIFS(Output!$W$5:$W$36,Indoor!A16,Output!$V$6:$V$37,Indoor!BD16)","v":0},0.14000000000000001,0.107,0.1235,{"$f":"(((BF16*Database!$U$3)+(BG16*Database!$V$3)+(BH16*Database!$W$3))*BE16)","v":0},0]
[{"$f":"Lists!$F$3","v":"Ceiling Mounted Cassette"},40,{"$f":"COUNTIFS(Output!$E$5:$E$36,Indoor!A17,Output!$D$6:$D$37,Indoor!B17)","v":0},0.14000000000000001,0.107,0.1235,{"$f":"(((D17*Database!$U$3)+(E17*Database!$V$3)+(F17*Database!$W$3))*C17)","v":0},40,{"$f":"COUNTIFS(Output!$G$5:$G$36,Indoor!A17,Output!$F$6:$F$37,Indoor!H17)","v":0},0.14000000000000001,0.107,0.1235,{"$f":"(((J17*Database!$U$3)+(K17*Database!$V$3)+(L17*Database!$W$3))*I17)","v":0},40,{"$f":"COUNTIFS(Output!$I$5:$I$36,Indoor!A17,Output!$H$6:$H$37,Indoor!N17)","v":0},0.14000000000000001,0.107,0.1235,{"$f":"(((P17*Database!$U$3)+(Q17*Database!$V$3)+(R17*Database!$W$3))*O17)","v":0},40,{"$f":"COUNTIFS(Output!$K$5:$K$36,Indoor!A17,Output!$J$6:$J$37,Indoor!T17)","v":0},0.14000000000000001,0.107,0.1235,{"$f":"(((V17*Database!$U$3)+(W17*Database!$V$3)+(X17*Database!$W$3))*U17)","v":0},40,{"$f":"COUNTIFS(Output!$M$5:$M$36,Indoor!A17,Output!$L$6:$L$37,Indoor!Z17)","v":0},0.14000000000000001,0.107,0.1235,{"$f":"(((AB17*Database!$U$3)+(AC17*Database!$V$3)+(AD17*Database!$W$3))*AA17)","v":0},40,{"$f":"COUNTIFS(Output!$O$5:$O$36,Indoor!A17,Output!$N$6:$N$37,Indoor!AF17)","v":0},0.14000000000000001,0.107,0.1235,{"$f":"(((AH17*Database!$U$3)+(AI17*Database!$V$3)+(AJ17*Database!$W$3))*AG17)","v":0},40,{"$f":"COUNTIFS(Output!$Q$5:$Q$36,Indoor!A17,Output!$P$6:$P$37,Indoor!AL17)","v":0},0.14000000000000001,0.107,0.1235,{"$f":"(((AN17*Database!$U$3)+(AO17*Database!$V$3)+(AP17*Database!$W$3))*AM17)","v":0},40,{"$f":"COUNTIFS(Output!$S$5:$S$36,Indoor!A17,Output!$R$6:$R$37,Indoor!AR17)","v":0},0.14000000000000001,0.107,0.1235,{"$f":"(((AT17*Database!$U$3)+(AU17*Database!$V$3)+(AV17*Database!$W$3))*AS17)","v":0},40,{"$f":"COUNTIFS(Output!$U$5:$U$36,Indoor!A17,Output!$T$6:$T$37,Indoor!AX17)","v":0},0.14000000000000001,0.107,0.1235,{"$f":"(((AZ17*Database!$U$3)+(BA17*Database!$V$3)+(BB17*Database!$W$3))*AY17)","v":0},40,{"$f":"COUNTIFS(Output!$W$5:$W$36,Indoor!A17,Output!$V$6:$V$37,Indoor!BD17)","v":0},0.14000000000000001,0.107,0.1235,{"$f":"(((BF17*Database!$U$3)+(BG17*Database!$V$3)+(BH17*Database!$W$3))*BE17)","v":0},0]
[{"$f":"Lists!$F$3","v":"Ceiling Mounted Cassette"},50,{"$f":"COUNTIFS(Output!$E$5:$E$36,Indoor!A18,Output!$D$6:$D$37,Indoor!B18)","v":0},0.14000000000000001,0.107,0.1235,{"$f":"(((D18*Database!$U$3)+(E18*Database!$V$3)+(F18*Database!$W$3))*C18)","v":0},50,{"$f":"COUNTIFS(Output!$G$5:$G$36,Indoor!A18,Output!$F$6:$F$37,Indoor!H18)","v":0},0.14000000000000001,0.107,0.1235,{"$f":"(((J18*Database!$U$3)+(K18*Database!$V$3)+(L18*Database!$W$3))*I18)","v":0},50,{"$f":"COUNTIFS(Output!$I$5:$I$36,Indoor!A18,Output!$H$6:$H$37,Indoor!N18)","v":0},0.14000000000000001,0.107,0.1235,{"$f":"(((P18*Database!$U$3)+(Q18*Database!$V$3)+(R18*Database!$W$3))*O18)","v":0},50,{"$f":"COUNTIFS(Output!$K$5:$K$36,Indoor!A18,Output!$J$6:$J$37,Indoor!T18)","v":0},0.14000000000000001,0.107,0.1235,{"$f":"(((V18*Database!$U$3)+(W18*Database!$V$3)+(X18*Database!$W$3))*U18)","v":0},50,{"$f":"COUNTIFS(Output!$M$5:$M$36,Indoor!A18,Output!$L$6:$L$37,Indoor!Z18)","v":0},0.14000000000000001,0.107,0.1235,{"$f":"(((AB18*Database!$U$3)+(AC18*Database!$V$3)+(AD18*Database!$W$3))*AA18)","v":0},50,{"$f":"COUNTIFS(Output!$O$5:$O$36,Indoor!A18,Output!$N$6:$N$37,Indoor!AF18)","v":0},0.14000000000000001,0.107,0.1235,{"$f":"(((AH18*Database!$U$3)+(AI18*Database!$V$3)+(AJ18*Database!$W$3))*AG18)","v":0},50,{"$f":"COUNTIFS(Output!$Q$5:$Q$36,Indoor!A18,Output!$P$6:$P$37,Indoor!AL18)","v":0},0.14000000000000001,0.107,0.1235,{"$f":"(((AN18*Database!$U$3)+(AO18*Database!$V$3)+(AP18*Database!$W$3))*AM18)","v":0},50,{"$f":"COUNTIFS(Output!$S$5:$S$36,Indoor!A18,Output!$R$6:$R$37,Indoor!AR18)","v":0},0.14000000000000001,0.107,0.1235,{"$f":"(((AT18*Database!$U$3)+(AU18*Database!$V$3)+(AV18*Database!$W$3))*AS18)","v":0},50,{"$f":"COUNTIFS(Output!$U$5:$U$36,Indoor!A18,Output!$T$6:$T$37,Indoor!AX18)","v":0},0.14000000000000001,0.107,0.1235,{"$f":"(((AZ18*Database!$U$3)+(BA18*Database!$V$3)+(BB18*Database!$W$3))*AY18)","v":0},50,{"$f":"COUNTIFS(Output!$W$5:$W$36,Indoor!A18,Output!$V$6:$V$37,Indoor!BD18)","v":0},0.14000000000000001,0.107,0.1235,{"$f":"(((BF18*Database!$U$3)+(BG18*Database!$V$3)+(BH18*Database!$W$3))*BE18)","v":0},0]
[{"$f":"Lists!$F$3","v":"Ceiling Mounted Cassette"},63,{"$f":"COUNTIFS(Output!$E$5:$E$36,Indoor!A19,Output!$D$6:$D$37,Indoor!B19)","v":0},0.161,0.128,0.14450000000000002,{"$f":"(((D19*Database!$U$3)+(E19*Database!$V$3)+(F19*Database!$W$3))*C19)","v":0},63,{"$f":"COUNTIFS(Output!$G$5:$G$36,Indoor!A19,Output!$F$6:$F$37,Indoor!H19)","v":0},0.161,0.128,0.14450000000000002,{"$f":"(((J19*Database!$U$3)+(K19*Database!$V$3)+(L19*Database!$W$3))*I19)","v":0},63,{"$f":"COUNTIFS(Output!$I$5:$I$36,Indoor!A19,Output!$H$6:$H$37,Indoor!N19)","v":0},0.161,0.128,0.14450000000000002,{"$f":"(((P19*Database!$U$3)+(Q19*Database!$V$3)+(R19*Database!$W$3))*O19)","v":0},63,{"$f":"COUNTIFS(Output!$K$5:$K$36,Indoor!A19,Output!$J$6:$J$37,Indoor!T19)","v":0},0.161,0.128,0.14450000000000002,{"$f":"(((V19*Database!$U$3)+(W19*Database!$V$3)+(X19*Database!$W$3))*U19)","v":0},63,{"$f":"COUNTIFS(Output!$M$5:$M$36,Indoor!A19,Output!$L$6:$L$37,Indoor!Z19)","v":0},0.161,0.128,0.14450000000000002,{"$f":"(((AB19*Database!$U$3)+(AC19*Database!$V$3)+(AD19*Database!$W$3))*AA19)","v":0},63,{"$f":"COUNTIFS(Output!$O$5:$O$36,Indoor!A19,Output!$N$6:$N$37,Indoor!AF19)","v":0},0.161,0.128,0.14450000000000002,{"$f":"(((AH19*Database!$U$3)+(AI19*Database!$V$3)+(AJ19*Database!$W$3))*AG19)","v":0},63,{"$f":"COUNTIFS(Output!$Q$5:$Q$36,Indoor!A19,Output!$P$6:$P$37,Indoor!AL19)","v":0},0.161,0.128,0.14450000000000002,{"$f":"(((AN19*Database!$U$3)+(AO19*Database!$V$3)+(AP19*Database!$W$3))*AM19)","v":0},63,{"$f":"COUNTIFS(Output!$S$5:$S$36,Indoor!A19,Output!$R$6:$R$37,Indoor!AR19)","v":0},0.161,0.128,0.14450000000000002,{"$f":"(((AT19*Database!$U$3)+(AU19*Database!$V$3)+(AV19*Database!$W$3))*AS19)","v":0},63,{"$f":"COUNTIFS(Output!$U$5:$U$36,Indoor!A19,Output!$T$6:$T$37,Indoor!AX19)","v":0},0.161,0.128,0.14450000000000002,{"$f":"(((AZ19*Database!$U$3)+(BA19*Database!$V$3)+(BB19*Database!$W$3))*AY19)","v":0},63,{"$f":"COUNTIFS(Output!$W$5:$W$36,Indoor!A19,Output!$V$6:$V$37,Indoor!BD19)","v":0},0.161,0.128,0.14450000000000002,{"$f":"(((BF19*Database!$U$3)+(BG19*Database!$V$3)+(BH19*Database!$W$3))*BE19)","v":0},0]
[{"$f":"Lists!$F$3","v":"Ceiling Mounted Cassette"},80,{"$f":"COUNTIFS(Output!$E$5:$E$36,Indoor!A20,Output!$D$6:$D$37,Indoor!B20)","v":0},0.24,0.17100000000000001,0.20550000000000002,{"$f":"(((D20*Database!$U$3)+(E20*Database!$V$3)+(F20*Database!$W$3))*C20)","v":0},80,{"$f":"COUNTIFS(Output!$G$5:$G$36,Indoor!A20,Output!$F$6:$F$37,Indoor!H20)","v":0},0.24,0.17100000000000001,0.20550000000000002,{"$f":"(((J20*Database!$U$3)+(K20*Database!$V$3)+(L20*Database!$W$3))*I20)","v":0},80,{"$f":"COUNTIFS(Output!$I$5:$I$36,Indoor!A20,Output!$H$6:$H$37,Indoor!N20)","v":0},0.24,0.17100000000000001,0.20550000000000002,{"$f":"(((P20*Database!$U$3)+(Q20*Database!$V$3)+(R20*Database!$W$3))*O20)","v":0},80,{"$f":"COUNTIFS(Output!$K$5:$K$36,Indoor!A20,Output!$J$6:$J$37,Indoor!T20)","v":0},0.24,0.17100000000000001,0.20550000000000002,{"$f":"(((V20*Database!$U$3)+(W20*Database!$V$3)+(X20*Database!$W$3))*U20)","v":0},80,{"$f":"COUNTIFS(Output!$M$5:$M$36,Indoor!A20,Output!$L$6:$L$37,Indoor!Z20)","v":0},0.24,0.17100000000000001,0.20550000000000002,{"$f":"(((AB20*Database!$U$3)+(AC20*Database!$V$3)+(AD20*Database!$W$3))*AA20)","v":0},80,{"$f":"COUNTIFS(Output!$O$5:$O$36,Indoor!A20,Output!$N$6:$N$37,Indoor!AF20)","v":0},0.24,0.17100000000000001,0.20550000000000002,{"$f":"(((AH20*Database!$U$3)+(AI20*Database!$V$3)+(AJ20*Database!$W$3))*AG20)","v":0},80,{"$f":"COUNTIFS(Output!$Q$5:$Q$36,Indoor!A20,Output!$P$6:$P$37,Indoor!AL20)","v":0},0.24,0.17100000000000001,0.20550000000000002,{"$f":"(((AN20*Database!$U$3)+(AO20*Database!$V$3)+(AP20*Database!$W$3))*AM20)","v":0},80,{"$f":"COUNTIFS(Output!$S$5:$S$36,Indoor!A20,Output!$R$6:$R$37,Indoor!AR20)","v":0},0.24,0.17100000000000001,0.20550000000000002,{"$f":"(((AT20*Database!$U$3)+(AU20*Database!$V$3)+(AV20*Database!$W$3))*AS20)","v":0},80,{"$f":"COUNTIFS(Output!$U$5:$U$36,Indoor!A20,Output!$T$6:$T$37,Indoor!AX20)","v":0},0.24,0.17100000000000001,0.20550000000000002,{"$f":"(((AZ20*Database!$U$3)+(BA20*Database!$V$3)+(BB20*Database!$W$3))*AY20)","v":0},80,{"$f":"COUNTIFS(Output!$W$5:$W$36,Indoor!A20,Output!$V$6:$V$37,Indoor!BD20)","v":0},0.24,0.17100000000000001,0.20550000000000002,{"$f":"(((BF20*Database!$U$3)+(BG20*Database!$V$3)+(BH20*Database!$W$3))*BE20)","v":0},0]
[{"$f":"Lists!$F$3","v":"Ceiling Mounted Cassette"},100,{"$f":"COUNTIFS(Output!$E$5:$E$36,Indoor!A21,Output!$D$6:$D$37,Indoor!B21)","v":0},0.20399999999999999,0.17100000000000001,{"$f":"(D21+E21)/2","v":0.1875},{"$f":"(((D21*Database!$U$3)+(E21*Database!$V$3)+(F21*Database!$W$3))*C21)","v":0},100,{"$f":"COUNTIFS(Output!$G$5:$G$36,Indoor!A21,Output!$F$6:$F$37,Indoor!H21)","v":0},{"$f":"D21","v":0.20399999999999999},{"$f":"E21","v":0.17100000000000001},0.1875,{"$f":"(((J21*Database!$U$3)+(K21*Database!$V$3)+(L21*Database!$W$3))*I21)","v":0},100,{"$f":"COUNTIFS(Output!$I$5:$I$36,Indoor!A21,Output!$H$6:$H$37,Indoor!N21)","v":0},{"$f":"D21","v":0.20399999999999999},{"$f":"E21","v":0.17100000000000001},0.1875,{"$f":"(((P21*Database!$U$3)+(Q21*Database!$V$3)+(R21*Database!$W$3))*O21)","v":0},100,{"$f":"COUNTIFS(Output!$K$5:$K$36,Indoor!A21,Output!$J$6:$J$37,Indoor!T21)","v":0},{"$f":"D21","v":0.20399999999999999},{"$f":"E21","v":0.17100000000000001},0.1875,{"$f":"(((V21*Database!$U$3)+(W21*Database!$V$3)+(X21*Database!$W$3))*U21)","v":0},100,{"$f":"COUNTIFS(Output!$M$5:$M$36,Indoor!A21,Output!$L$6:$L$37,Indoor!Z21)","v":0},{"$f":"D21","v":0.20399999999999999},{"$f":"E21","v":0.17100000000000001},0.1875,{"$f":"(((AB21*Database!$U$3)+(AC21*Database!$V$3)+(AD21*Database!$W$3))*AA21)","v":0},100,{"$f":"COUNTIFS(Output!$O$5:$O$36,Indoor!A21,Output!$N$6:$N$37,Indoor!AF21)","v":0},{"$f":"D21","v":0.20399999999999999},{"$f":"E21","v":0.17100000000000001},0.1875,{"$f":"(((AH21*Database!$U$3)+(AI21*Database!$V$3)+(AJ21*Database!$W$3))*AG21)","v":0},100,{"$f":"COUNTIFS(Output!$Q$5:$Q$36,Indoor!A21,Output!$P$6:$P$37,Indoor!AL21)","v":0},{"$f":"D21","v":0.20399999999999999},{"$f":"E21","v":0.17100000000000001},0.1875,{"$f":"(((AN21*Database!$U$3)+(AO21*Database!$V$3)+(AP21*Database!$W$3))*AM21)","v":0},100,{"$f":"COUNTIFS(Output!$S$5:$S$36,Indoor!A21,Output!$R$6:$R$37,Indoor!AR21)","v":0},{"$f":"D21","v":0.20399999999999999},{"$f":"E21","v":0.17100000000000001},0.1875,{"$f":"(((AT21*Database!$U$3)+(AU21*Database!$V$3)+(AV21*Database!$W$3))*AS21)","v":0},100,{"$f":"COUNTIFS(Output!$U$5:$U$36,Indoor!A21,Output!$T$6:$T$37,Indoor!AX21)","v":0},{"$f":"D21","v":0.20399999999999999},{"$f":"E21","v":0.17100000000000001},0.1875,{"$f":"(((AZ21*Database!$U$3)+(BA21*Database!$V$3)+(BB21*Database!$W$3))*AY21)","v":0},100,{"$f":"COUNTIFS(Output!$W$5:$W$36,Indoor!A21,Output!$V$6:$V$37,Indoor!BD21)","v":0},{"$f":"D21","v":0.20399999999999999},{"$f":"E21","v":0.17100000000000001},0.1875,{"$f":"(((BF21*Database!$U$3)+(BG21*Database!$V$3)+(BH21*Database!$W$3))*BE21)","v":0},0]
[{"$f":"Lists!$F$3","v":"Ceiling Mounted Cassette"},125,{"$f":"COUNTIFS(Output!$E$5:$E$36,Indoor!A22,Output!$D$6:$D$37,Indoor!B22)","v":0},0.23799999999999999,0.20499999999999999,{"$f":"(D22+E22)/2","v":0.22149999999999997},{"$f":"(((D22*Database!$U$3)+(E22*Database!$V$3)+(F22*Database!$W$3))*C22)","v":0},125,{"$f":"COUNTIFS(Output!$G$5:$G$36,Indoor!A22,Output!$F$6:$F$37,Indoor!H22)","v":0},{"$f":"D22","v":0.23799999999999999},{"$f":"E22","v":0.20499999999999999},0.22149999999999997,{"$f":"(((J22*Database!$U$3)+(K22*Database!$V$3)+(L22*Database!$W$3))*I22)","v":0},125,{"$f":"COUNTIFS(Output!$I$5:$I$36,Indoor!A22,Output!$H$6:$H$37,Indoor!N22)","v":0},{"$f":"D22","v":0.23799999999999999},{"$f":"E22","v":0.20499999999999999},0.22149999999999997,{"$f":"(((P22*Database!$U$3)+(Q22*Database!$V$3)+(R22*Database!$W$3))*O22)","v":0},125,{"$f":"COUNTIFS(Output!$K$5:$K$36,Indoor!A22,Output!$J$6:$J$37,Indoor!T22)","v":0},{"$f":"D22","v":0.23799999999999999},{"$f":"E22","v":0.20499999999999999},0.22149999999999997,{"$f":"(((V22*Database!$U$3)+(W22*Database!$V$3)+(X22*Database!$W$3))*U22)","v":0},125,{"$f":"COUNTIFS(Output!$M$5:$M$36,Indoor!A22,Output!$L$6:$L$37,Indoor!Z22)","v":0},{"$f":"D22","v":0.23799999999999999},{"$f":"E22","v":0.20499999999999999},0.22149999999999997,{"$f":"(((AB22*Database!$U$3)+(AC22*Database!$V$3)+(AD22*Database!$W$3))*AA22)","v":0},125,{"$f":"COUNTIFS(Output!$O$5:$O$36,Indoor!A22,Output!$N$6:$N$37,Indoor!AF22)","v":0},{"$f":"D22","v":0.23799999999999999},{"$f":"E22","v":0.20499999999999999},0.22149999999999997,{"$f":"(((AH22*Database!$U$3)+(AI22*Database!$V$3)+(AJ22*Database!$W$3))*AG22)","v":0},125,{"$f":"COUNTIFS(Output!$Q$5:$Q$36,Indoor!A22,Output!$P$6:$P$37,Indoor!AL22)","v":0},{"$f":"D22","v":0.23799999999999999},{"$f":"E22","v":0.20499999999999999},0.22149999999999997,{"$f":"(((AN22*Database!$U$3)+(AO22*Database!$V$3)+(AP22*Database!$W$3))*AM22)","v":0},125,{"$f":"COUNTIFS(Output!$S$5:$S$36,Indoor!A22,Output!$R$6:$R$37,Indoor!AR22)","v":0},{"$f":"D22","v":0.23799999999999999},{"$f":"E22","v":0.20499999999999999},0.22149999999999997,{"$f":"(((AT22*Database!$U$3)+(AU22*Database!$V$3)+(AV22*Database!$W$3))*AS22)","v":0},125,{"$f":"COUNTIFS(Output!$U$5:$U$36,Indoor!A22,Output!$T$6:$T$37,Indoor!AX22)","v":0},{"$f":"D22","v":0.23799999999999999},{"$f":"E22","v":0.20499999999999999},0.22149999999999997,{"$f":"(((AZ22*Database!$U$3)+(BA22*Database!$V$3)+(BB22*Database!$W$3))*AY22)","v":0},125,{"$f":"COUNTIFS(Output!$W$5:$W$36,Indoor!A22,Output!$V$6:$V$37,Indoor!BD22)","v":0},{"$f":"D22","v":0.23799999999999999},{"$f":"E22","v":0.20499999999999999},0.22149999999999997,{"$f":"(((BF22*Database!$U$3)+(BG22*Database!$V$3)+(BH22*Database!$W$3))*BE22)","v":0},0]
[{"$f":"Lists!$F$3","v":"Ceiling Mounted Cassette"},200,{"$f":"COUNTIFS(Output!$E$5:$E$36,Indoor!A23,Output!$D$6:$D$37,Indoor!B23)","v":0},null,null,0,{"$f":"(((D23*Database!$U$3)+(E23*Database!$V$3)+(F23*Database!$W$3))*C23)","v":0},200,{"$f":"COUNTIFS(Output!$G$5:$G$36,Indoor!A23,Output!$F$6:$F$37,Indoor!H23)","v":0},0,0,0,{"$f":"(((J23*Database!$U$3)+(K23*Database!$V$3)+(L23*Database!$W$3))*I23)","v":0},200,{"$f":"COUNTIFS(Output!$I$5:$I$36,Indoor!A23,Output!$H$6:$H$37,Indoor!N23)","v":0},0,0,0,{"$f":"(((P23*Database!$U$3)+(Q23*Database!$V$3)+(R23*Database!$W$3))*O23)","v":0},200,{"$f":"COUNTIFS(Output!$K$5:$K$36,Indoor!A23,Output!$J$6:$J$37,Indoor!T23)","v":0},0,0,0,{"$f":"(((V23*Database!$U$3)+(W23*Database!$V$3)+(X23*Database!$W$3))*U23)","v":0},200,{"$f":"COUNTIFS(Output!$M$5:$M$36,Indoor!A23,Output!$L$6:$L$37,Indoor!Z23)","v":0},0,0,0,{"$f":"(((AB23*Database!$U$3)+(AC23*Database!$V$3)+(AD23*Database!$W$3))*AA23)","v":0},200,{"$f":"COUNTIFS(Output!$O$5:$O$36,Indoor!A23,Output!$N$6:$N$37,Indoor!AF23)","v":0},0,0,0,{"$f":"(((AH23*Database!$U$3)+(AI23*Database!$V$3)+(AJ23*Database!$W$3))*AG23)","v":0},200,{"$f":"COUNTIFS(Output!$Q$5:$Q$36,Indoor!A23,Output!$P$6:$P$37,Indoor!AL23)","v":0},0,0,0,{"$f":"(((AN23*Database!$U$3)+(AO23*Database!$V$3)+(AP23*Database!$W$3))*AM23)","v":0},200,{"$f":"COUNTIFS(Output!$S$5:$S$36,Indoor!A23,Output!$R$6:$R$37,Indoor!AR23)","v":0},0,0,0,{"$f":"(((AT23*Database!$U$3)+(AU23*Database!$V$3)+(AV23*Database!$W$3))*AS23)","v":0},200,{"$f":"COUNTIFS(Output!$U$5:$U$36,Indoor!A23,Output!$T$6:$T$37,Indoor!AX23)","v":0},0,0,0,{"$f":"(((AZ23*Database!$U$3)+(BA23*Database!$V$3)+(BB23*Database!$W$3))*AY23)","v":0},200,{"$f":"COUNTIFS(Output!$W$5:$W$36,Indoor!A23,Output!$V$6:$V$37,Indoor!BD23)","v":0},0,0,0,{"$f":"(((BF23*Database!$U$3)+(BG23*Database!$V$3)+(BH23*Database!$W$3))*BE23)","v":0},0]
[{"$f":"Lists!$F$3","v":"Ceiling Mounted Cassette"},250,{"$f":"COUNTIFS(Output!$E$5:$E$36,Indoor!A24,Output!$D$6:$D$37,Indoor!B24)","v":0},null,null,0,{"$f":"(((D24*Database!$U$3)+(E24*Database!$V$3)+(F24*Database!$W$3))*C24)","v":0},250,{"$f":"COUNTIFS(Output!$G$5:$G$36,Indoor!A24,Output!$F$6:$F$37,Indoor!H24)","v":0},0,0,0,{"$f":"(((J24*Database!$U$3)+(K24*Database!$V$3)+(L24*Database!$W$3))*I24)","v":0},250,{"$f":"COUNTIFS(Output!$I$5:$I$36,Indoor!A24,Output!$H$6:$H$37,Indoor!N24)","v":0},0,0,0,{"$f":"(((P24*Database!$U$3)+(Q24*Database!$V$3)+(R24*Database!$W$3))*O24)","v":0},250,{"$f":"COUNTIFS(Output!$K$5:$K$36,Indoor!A24,Output!$J$6:$J$37,Indoor!T24)","v":0},0,0,0,{"$f":"(((V24*Database!$U$3)+(W24*Database!$V$3)+(X24*Database!$W$3))*U24)","v":0},250,{"$f":"COUNTIFS(Output!$M$5:$M$36,Indoor!A24,Output!$L$6:$L$37,Indoor!Z24)","v":0},0,0,0,{"$f":"(((AB24*Database!$U$3)+(AC24*Database!$V$3)+(AD24*Database!$W$3))*AA24)","v":0},250,{"$f":"COUNTIFS(Output!$O$5:$O$36,Indoor!A24,Output!$N$6:$N$37,Indoor!AF24)","v":0},0,0,0,{"$f":"(((AH24*Database!$U$3)+(AI24*Database!$V$3)+(AJ24*Database!$W$3))*AG24)","v":0},250,{"$f":"COUNTIFS(Output!$Q$5:$Q$36,Indoor!A24,Output!$P$6:$P$37,Indoor!AL24)","v":0},0,0,0,{"$f":"(((AN24*Database!$U$3)+(AO24*Database!$V$3)+(AP24*Database!$W$3))*AM24)","v":0},250,{"$f":"COUNTIFS(Output!$S$5:$S$36,Indoor!A24,Output!$R$6:$R$37,Indoor!AR24)","v":0},0,0,0,{"$f":"(((AT24*Database!$U$3)+(AU24*Database!$V$3)+(AV24*Database!$W$3))*AS24)","v":0},250,{"$f":"COUNTIFS(Output!$U$5:$U$36,Indoor!A24,Output!$T$6:$T$37,Indoor!AX24)","v":0},0,0,0,{"$f":"(((AZ24*Database!$U$3)+(BA24*Database!$V$3)+(BB24*Database!$W$3))*AY24)","v":0},250,{"$f":"COUNTIFS(Output!$W$5:$W$36,Indoor!A24,Output!$V$6:$V$37,Indoor!BD24)","v":0},0,0,0,{"$f":"(((BF24*Database!$U$3)+(BG24*Database!$V$3)+(BH24*Database!$W$3))*BE24)","v":0},0]
[null,null,{"$f":"SUM(C14:C24)","v":0},null,null,null,null,null,{"$f":"SUM(I14:I24)","v":0},null,null,null,null,null,{"$f":"SUM(O14:O24)","v":0},null,null,null,null,null,{"$f":"SUM(U14:U24)","v":0},null,null,null,null,null,{"$f":"SUM(AA14:AA24)","v":0},null,null,null,null,null,{"$f":"SUM(AG14:AG24)","v":0},null,null,null,null,null,{"$f":"SUM(AM14:AM24)","v":0},null,null,null,null,null,{"$f":"SUM(AS14:AS24)","v":0},null,null,null,null,null,{"$f":"SUM(AY14:AY24)","v":0},null,null,null,null,null,{"$f":"SUM(BE14:BE24)","v":0}]
[{"$f":"Lists!$F$4","v":"Horizontal Ducted"},20,{"$f":"COUNTIFS(Output!$E$5:$E$36,Indoor!A26,Output!$D$6:$D$37,Indoor!B26)","v":0},0.11,0.09,0.1,{"$f":"(((D26*Database!$U$3)+(E26*Database!$V$3)+(F26*Database!$W$3))*C26)","v":0},20,{"$f":"COUNTIFS(Output!$G$5:$G$36,Indoor!A26,Output!$F$6:$F$37,Indoor!H26)","v":0},0.11,0.09,0.1,{"$f":"(((J26*Database!$U$3)+(K26*Database!$V$3)+(L26*Database!$W$3))*I26)","v":0},20,{"$f":"COUNTIFS(Output!$I$5:$I$36,Indoor!A26,Output!$H$6:$H$37,Indoor!N26)","v":0},0.11,0.09,0.1,{"$f":"(((P26*Database!$U$3)+(Q26*Database!$V$3)+(R26*Database!$W$3))*O26)","v":0},20,{"$f":"COUNTIFS(Output!$K$5:$K$36,Indoor!A26,Output!$J$6:$J$37,Indoor!T26)","v":0},0.11,0.09,0.1,{"$f":"(((V26*Database!$U$3)+(W26*Database!$V$3)+(X26*Database!$W$3))*U26)","v":0},20,{"$f":"COUNTIFS(Output!$M$5:$M$36,Indoor!A26,Output!$L$6:$L$37,Indoor!Z26)","v":0},0.11,0.09,0.1,{"$f":"(((AB26*Database!$U$3)+(AC26*Database!$V$3)+(AD26*Database!$W$3))*AA26)","v":0},20,{"$f":"COUNTIFS(Output!$O$5:$O$36,Indoor!A26,Output!$N$6:$N$37,Indoor!AF26)","v":0},0.11,0.09,0.1,{"$f":"(((AH26*Database!$U$3)+(AI26*Database!$V$3)+(AJ26*Database!$W$3))*AG26)","v":0},20,{"$f":"COUNTIFS(Output!$Q$5:$Q$36,Indoor!A26,Output!$P$6:$P$37,Indoor!AL26)","v":0},0.11,0.09,0.1,{"$f":"(((AN26*Database!$U$3)+(AO26*Database!$V$3)+(AP26*Database!$W$3))*AM26)","v":0},20,{"$f":"COUNTIFS(Output!$S$5:$S$36,Indoor!A26,Output!$R$6:$R$37,Indoor!AR26)","v":0},0.11,0.09,0.1,{"$f":"(((AT26*Database!$U$3)+(AU26*Database!$V$3)+(AV26*Database!$W$3))*AS26)","v":0},20,{"$f":"COUNTIFS(Output!$U$5:$U$36,Indoor!A26,Output!$T$6:$T$37,Indoor!AX26)","v":0},0.11,0.09,0.1,{"$f":"(((AZ26*Database!$U$3)+(BA26*Database!$V$3)+(BB26*Database!$W$3))*AY26)","v":0},20,{"$f":"COUNTIFS(Output!$W$5:$W$36,Indoor!A26,Output!$V$6:$V$37,Indoor!BD26)","v":0},0.11,0.09,0.1,{"$f":"(((BF26*Database!$U$3)+(BG26*Database!$V$3)+(BH26*Database!$W$3))*BE26)","v":0},{"$f":"SUM(BE26+AY26+AS26+AM26+AG26+AA26+U26+O26+I26+C26)","v":0}]
[{"$f":"Lists!$F$4","v":"Horizontal Ducted"},25,{"$f":"COUNTIFS(Output!$E$5:$E$36,Indoor!A27,Output!$D$6:$D$37,Indoor!B27)","v":0},0.11,0.09,0.1,{"$f":"(((D27*Database!$U$3)+(E27*Database!$V$3)+(F27*Database!$W$3))*C27)","v":0},25,{"$f":"COUNTIFS(Output!$G$5:$G$36,Indoor!A27,Output!$F$6:$F$37,Indoor!H27)","v":0},0.11,0.09,0.1,{"$f":"(((J27*Database!$U$3)+(K27*Database!$V$3)+(L27*Database!$W$3))*I27)","v":0},25,{"$f":"COUNTIFS(Output!$I$5:$I$36,Indoor!A27,Output!$H$6:$H$37,Indoor!N27)","v":0},0.11,0.09,0.1,{"$f":"(((P27*Database!$U$3)+(Q27*Database!$V$3)+(R27*Database!$W$3))*O27)","v":0},25,{"$f":"COUNTIFS(Output!$K$5:$K$36,Indoor!A27,Output!$J$6:$J$37,Indoor!T27)","v":0},0.11,0.09,0.1,{"$f":"(((V27*Database!$U$3)+(W27*Database!$V$3)+(X27*Database!$W$3))*U27)","v":0},25,{"$f":"COUNTIFS(Output!$M$5:$M$36,Indoor!A27,Output!$L$6:$L$37,Indoor!Z27)","v":0},0.11,0.09,0.1,{"$f":"(((AB27*Database!$U$3)+(AC27*Database!$V$3)+(AD27*Database!$W$3))*AA27)","v":0},25,{"$f":"COUNTIFS(Output!$O$5:$O$36,Indoor!A27,Output!$N$6:$N$37,Indoor!AF27)","v":0},0.11,0.09,0.1,{"$f":"(((AH27*Database!$U$3)+(AI27*Database!$V$3)+(AJ27*Database!$W$3))*AG27)","v":0},25,{"$f":"COUNTIFS(Output!$Q$5:$Q$36,Indoor!A27,Output!$P$6:$P$37,Indoor!AL27)","v":0},0.11,0.09,0.1,{"$f":"(((AN27*Database!$U$3)+(AO27*Database!$V$3)+(AP27*Database!$W$3))*AM27)","v":0},25,{"$f":"COUNTIFS(Output!$S$5:$S$36,Indoor!A27,Output!$R$6:$R$37,Indoor!AR27)","v":0},0.11,0.09,0.1,{"$f":"(((AT27*Database!$U$3)+(AU27*Database!$V$3)+(AV27*Database!$W$3))*AS27)","v":0},25,{"$f":"COUNTIFS(Output!$U$5:$U$36,Indoor!A27,Output!$T$6:$T$37,Indoor!AX27)","v":0},0.11,0.09,0.1,{"$f":"(((AZ27*Database!$U$3)+(BA27*Database!$V$3)+(BB27*Database!$W$3))*AY27)","v":0},25,{"$f":"COUNTIFS(Output!$W$5:$W$36,Indoor!A27,Output!$V$6:$V$37,Indoor!BD27)","v":0},0.11,0.09,0.1,{"$f":"(((BF27*Database!$U$3)+(BG27*Database!$V$3)+(BH27*Database!$W$3))*BE27)","v":0},0]
[{"$f":"Lists!$F$4","v":"Horizontal Ducted"},31.25,{"$f":"COUNTIFS(Output!$E$5:$E$36,Indoor!A28,Output!$D$6:$D$37,Indoor!B28)","v":1},0.11,0.09,0.1,{"$f":"(((D28*Database!$U$3)+(E28*Database!$V$3)+(F28*Database!$W$3))*C28)","v":89.232500000000002},31.25,{"$f":"COUNTIFS(Output!$G$5:$G$36,Indoor!A28,Output!$F$6:$F$37,Indoor!H28)","v":0},0.11,0.09,0.1,{"$f":"(((J28*Database!$U$3)+(K28*Database!$V$3)+(L28*Database!$W$3))*I28)","v":0},31.25,{"$f":"COUNTIFS(Output!$I$5:$I$36,Indoor!A28,Output!$H$6:$H$37,Indoor!N28)","v":0},0.11,0.09,0.1,{"$f":"(((P28*Database!$U$3)+(Q28*Database!$V$3)+(R28*Database!$W$3))*O28)","v":0},31.25,{"$f":"COUNTIFS(Output!$K$5:$K$36,Indoor!A28,Output!$J$6:$J$37,Indoor!T28)","v":0},0.11,0.09,0.1,{"$f":"(((V28*Database!$U$3)+(W28*Database!$V$3)+(X28*Database!$W$3))*U28)","v":0},31.25,{"$f":"COUNTIFS(Output!$M$5:$M$36,Indoor!A28,Output!$L$6:$L$37,Indoor!Z28)","v":0},0.11,0.09,0.1,{"$f":"(((AB28*Database!$U$3)+(AC28*Database!$V$3)+(AD28*Database!$W$3))*AA28)","v":0},31.25,{"$f":"COUNTIFS(Output!$O$5:$O$36,Indoor!A28,Output!$N$6:$N$37,Indoor!AF28)","v":0},0.11,0.09,0.1,{"$f":"(((AH28*Database!$U$3)+(AI28*Database!$V$3)+(AJ28*Database!$W$3))*AG28)","v":0},31.25,{"$f":"COUNTIFS(Output!$Q$5:$Q$36,Indoor!A28,Output!$P$6:$P$37,Indoor!AL28)","v":0},0.11,0.09,0.1,{"$f":"(((AN28*Database!$U$3)+(AO28*Database!$V$3)+(AP28*Database!$W$3))*AM28)","v":0},31.25,{"$f":"COUNTIFS(Output!$S$5:$S$36,Indoor!A28,Output!$R$6:$R$37,Indoor!AR28)","v":0},0.11,0.09,0.1,{"$f":"(((AT28*Database!$U$3)+(AU28*Database!$V$3)+(AV28*Database!$W$3))*AS28)","v":0},31.25,{"$f":"COUNTIFS(Output!$U$5:$U$36,Indoor!A28,Output!$T$6:$T$37,Indoor!AX28)","v":0},0.11,0.09,0.1,{"$f":"(((AZ28*Database!$U$3)+(BA28*Database!$V$3)+(BB28*Database!$W$3))*AY28)","v":0},31.25,{"$f":"COUNTIFS(Output!$W$5:$W$36,Indoor!A28,Output!$V$6:$V$37,Indoor!BD28)","v":0},0.11,0.09,0.1,{"$f":"(((BF28*Database!$U$3)+(BG28*Database!$V$3)+(BH28*Database!$W$3))*BE28)","v":0},1]
[{"$f":"Lists!$F$4","v":"Horizontal Ducted"},40,{"$f":"COUNTIFS(Output!$E$5:$E$36,Indoor!A29,Output!$D$6:$D$37,Indoor!B29)","v":0},0.127,0.107,0.11699999999999999,{"$f":"(((D29*Database!$U$3)+(E29*Database!$V$3)+(F29*Database!$W$3))*C29)","v":0},40,{"$f":"COUNTIFS(Output!$G$5:$G$36,Indoor!A29,Output!$F$6:$F$37,Indoor!H29)","v":0},0.127,0.107,0.11699999999999999,{"$f":"(((J29*Database!$U$3)+(K29*Database!$V$3)+(L29*Database!$W$3))*I29)","v":0},40,{"$f":"COUNTIFS(Output!$I$5:$I$36,Indoor!A29,Output!$H$6:$H$37,Indoor!N29)","v":0},0.127,0.107,0.11699999999999999,{"$f":"(((P29*Database!$U$3)+(Q29*Database!$V$3)+(R29*Database!$W$3))*O29)","v":0},40,{"$f":"COUNTIFS(Output!$K$5:$K$36,Indoor!A29,Output!$J$6:$J$37,Indoor!T29)","v":0},0.127,0.107,0.11699999999999999,{"$f":"(((V29*Database!$U$3)+(W29*Database!$V$3)+(X29*Database!$W$3))*U29)","v":0},40,{"$f":"COUNTIFS(Output!$M$5:$M$36,Indoor!A29,Output!$L$6:$L$37,Indoor!Z29)","v":0},0.127,0.107,0.11699999999999999,{"$f":"(((AB29*Database!$U$3)+(AC29*Database!$V$3)+(AD29*Database!$W$3))*AA29)","v":0},40,{"$f":"COUNTIFS(Output!$O$5:$O$36,Indoor!A29,Output!$N$6:$N$37,Indoor!AF29)","v":0},0.127,0.107,0.11699999999999999,{"$f":"(((AH29*Database!$U$3)+(AI29*Database!$V$3)+(AJ29*Database!$W$3))*AG29)","v":0},40,{"$f":"COUNTIFS(Output!$Q$5:$Q$36,Indoor!A29,Output!$P$6:$P$37,Indoor!AL29)","v":0},0.127,0.107,0.11699999999999999,{"$f":"(((AN29*Database!$U$3)+(AO29*Database!$V$3)+(AP29*Database!$W$3))*AM29)","v":0},40,{"$f":"COUNTIFS(Output!$S$5:$S$36,Indoor!A29,Output!$R$6:$R$37,Indoor!AR29)","v":0},0.127,0.107,0.11699999999999999,{"$f":"(((AT29*Database!$U$3)+(AU29*Database!$V$3)+(AV29*Database!$W$3))*AS29)","v":0},40,{"$f":"COUNTIFS(Output!$U$5:$U$36,Indoor!A29,Output!$T$6:$T$37,Indoor!AX29)","v":0},0.127,0.107,0.11699999999999999,{"$f":"(((AZ29*Database!$U$3)+(BA29*Database!$V$3)+(BB29*Database!$W$3))*AY29)","v":0},40,{"$f":"COUNTIFS(Output!$W$5:$W$36,Indoor!A29,Output!$V$6:$V$37,Indoor!BD29)","v":0},0.127,0.107,0.11699999999999999,{"$f":"(((BF29*Database!$U$3)+(BG29*Database!$V$3)+(BH29*Database!$W$3))*BE29)","v":0},0]
[{"$f":"Lists!$F$4","v":"Horizontal Ducted"},50,{"$f":"COUNTIFS(Output!$E$5:$E$36,Indoor!A30,Output!$D$6:$D$37,Indoor!B30)","v":0},0.14000000000000001,0.12,0.13,{"$f":"(((D30*Database!$U$3)+(E30*Database!$V$3)+(F30*Database!$W$3))*C30)","v":0},50,{"$f":"COUNTIFS(Output!$G$5:$G$36,Indoor!A30,Output!$F$6:$F$37,Indoor!H30)","v":0},0.14000000000000001,0.12,0.13,{"$f":"(((J30*Database!$U$3)+(K30*Database!$V$3)+(L30*Database!$W$3))*I30)","v":0},50,{"$f":"COUNTIFS(Output!$I$5:$I$36,Indoor!A30,Output!$H$6:$H$37,Indoor!N30)","v":0},0.14000000000000001,0.12,0.13,{"$f":"(((P30*Database!$U$3)+(Q30*Database!$V$3)+(R30*Database!$W$3))*O30)","v":0},50,{"$f":"COUNTIFS(Output!$K$5:$K$36,Indoor!A30,Output!$J$6:$J$37,Indoor!T30)","v":0},0.14000000000000001,0.12,0.13,{"$f":"(((V30*Database!$U$3)+(W30*Database!$V$3)+(X30*Database!$W$3))*U30)","v":0},50,{"$f":"COUNTIFS(Output!$M$5:$M$36,Indoor!A30,Output!$L$6:$L$37,Indoor!Z30)","v":0},0.14000000000000001,0.12,0.13,{"$f":"(((AB30*Database!$U$3)+(AC30*Database!$V$3)+(AD30*Database!$W$3))*AA30)","v":0},50,{"$f":"COUNTIFS(Output!$O$5:$O$36,Indoor!A30,Output!$N$6:$N$37,Indoor!AF30)","v":0},0.14000000000000001,0.12,0.13,{"$f":"(((AH30*Database!$U$3)+(AI30*Database!$V$3)+(AJ30*Database!$W$3))*AG30)","v":0},50,{"$f":"COUNTIFS(Output!$Q$5:$Q$36,Indoor!A30,Output!$P$6:$P$37,Indoor!AL30)","v":0},0.14000000000000001,0.12,0.13,{"$f":"(((AN30*Database!$U$3)+(AO30*Database!$V$3)+(AP30*Database!$W$3))*AM30)","v":0},50,{"$f":"COUNTIFS(Output!$S$5:$S$36,Indoor!A30,Output!$R$6:$R$37,Indoor!AR30)","v":0},0.14000000000000001,0.12,0.13,{"$f":"(((AT30*Database!$U$3)+(AU30*Database!$V$3)+(AV30*Database!$W$3))*AS30)","v":0},50,{"$f":"COUNTIFS(Output!$U$5:$U$36,Indoor!A30,Output!$T$6:$T$37,Indoor!AX30)","v":0},0.14000000000000001,0.12,0.13,{"$f":"(((AZ30*Database!$U$3)+(BA30*Database!$V$3)+(BB30*Database!$W$3))*AY30)","v":0},50,{"$f":"COUNTIFS(Output!$W$5:$W$36,Indoor!A30,Output!$V$6:$V$37,Indoor!BD30)","v":0},0.14000000000000001,0.12,0.13,{"$f":"(((BF30*Database!$U$3)+(BG30*Database!$V$3)+(BH30*Database!$W$3))*BE30)","v":0},0]
[{"$f":"Lists!$F$4","v":"Horizontal Ducted"},63,{"$f":"COUNTIFS(Output!$E$5:$E$36,Indoor!A31,Output!$D$6:$D$37,Indoor!B31)","v":0},0.184,0.16400000000000001,0.17399999999999999,{"$f":"(((D31*Database!$U$3)+(E31*Database!$V$3)+(F31*Database!$W$3))*C31)","v":0},63,{"$f":"COUNTIFS(Output!$G$5:$G$36,Indoor!A31,Output!$F$6:$F$37,Indoor!H31)","v":0},0.184,0.16400000000000001,0.17399999999999999,{"$f":"(((J31*Database!$U$3)+(K31*Database!$V$3)+(L31*Database!$W$3))*I31)","v":0},63,{"$f":"COUNTIFS(Output!$I$5:$I$36,Indoor!A31,Output!$H$6:$H$37,Indoor!N31)","v":0},0.184,0.16400000000000001,0.17399999999999999,{"$f":"(((P31*Database!$U$3)+(Q31*Database!$V$3)+(R31*Database!$W$3))*O31)","v":0},63,{"$f":"COUNTIFS(Output!$K$5:$K$36,Indoor!A31,Output!$J$6:$J$37,Indoor!T31)","v":0},0.184,0.16400000000000001,0.17399999999999999,{"$f":"(((V31*Database!$U$3)+(W31*Database!$V$3)+(X31*Database!$W$3))*U31)","v":0},63,{"$f":"COUNTIFS(Output!$M$5:$M$36,Indoor!A31,Output!$L$6:$L$37,Indoor!Z31)","v":0},0.184,0.16400000000000001,0.17399999999999999,{"$f":"(((AB31*Database!$U$3)+(AC31*Database!$V$3)+(AD31*Database!$W$3))*AA31)","v":0},63,{"$f":"COUNTIFS(Output!$O$5:$O$36,Indoor!A31,Output!$N$6:$N$37,Indoor!AF31)","v":0},0.184,0.16400000000000001,0.17399999999999999,{"$f":"(((AH31*Database!$U$3)+(AI31*Database!$V$3)+(AJ31*Database!$W$3))*AG31)","v":0},63,{"$f":"COUNTIFS(Output!$Q$5:$Q$36,Indoor!A31,Output!$P$6:$P$37,Indoor!AL31)","v":0},0.184,0.16400000000000001,0.17399999999999999,{"$f":"(((AN31*Database!$U$3)+(AO31*Database!$V$3)+(AP31*Database!$W$3))*AM31)","v":0},63,{"$f":"COUNTIFS(Output!$S$5:$S$36,Indoor!A31,Output!$R$6:$R$37,Indoor!AR31)","v":0},0.184,0.16400000000000001,0.17399999999999999,{"$f":"(((AT31*Database!$U$3)+(AU31*Database!$V$3)+(AV31*Database!$W$3))*AS31)","v":0},63,{"$f":"COUNTIFS(Output!$U$5:$U$36,Indoor!A31,Output!$T$6:$T$37,Indoor!AX31)","v":0},0.184,0.16400000000000001,0.17399999999999999,{"$f":"(((AZ31*Database!$U$3)+(BA31*Database!$V$3)+(BB31*Database!$W$3))*AY31)","v":0},63,{"$f":"COUNTIFS(Output!$W$5:$W$36,Indoor!A31,Output!$V$6:$V$37,Indoor!BD31)","v":0},0.184,0.16400000000000001,0.17399999999999999,{"$f":"(((BF31*Database!$U$3)+(BG31*Database!$V$3)+(BH31*Database!$W$3))*BE31)","v":0},0]
[{"$f":"Lists!$F$4","v":"Horizontal Ducted"},80,{"$f":"COUNTIFS(Output!$E$5:$E$36,Indoor!A32,Output!$D$6:$D$37,Indoor!B32)","v":0},0.216,0.19600000000000001,0.20600000000000002,{"$f":"(((D32*Database!$U$3)+(E32*Database!$V$3)+(F32*Database!$W$3))*C32)","v":0},80,{"$f":"COUNTIFS(Output!$G$5:$G$36,Indoor!A32,Output!$F$6:$F$37,Indoor!H32)","v":0},0.216,0.19600000000000001,0.20600000000000002,{"$f":"(((J32*Database!$U$3)+(K32*Database!$V$3)+(L32*Database!$W$3))*I32)","v":0},80,{"$f":"COUNTIFS(Output!$I$5:$I$36,Indoor!A32,Output!$H$6:$H$37,Indoor!N32)","v":0},0.216,0.19600000000000001,0.20600000000000002,{"$f":"(((P32*Database!$U$3)+(Q32*Database!$V$3)+(R32*Database!$W$3))*O32)","v":0},80,{"$f":"COUNTIFS(Output!$K$5:$K$36,Indoor!A32,Output!$J$6:$J$37,Indoor!T32)","v":0},0.216,0.19600000000000001,0.20600000000000002,{"$f":"(((V32*Database!$U$3)+(W32*Database!$V$3)+(X32*Database!$W$3))*U32)","v":0},80,{"$f":"COUNTIFS(Output!$M$5:$M$36,Indoor!A32,Output!$L$6:$L$37,Indoor!Z32)","v":0},0.216,0.19600000000000001,0.20600000000000002,{"$f":"(((AB32*Database!$U$3)+(AC32*Database!$V$3)+(AD32*Database!$W$3))*AA32)","v":0},80,{"$f":"COUNTIFS(Output!$O$5:$O$36,Indoor!A32,Output!$N$6:$N$37,Indoor!AF32)","v":0},0.216,0.19600000000000001,0.20600000000000002,{"$f":"(((AH32*Database!$U$3)+(AI32*Database!$V$3)+(AJ32*Database!$W$3))*AG32)","v":0},80,{"$f":"COUNTIFS(Output!$Q$5:$Q$36,Indoor!A32,Output!$P$6:$P$37,Indoor!AL32)","v":0},0.216,0.19600000000000001,0.20600000000000002,{"$f":"(((AN32*Database!$U$3)+(AO32*Database!$V$3)+(AP32*Database!$W$3))*AM32)","v":0},80,{"$f":"COUNTIFS(Output!$S$5:$S$36,Indoor!A32,Output!$R$6:$R$37,Indoor!AR32)","v":0},0.216,0.19600000000000001,0.20600000000000002,{"$f":"(((AT32*Database!$U$3)+(AU32*Database!$V$3)+(AV32*Database!$W$3))*AS32)","v":0},80,{"$f":"COUNTIFS(Output!$U$5:$U$36,Indoor!A32,Output!$T$6:$T$37,Indoor!AX32)","v":0},0.216,0.19600000000000001,0.20600000000000002,{"$f":"(((AZ32*Database!$U$3)+(BA32*Database!$V$3)+(BB32*Database!$W$3))*AY32)","v":0},80,{"$f":"COUNTIFS(Output!$W$5:$W$36,Indoor!A32,Output!$V$6:$V$37,Indoor!BD32)","v":0},0.216,0.19600000000000001,0.20600000000000002,{"$f":"(((BF32*Database!$U$3)+(BG32*Database!$V$3)+(BH32*Database!$W$3))*BE32)","v":0},0]
[{"$f":"Lists!$F$4","v":"Horizontal Ducted"},100,{"$f":"COUNTIFS(Output!$E$5:$E$36,Indoor!A33,Output!$D$6:$D$37,Indoor!B33)","v":0},0.216,0.19600000000000001,0.20600000000000002,{"$f":"(((D33*Database!$U$3)+(E33*Database!$V$3)+(F33*Database!$W$3))*C33)","v":0},100,{"$f":"COUNTIFS(Output!$G$5:$G$36,Indoor!A33,Output!$F$6:$F$37,Indoor!H33)","v":0},0.216,0.19600000000000001,0.20600000000000002,{"$f":"(((J33*Database!$U$3)+(K33*Database!$V$3)+(L33*Database!$W$3))*I33)","v":0},100,{"$f":"COUNTIFS(Output!$I$5:$I$36,Indoor!A33,Output!$H$6:$H$37,Indoor!N33)","v":0},0.216,0.19600000000000001,0.20600000000000002,{"$f":"(((P33*Database!$U$3)+(Q33*Database!$V$3)+(R33*Database!$W$3))*O33)","v":0},100,{"$f":"COUNTIFS(Output!$K$5:$K$36,Indoor!A33,Output!$J$6:$J$37,Indoor!T33)","v":0},0.216,0.19600000000000001,0.20600000000000002,{"$f":"(((V33*Database!$U$3)+(W33*Database!$V$3)+(X33*Database!$W$3))*U33)","v":0},100,{"$f":"COUNTIFS(Output!$M$5:$M$36,Indoor!A33,Output!$L$6:$L$37,Indoor!Z33)","v":0},0.216,0.19600000000000001,0.20600000000000002,{"$f":"(((AB33*Database!$U$3)+(AC33*Database!$V$3)+(AD33*Database!$W$3))*AA33)","v":0},100,{"$f":"COUNTIFS(Output!$O$5:$O$36,Indoor!A33,Output!$N$6:$N$37,Indoor!AF33)","v":0},0.216,0.19600000000000001,0.20600000000000002,{"$f":"(((AH33*Database!$U$3)+(AI33*Database!$V$3)+(AJ33*Database!$W$3))*AG33)","v":0},100,{"$f":"COUNTIFS(Output!$Q$5:$Q$36,Indoor!A33,Output!$P$6:$P$37,Indoor!AL33)","v":0},0.216,0.19600000000000001,0.20600000000000002,{"$f":"(((AN33*Database!$U$3)+(AO33*Database!$V$3)+(AP33*Database!$W$3))*AM33)","v":0},100,{"$f":"COUNTIFS(Output!$S$5:$S$36,Indoor!A33,Output!$R$6:$R$37,Indoor!AR33)","v":0},0.216,0.19600000000000001,0.20600000000000002,{"$f":"(((AT33*Database!$U$3)+(AU33*Database!$V$3)+(AV33*Database!$W$3))*AS33)","v":0},100,{"$f":"COUNTIFS(Output!$U$5:$U$36,Indoor!A33,Output!$T$6:$T$37,Indoor!AX33)","v":0},0.216,0.19600000000000001,0.20600000000000002,{"$f":"(((AZ33*Database!$U$3)+(BA33*Database!$V$3)+(BB33*Database!$W$3))*AY33)","v":0},100,{"$f":"COUNTIFS(Output!$W$5:$W$36,Indoor!A33,Output!$V$6:$V$37,Indoor!BD33)","v":0},0.216,0.19600000000000001,0.20600000000000002,{"$f":"(((BF33*Database!$U$3)+(BG33*Database!$V$3)+(BH33*Database!$W$3))*BE33)","v":0},0]
[{"$f":"Lists!$F$4","v":"Horizontal Ducted"},125,{"$f":"COUNTIFS(Output!$E$5:$E$36,Indoor!A34,Output!$D$6:$D$37,Indoor!B34)","v":0},0.28999999999999998,0.27,0.28000000000000003,{"$f":"(((D34*Database!$U$3)+(E34*Database!$V$3)+(F34*Database!$W$3))*C34)","v":0},125,{"$f":"COUNTIFS(Output!$G$5:$G$36,Indoor!A34,Output!$F$6:$F$37,Indoor!H34)","v":0},0.28999999999999998,0.27,0.28000000000000003,{"$f":"(((J34*Database!$U$3)+(K34*Database!$V$3)+(L34*Database!$W$3))*I34)","v":0},125,{"$f":"COUNTIFS(Output!$I$5:$I$36,Indoor!A34,Output!$H$6:$H$37,Indoor!N34)","v":0},0.28999999999999998,0.27,0.28000000000000003,{"$f":"(((P34*Database!$U$3)+(Q34*Database!$V$3)+(R34*Database!$W$3))*O34)","v":0},125,{"$f":"COUNTIFS(Output!$K$5:$K$36,Indoor!A34,Output!$J$6:$J$37,Indoor!T34)","v":0},0.28999999999999998,0.27,0.28000000000000003,{"$f":"(((V34*Database!$U$3)+(W34*Database!$V$3)+(X34*Database!$W$3))*U34)","v":0},125,{"$f":"COUNTIFS(Output!$M$5:$M$36,Indoor!A34,Output!$L$6:$L$37,Indoor!Z34)","v":0},0.28999999999999998,0.27,0.28000000000000003,{"$f":"(((AB34*Database!$U$3)+(AC34*Database!$V$3)+(AD34*Database!$W$3))*AA34)","v":0},125,{"$f":"COUNTIFS(Output!$O$5:$O$36,Indoor!A34,Output!$N$6:$N$37,Indoor!AF34)","v":0},0.28999999999999998,0.27,0.28000000000000003,{"$f":"(((AH34*Database!$U$3)+(AI34*Database!$V$3)+(AJ34*Database!$W$3))*AG34)","v":0},125,{"$f":"COUNTIFS(Output!$Q$5:$Q$36,Indoor!A34,Output!$P$6:$P$37,Indoor!AL34)","v":0},0.28999999999999998,0.27,0.28000000000000003,{"$f":"(((AN34*Database!$U$3)+(AO34*Database!$V$3)+(AP34*Database!$W$3))*AM34)","v":0},125,{"$f":"COUNTIFS(Output!$S$5:$S$36,Indoor!A34,Output!$R$6:$R$37,Indoor!AR34)","v":0},0.28999999999999998,0.27,0.28000000000000003,{"$f":"(((AT34*Database!$U$3)+(AU34*Database!$V$3)+(AV34*Database!$W$3))*AS34)","v":0},125,{"$f":"COUNTIFS(Output!$U$5:$U$36,Indoor!A34,Output!$T$6:$T$37,Indoor!AX34)","v":0},0.28999999999999998,0.27,0.28000000000000003,{"$f":"(((AZ34*Database!$U$3)+(BA34*Database!$V$3)+(BB34*Database!$W$3))*AY34)","v":0},125,{"$f":"COUNTIFS(Output!$W$5:$W$36,Indoor!A34,Output!$V$6:$V$37,Indoor!BD34)","v":0},0.28999999999999998,0.27,0.28000000000000003,{"$f":"(((BF34*Database!$U$3)+(BG34*Database!$V$3)+(BH34*Database!$W$3))*BE34)","v":0},0]
[{"$f":"Lists!$F$4","v":"Horizontal Ducted"},200,{"$f":"COUNTIFS(Output!$E$5:$E$36,Indoor!A35,Output!$D$6:$D$37,Indoor!B35)","v":0},null,null,0,{"$f":"(((D35*Database!$U$3)+(E35*Database!$V$3)+(F35*Database!$W$3))*C35)","v":0},200,{"$f":"COUNTIFS(Output!$G$5:$G$36,Indoor!A35,Output!$F$6:$F$37,Indoor!H35)","v":0},0,0,0,{"$f":"(((J35*Database!$U$3)+(K35*Database!$V$3)+(L35*Database!$W$3))*I35)","v":0},200,{"$f":"COUNTIFS(Output!$I$5:$I$36,Indoor!A35,Output!$H$6:$H$37,Indoor!N35)","v":0},0,0,0,{"$f":"(((P35*Database!$U$3)+(Q35*Database!$V$3)+(R35*Database!$W$3))*O35)","v":0},200,{"$f":"COUNTIFS(Output!$K$5:$K$36,Indoor!A35,Output!$J$6:$J$37,Indoor!T35)","v":0},0,0,0,{"$f":"(((V35*Database!$U$3)+(W35*Database!$V$3)+(X35*Database!$W$3))*U35)","v":0},200,{"$f":"COUNTIFS(Output!$M$5:$M$36,Indoor!A35,Output!$L$6:$L$37,Indoor!Z35)","v":0},0,0,0,{"$f":"(((AB35*Database!$U$3)+(AC35*Database!$V$3)+(AD35*Database!$W$3))*AA35)","v":0},200,{"$f":"COUNTIFS(Output!$O$5:$O$36,Indoor!A35,Output!$N$6:$N$37,Indoor!AF35)","v":0},0,0,0,{"$f":"(((AH35*Database!$U$3)+(AI35*Database!$V$3)+(AJ35*Database!$W$3))*AG35)","v":0},200,{"$f":"COUNTIFS(Output!$Q$5:$Q$36,Indoor!A35,Output!$P$6:$P$37,Indoor!AL35)","v":0},0,0,0,{"$f":"(((AN35*Database!$U$3)+(AO35*Database!$V$3)+(AP35*Database!$W$3))*AM35)","v":0},200,{"$f":"COUNTIFS(Output!$S$5:$S$36,Indoor!A35,Output!$R$6:$R$37,Indoor!AR35)","v":0},0,0,0,{"$f":"(((AT35*Database!$U$3)+(AU35*Database!$V$3)+(AV35*Database!$W$3))*AS35)","v":0},200,{"$f":"COUNTIFS(Output!$U$5:$U$36,Indoor!A35,Output!$T$6:$T$37,Indoor!AX35)","v":0},0,0,0,{"$f":"(((AZ35*Database!$U$3)+(BA35*Database!$V$3)+(BB35*Database!$W$3))*AY35)","v":0},200,{"$f":"COUNTIFS(Output!$W$5:$W$36,Indoor!A35,Output!$V$6:$V$37,Indoor!BD35)","v":0},0,0,0,{"$f":"(((BF35*Database!$U$3)+(BG35*Database!$V$3)+(BH35*Database!$W$3))*BE35)","v":0},0]
[{"$f":"Lists!$F$4","v":"Horizontal Ducted"},250,{"$f":"COUNTIFS(Output!$E$5:$E$36,Indoor!A36,Output!$D$6:$D$37,Indoor!B36)","v":0},null,null,0,{"$f":"(((D36*Database!$U$3)+(E36*Database!$V$3)+(F36*Database!$W$3))*C36)","v":0},250,{"$f":"COUNTIFS(Output!$G$5:$G$36,Indoor!A36,Output!$F$6:$F$37,Indoor!H36)","v":0},0,0,0,{"$f":"(((J36*Database!$U$3)+(K36*Database!$V$3)+(L36*Database!$W$3))*I36)","v":0},250,{"$f":"COUNTIFS(Output!$I$5:$I$36,Indoor!A36,Output!$H$6:$H$37,Indoor!N36)","v":0},0,0,0,{"$f":"(((P36*Database!$U$3)+(Q36*Database!$V$3)+(R36*Database!$W$3))*O36)","v":0},250,{"$f":"COUNTIFS(Output!$K$5:$K$36,Indoor!A36,Output!$J$6:$J$37,Indoor!T36)","v":0},0,0,0,{"$f":"(((V36*Database!$U$3)+(W36*Database!$V$3)+(X36*Database!$W$3))*U36)","v":0},250,{"$f":"COUNTIFS(Output!$M$5:$M$36,Indoor!A36,Output!$L$6:$L$37,Indoor!Z36)","v":0},0,0,0,{"$f":"(((AB36*Database!$U$3)+(AC36*Database!$V$3)+(AD36*Database!$W$3))*AA36)","v":0},250,{"$f":"COUNTIFS(Output!$O$5:$O$36,Indoor!A36,Output!$N$6:$N$37,Indoor!AF36)","v":0},0,0,0,{"$f":"(((AH36*Database!$U$3)+(AI36*Database!$V$3)+(AJ36*Database!$W$3))*AG36)","v":0},250,{"$f":"COUNTIFS(Output!$Q$5:$Q$36,Indoor!A36,Output!$P$6:$P$37,Indoor!AL36)","v":0},0,0,0,{"$f":"(((AN36*Database!$U$3)+(AO36*Database!$V$3)+(AP36*Database!$W$3))*AM36)","v":0},250,{"$f":"COUNTIFS(Output!$S$5:$S$36,Indoor!A36,Output!$R$6:$R$37,Indoor!AR36)","v":0},0,0,0,{"$f":"(((AT36*Database!$U$3)+(AU36*Database!$V$3)+(AV36*Database!$W$3))*AS36)","v":0},250,{"$f":"COUNTIFS(Output!$U$5:$U$36,Indoor!A36,Output!$T$6:$T$37,Indoor!AX36)","v":0},0,0,0,{"$f":"(((AZ36*Database!$U$3)+(BA36*Database!$V$3)+(BB36*Database!$W$3))*AY36)","v":0},250,{"$f":"COUNTIFS(Output!$W$5:$W$36,Indoor!A36,Output!$V$6:$V$37,Indoor!BD36)","v":0},0,0,0,{"$f":"(((BF36*Database!$U$3)+(BG36*Database!$V$3)+(BH36*Database!$W$3))*BE36)","v":0},0]
[null,null,{"$f":"SUM(C26:C36)","v":1},null,null,null,null,null,{"$f":"SUM(I26:I36)","v":0},null,null,null,null,null,{"$f":"SUM(O26:O36)","v":0},null,null,null,null,null,{"$f":"SUM(U26:U36)","v":0},null,null,null,null,null,{"$f":"SUM(AA26:AA36)","v":0},null,null,null,null,null,{"$f":"SUM(AG26:AG36)","v":0},null,null,null,null,null,{"$f":"SUM(AM26:AM36)","v":0},null,null,null,null,null,{"$f":"SUM(AS26:AS36)","v":0},null,null,null,null,null,{"$f":"SUM(AY26:AY36)","v":0},null,null,null,null,null,{"$f":"SUM(BE26:BE36)","v":0}]
[{"$f":"Lists!$F$5","v":"Ceiling Suspended"},20,{"$f":"COUNTIFS(Output!$E$5:$E$36,Indoor!A38,Output!$D$6:$D$37,Indoor!B38)","v":0},null,null,0,{"$f":"(((D38*Database!$U$3)+(E38*Database!$V$3)+(F38*Database!$W$3))*C38)","v":0},20,{"$f":"COUNTIFS(Output!$G$5:$G$36,Indoor!A38,Output!$F$6:$F$37,Indoor!H38)","v":0},0,0,0,{"$f":"(((J38*Database!$U$3)+(K38*Database!$V$3)+(L38*Database!$W$3))*I38)","v":0},20,{"$f":"COUNTIFS(Output!$I$5:$I$36,Indoor!A38,Output!$H$6:$H$37,Indoor!N38)","v":0},0,0,0,{"$f":"(((P38*Database!$U$3)+(Q38*Database!$V$3)+(R38*Database!$W$3))*O38)","v":0},20,{"$f":"COUNTIFS(Output!$K$5:$K$36,Indoor!A38,Output!$J$6:$J$37,Indoor!T38)","v":0},0,0,0,{"$f":"(((V38*Database!$U$3)+(W38*Database!$V$3)+(X38*Database!$W$3))*U38)","v":0},20,{"$f":"COUNTIFS(Output!$M$5:$M$36,Indoor!A38,Output!$L$6:$L$37,Indoor!Z38)","v":0},0,0,0,{"$f":"(((AB38*Database!$U$3)+(AC38*Database!$V$3)+(AD38*Database!$W$3))*AA38)","v":0},20,{"$f":"COUNTIFS(Output!$O$5:$O$36,Indoor!A38,Output!$N$6:$N$37,Indoor!AF38)","v":0},0,0,0,{"$f":"(((AH38*Database!$U$3)+(AI38*Database!$V$3)+(AJ38*Database!$W$3))*AG38)","v":0},20,{"$f":"COUNTIFS(Output!$Q$5:$Q$36,Indoor!A38,Output!$P$6:$P$37,Indoor!AL38)","v":0},0,0,0,{"$f":"(((AN38*Database!$U$3)+(AO38*Database!$V$3)+(AP38*Database!$W$3))*AM38)","v":0},20,{"$f":"COUNTIFS(Output!$S$5:$S$36,Indoor!A38,Output!$R$6:$R$37,Indoor!AR38)","v":0},0,0,0,{"$f":"(((AT38*Database!$U$3)+(AU38*Database!$V$3)+(AV38*Database!$W$3))*AS38)","v":0},20,{"$f":"COUNTIFS(Output!$U$5:$U$36,Indoor!A38,Output!$T$6:$T$37,Indoor!AX38)","v":0},0,0,0,{"$f":"(((AZ38*Database!$U$3)+(BA38*Database!$V$3)+(BB38*Database!$W$3))*AY38)","v":0},20,{"$f":"COUNTIFS(Output!$W$5:$W$36,Indoor!A38,Output!$V$6:$V$37,Indoor!BD38)","v":0},0,0,0,{"$f":"(((BF38*Database!$U$3)+(BG38*Database!$V$3)+(BH38*Database!$W$3))*BE38)","v":0},{"$f":"SUM(BE38+AY38+AS38+AM38+AG38+AA38+U38+O38+I38+C38)","v":0}]
[{"$f":"Lists!$F$5","v":"Ceiling Suspended"},25,{"$f":"COUNTIFS(Output!$E$5:$E$36,Indoor!A39,Output!$D$6:$D$37,Indoor!B39)","v":0},null,null,0,{"$f":"(((D39*Database!$U$3)+(E39*Database!$V$3)+(F39*Database!$W$3))*C39)","v":0},25,{"$f":"COUNTIFS(Output!$G$5:$G$36,Indoor!A39,Output!$F$6:$F$37,Indoor!H39)","v":0},0,0,0,{"$f":"(((J39*Database!$U$3)+(K39*Database!$V$3)+(L39*Database!$W$3))*I39)","v":0},25,{"$f":"COUNTIFS(Output!$I$5:$I$36,Indoor!A39,Output!$H$6:$H$37,Indoor!N39)","v":0},0,0,0,{"$f":"(((P39*Database!$U$3)+(Q39*Database!$V$3)+(R39*Database!$W$3))*O39)","v":0},25,{"$f":"COUNTIFS(Output!$K$5:$K$36,Indoor!A39,Output!$J$6:$J$37,Indoor!T39)","v":0},0,0,0,{"$f":"(((V39*Database!$U$3)+(W39*Database!$V$3)+(X39*Database!$W$3))*U39)","v":0},25,{"$f":"COUNTIFS(Output!$M$5:$M$36,Indoor!A39,Output!$L$6:$L$37,Indoor!Z39)","v":0},0,0,0,{"$f":"(((AB39*Database!$U$3)+(AC39*Database!$V$3)+(AD39*Database!$W$3))*AA39)","v":0},25,{"$f":"COUNTIFS(Output!$O$5:$O$36,Indoor!A39,Output!$N$6:$N$37,Indoor!AF39)","v":0},0,0,0,{"$f":"(((AH39*Database!$U$3)+(AI39*Database!$V$3)+(AJ39*Database!$W$3))*AG39)","v":0},25,{"$f":"COUNTIFS(Output!$Q$5:$Q$36,Indoor!A39,Output!$P$6:$P$37,Indoor!AL39)","v":0},0,0,0,{"$f":"(((AN39*Database!$U$3)+(AO39*Database!$V$3)+(AP39*Database!$W$3))*AM39)","v":0},25,{"$f":"COUNTIFS(Output!$S$5:$S$36,Indoor!A39,Output!$R$6:$R$37,Indoor!AR39)","v":0},0,0,0,{"$f":"(((AT39*Database!$U$3)+(AU39*Database!$V$3)+(AV39*Database!$W$3))*AS39)","v":0},25,{"$f":"COUNTIFS(Output!$U$5:$U$36,Indoor!A39,Output!$T$6:$T$37,Indoor!AX39)","v":0},0,0,0,{"$f":"(((AZ39*Database!$U$3)+(BA39*Database!$V$3)+(BB39*Database!$W$3))*AY39)","v":0},25,{"$f":"COUNTIFS(Output!$W$5:$W$36,Indoor!A39,Output!$V$6:$V$37,Indoor!BD39)","v":0},0,0,0,{"$f":"(((BF39*Database!$U$3)+(BG39*Database!$V$3)+(BH39*Database!$W$3))*BE39)","v":0},0]
[{"$f":"Lists!$F$5","v":"Ceiling Suspended"},31.25,{"$f":"COUNTIFS(Output!$E$5:$E$36,Indoor!A40,Output!$D$6:$D$37,Indoor!B40)","v":0},0.10100000000000001,0.10100000000000001,0.10100000000000001,{"$f":"(((D40*Database!$U$3)+(E40*Database!$V$3)+(F40*Database!$W$3))*C40)","v":0},31.25,{"$f":"COUNTIFS(Output!$G$5:$G$36,Indoor!A40,Output!$F$6:$F$37,Indoor!H40)","v":0},0.10100000000000001,0.10100000000000001,0.10100000000000001,{"$f":"(((J40*Database!$U$3)+(K40*Database!$V$3)+(L40*Database!$W$3))*I40)","v":0},31.25,{"$f":"COUNTIFS(Output!$I$5:$I$36,Indoor!A40,Output!$H$6:$H$37,Indoor!N40)","v":0},0.10100000000000001,0.10100000000000001,0.10100000000000001,{"$f":"(((P40*Database!$U$3)+(Q40*Database!$V$3)+(R40*Database!$W$3))*O40)","v":0},31.25,{"$f":"COUNTIFS(Output!$K$5:$K$36,Indoor!A40,Output!$J$6:$J$37,Indoor!T40)","v":0},0.10100000000000001,0.10100000000000001,0.10100000000000001,{"$f":"(((V40*Database!$U$3)+(W40*Database!$V$3)+(X40*Database!$W$3))*U40)","v":0},31.25,{"$f":"COUNTIFS(Output!$M$5:$M$36,Indoor!A40,Output!$L$6:$L$37,Indoor!Z40)","v":0},0.10100000000000001,0.10100000000000001,0.10100000000000001,{"$f":"(((AB40*Database!$U$3)+(AC40*Database!$V$3)+(AD40*Database!$W$3))*AA40)","v":0},31.25,{"$f":"COUNTIFS(Output!$O$5:$O$36,Indoor!A40,Output!$N$6:$N$37,Indoor!AF40)","v":0},0.10100000000000001,0.10100000000000001,0.10100000000000001,{"$f":"(((AH40*Database!$U$3)+(AI40*Database!$V$3)+(AJ40*Database!$W$3))*AG40)","v":0},31.25,{"$f":"COUNTIFS(Output!$Q$5:$Q$36,Indoor!A40,Output!$P$6:$P$37,Indoor!AL40)","v":0},0.10100000000000001,0.10100000000000001,0.10100000000000001,{"$f":"(((AN40*Database!$U$3)+(AO40*Database!$V$3)+(AP40*Database!$W$3))*AM40)","v":0},31.25,{"$f":"COUNTIFS(Output!$S$5:$S$36,Indoor!A40,Output!$R$6:$R$37,Indoor!AR40)","v":0},0.10100000000000001,0.10100000000000001,0.10100000000000001,{"$f":"(((AT40*Database!$U$3)+(AU40*Database!$V$3)+(AV40*Database!$W$3))*AS40)","v":0},31.25,{"$f":"COUNTIFS(Output!$U$5:$U$36,Indoor!A40,Output!$T$6:$T$37,Indoor!AX40)","v":0},0.10100000000000001,0.10100000000000001,0.10100000000000001,{"$f":"(((AZ40*Database!$U$3)+(BA40*Database!$V$3)+(BB40*Database!$W$3))*AY40)","v":0},31.25,{"$f":"COUNTIFS(Output!$W$5:$W$36,Indoor!A40,Output!$V$6:$V$37,Indoor!BD40)","v":0},0.10100000000000001,0.10100000000000001,0.10100000000000001,{"$f":"(((BF40*Database!$U$3)+(BG40*Database!$V$3)+(BH40*Database!$W$3))*BE40)","v":0},0]
[{"$f":"Lists!$F$5","v":"Ceiling Suspended"},40,{"$f":"COUNTIFS(Output!$E$5:$E$36,Indoor!A41,Output!$D$6:$D$37,Indoor!B41)","v":0},null,null,0,{"$f":"(((D41*Database!$U$3)+(E41*Database!$V$3)+(F41*Database!$W$3))*C41)","v":0},40,{"$f":"COUNTIFS(Output!$G$5:$G$36,Indoor!A41,Output!$F$6:$F$37,Indoor!H41)","v":0},0,0,0,{"$f":"(((J41*Database!$U$3)+(K41*Database!$V$3)+(L41*Database!$W$3))*I41)","v":0},40,{"$f":"COUNTIFS(Output!$I$5:$I$36,Indoor!A41,Output!$H$6:$H$37,Indoor!N41)","v":0},0,0,0,{"$f":"(((P41*Database!$U$3)+(Q41*Database!$V$3)+(R41*Database!$W$3))*O41)","v":0},40,{"$f":"COUNTIFS(Output!$K$5:$K$36,Indoor!A41,Output!$J$6:$J$37,Indoor!T41)","v":0},0,0,0,{"$f":"(((V41*Database!$U$3)+(W41*Database!$V$3)+(X41*Database!$W$3))*U41)","v":0},40,{"$f":"COUNTIFS(Output!$M$5:$M$36,Indoor!A41,Output!$L$6:$L$37,Indoor!Z41)","v":0},0,0,0,{"$f":"(((AB41*Database!$U$3)+(AC41*Database!$V$3)+(AD41*Database!$W$3))*AA41)","v":0},40,{"$f":"COUNTIFS(Output!$O$5:$O$36,Indoor!A41,Output!$N$6:$N$37,Indoor!AF41)","v":0},0,0,0,{"$f":"(((AH41*Database!$U$3)+(AI41*Database!$V$3)+(AJ41*Database!$W$3))*AG41)","v":0},40,{"$f":"COUNTIFS(Output!$Q$5:$Q$36,Indoor!A41,Output!$P$6:$P$37,Indoor!AL41)","v":0},0,0,0,{"$f":"(((AN41*Database!$U$3)+(AO41*Database!$V$3)+(AP41*Database!$W$3))*AM41)","v":0},40,{"$f":"COUNTIFS(Output!$S$5:$S$36,Indoor!A41,Output!$R$6:$R$37,Indoor!AR41)","v":0},0,0,0,{"$f":"(((AT41*Database!$U$3)+(AU41*Database!$V$3)+(AV41*Database!$W$3))*AS41)","v":0},40,{"$f":"COUNTIFS(Output!$U$5:$U$36,Indoor!A41,Output!$T$6:$T$37,Indoor!AX41)","v":0},0,0,0,{"$f":"(((AZ41*Database!$U$3)+(BA41*Database!$V$3)+(BB41*Database!$W$3))*AY41)","v":0},40,{"$f":"COUNTIFS(Output!$W$5:$W$36,Indoor!A41,Output!$V$6:$V$37,Indoor!BD41)","v":0},0,0,0,{"$f":"(((BF41*Database!$U$3)+(BG41*Database!$V$3)+(BH41*Database!$W$3))*BE41)","v":0},0]
[{"$f":"Lists!$F$5","v":"Ceiling Suspended"},50,{"$f":"COUNTIFS(Output!$E$5:$E$36,Indoor!A42,Output!$D$6:$D$37,Indoor!B42)","v":0},null,null,0,{"$f":"(((D42*Database!$U$3)+(E42*Database!$V$3)+(F42*Database!$W$3))*C42)","v":0},50,{"$f":"COUNTIFS(Output!$G$5:$G$36,Indoor!A42,Output!$F$6:$F$37,Indoor!H42)","v":0},0,0,0,{"$f":"(((J42*Database!$U$3)+(K42*Database!$V$3)+(L42*Database!$W$3))*I42)","v":0},50,{"$f":"COUNTIFS(Output!$I$5:$I$36,Indoor!A42,Output!$H$6:$H$37,Indoor!N42)","v":0},0,0,0,{"$f":"(((P42*Database!$U$3)+(Q42*Database!$V$3)+(R42*Database!$W$3))*O42)","v":0},50,{"$f":"COUNTIFS(Output!$K$5:$K$36,Indoor!A42,Output!$J$6:$J$37,Indoor!T42)","v":0},0,0,0,{"$f":"(((V42*Database!$U$3)+(W42*Database!$V$3)+(X42*Database!$W$3))*U42)","v":0},50,{"$f":"COUNTIFS(Output!$M$5:$M$36,Indoor!A42,Output!$L$6:$L$37,Indoor!Z42)","v":0},0,0,0,{"$f":"(((AB42*Database!$U$3)+(AC42*Database!$V$3)+(AD42*Database!$W$3))*AA42)","v":0},50,{"$f":"COUNTIFS(Output!$O$5:$O$36,Indoor!A42,Output!$N$6:$N$37,Indoor!AF42)","v":0},0,0,0,{"$f":"(((AH42*Database!$U$3)+(AI42*Database!$V$3)+(AJ42*Database!$W$3))*AG42)","v":0},50,{"$f":"COUNTIFS(Output!$Q$5:$Q$36,Indoor!A42,Output!$P$6:$P$37,Indoor!AL42)","v":0},0,0,0,{"$f":"(((AN42*Database!$U$3)+(AO42*Database!$V$3)+(AP42*Database!$W$3))*AM42)","v":0},50,{"$f":"COUNTIFS(Output!$S$5:$S$36,Indoor!A42,Output!$R$6:$R$37,Indoor!AR42)","v":0},0,0,0,{"$f":"(((AT42*Database!$U$3)+(AU42*Database!$V$3)+(AV42*Database!$W$3))*AS42)","v":0},50,{"$f":"COUNTIFS(Output!$U$5:$U$36,Indoor!A42,Output!$T$6:$T$37,Indoor!AX42)","v":0},0,0,0,{"$f":"(((AZ42*Database!$U$3)+(BA42*Database!$V$3)+(BB42*Database!$W$3))*AY42)","v":0},50,{"$f":"COUNTIFS(Output!$W$5:$W$36,Indoor!A42,Output!$V$6:$V$37,Indoor!BD42)","v":0},0,0,0,{"$f":"(((BF42*Database!$U$3)+(BG42*Database!$V$3)+(BH42*Database!$W$3))*BE42)","v":0},0]
[{"$f":"Lists!$F$5","v":"Ceiling Suspended"},63,{"$f":"COUNTIFS(Output!$E$5:$E$36,Indoor!A43,Output!$D$6:$D$37,Indoor!B43)","v":1},0.114,0.114,0.114,{"$f":"(((D43*Database!$U$3)+(E43*Database!$V$3)+(F43*Database!$W$3))*C43)","v":102.54300000000001},63,{"$f":"COUNTIFS(Output!$G$5:$G$36,Indoor!A43,Output!$F$6:$F$37,Indoor!H43)","v":0},0.114,0.114,0.114,{"$f":"(((J43*Database!$U$3)+(K43*Database!$V$3)+(L43*Database!$W$3))*I43)","v":0},63,{"$f":"COUNTIFS(Output!$I$5:$I$36,Indoor!A43,Output!$H$6:$H$37,Indoor!N43)","v":0},0.114,0.114,0.114,{"$f":"(((P43*Database!$U$3)+(Q43*Database!$V$3)+(R43*Database!$W$3))*O43)","v":0},63,{"$f":"COUNTIFS(Output!$K$5:$K$36,Indoor!A43,Output!$J$6:$J$37,Indoor!T43)","v":0},0.114,0.114,0.114,{"$f":"(((V43*Database!$U$3)+(W43*Database!$V$3)+(X43*Database!$W$3))*U43)","v":0},63,{"$f":"COUNTIFS(Output!$M$5:$M$36,Indoor!A43,Output!$L$6:$L$37,Indoor!Z43)","v":0},0.114,0.114,0.114,{"$f":"(((AB43*Database!$U$3)+(AC43*Database!$V$3)+(AD43*Database!$W$3))*AA43)","v":0},63,{"$f":"COUNTIFS(Output!$O$5:$O$36,Indoor!A43,Output!$N$6:$N$37,Indoor!AF43)","v":0},0.114,0.114,0.114,{"$f":"(((AH43*Database!$U$3)+(AI43*Database!$V$3)+(AJ43*Database!$W$3))*AG43)","v":0},63,{"$f":"COUNTIFS(Output!$Q$5:$Q$36,Indoor!A43,Output!$P$6:$P$37,Indoor!AL43)","v":0},0.114,0.114,0.114,{"$f":"(((AN43*Database!$U$3)+(AO43*Database!$V$3)+(AP43*Database!$W$3))*AM43)","v":0},63,{"$f":"COUNTIFS(Output!$S$5:$S$36,Indoor!A43,Output!$R$6:$R$37,Indoor!AR43)","v":0},0.114,0.114,0.114,{"$f":"(((AT43*Database!$U$3)+(AU43*Database!$V$3)+(AV43*Database!$W$3))*AS43)","v":0},63,{"$f":"COUNTIFS(Output!$U$5:$U$36,Indoor!A43,Output!$T$6:$T$37,Indoor!AX43)","v":0},0.114,0.114,0.114,{"$f":"(((AZ43*Database!$U$3)+(BA43*Database!$V$3)+(BB43*Database!$W$3))*AY43)","v":0},63,{"$f":"COUNTIFS(Output!$W$5:$W$36,Indoor!A43,Output!$V$6:$V$37,Indoor!BD43)","v":0},0.114,0.114,0.114,{"$f":"(((BF43*Database!$U$3)+(BG43*Database!$V$3)+(BH43*Database!$W$3))*BE43)","v":0},1]
[{"$f":"Lists!$F$5","v":"Ceiling Suspended"},80,{"$f":"COUNTIFS(Output!$E$5:$E$36,Indoor!A44,Output!$D$6:$D$37,Indoor!B44)","v":0},null,null,0,{"$f":"(((D44*Database!$U$3)+(E44*Database!$V$3)+(F44*Database!$W$3))*C44)","v":0},80,{"$f":"COUNTIFS(Output!$G$5:$G$36,Indoor!A44,Output!$F$6:$F$37,Indoor!H44)","v":0},0,0,0,{"$f":"(((J44*Database!$U$3)+(K44*Database!$V$3)+(L44*Database!$W$3))*I44)","v":0},80,{"$f":"COUNTIFS(Output!$I$5:$I$36,Indoor!A44,Output!$H$6:$H$37,Indoor!N44)","v":0},0,0,0,{"$f":"(((P44*Database!$U$3)+(Q44*Database!$V$3)+(R44*Database!$W$3))*O44)","v":0},80,{"$f":"COUNTIFS(Output!$K$5:$K$36,Indoor!A44,Output!$J$6:$J$37,Indoor!T44)","v":0},0,0,0,{"$f":"(((V44*Database!$U$3)+(W44*Database!$V$3)+(X44*Database!$W$3))*U44)","v":0},80,{"$f":"COUNTIFS(Output!$M$5:$M$36,Indoor!A44,Output!$L$6:$L$37,Indoor!Z44)","v":0},0,0,0,{"$f":"(((AB44*Database!$U$3)+(AC44*Database!$V$3)+(AD44*Database!$W$3))*AA44)","v":0},80,{"$f":"COUNTIFS(Output!$O$5:$O$36,Indoor!A44,Output!$N$6:$N$37,Indoor!AF44)","v":0},0,0,0,{"$f":"(((AH44*Database!$U$3)+(AI44*Database!$V$3)+(AJ44*Database!$W$3))*AG44)","v":0},80,{"$f":"COUNTIFS(Output!$Q$5:$Q$36,Indoor!A44,Output!$P$6:$P$37,Indoor!AL44)","v":0},0,0,0,{"$f":"(((AN44*Database!$U$3)+(AO44*Database!$V$3)+(AP44*Database!$W$3))*AM44)","v":0},80,{"$f":"COUNTIFS(Output!$S$5:$S$36,Indoor!A44,Output!$R$6:$R$37,Indoor!AR44)","v":0},0,0,0,{"$f":"(((AT44*Database!$U$3)+(AU44*Database!$V$3)+(AV44*Database!$W$3))*AS44)","v":0},80,{"$f":"COUNTIFS(Output!$U$5:$U$36,Indoor!A44,Output!$T$6:$T$37,Indoor!AX44)","v":0},0,0,0,{"$f":"(((AZ44*Database!$U$3)+(BA44*Database!$V$3)+(BB44*Database!$W$3))*AY44)","v":0},80,{"$f":"COUNTIFS(Output!$W$5:$W$36,Indoor!A44,Output!$V$6:$V$37,Indoor!BD44)","v":0},0,0,0,{"$f":"(((BF44*Database!$U$3)+(BG44*Database!$V$3)+(BH44*Database!$W$3))*BE44)","v":0},0]
[{"$f":"Lists!$F$5","v":"Ceiling Suspended"},100,{"$f":"COUNTIFS(Output!$E$5:$E$36,Indoor!A45,Output!$D$6:$D$37,Indoor!B45)","v":1},0.19,0.19,0.19,{"$f":"(((D45*Database!$U$3)+(E45*Database!$V$3)+(F45*Database!$W$3))*C45)","v":170.905},100,{"$f":"COUNTIFS(Output!$G$5:$G$36,Indoor!A45,Output!$F$6:$F$37,Indoor!H45)","v":0},0.19,0.19,0.19,{"$f":"(((J45*Database!$U$3)+(K45*Database!$V$3)+(L45*Database!$W$3))*I45)","v":0},100,{"$f":"COUNTIFS(Output!$I$5:$I$36,Indoor!A45,Output!$H$6:$H$37,Indoor!N45)","v":0},0.19,0.19,0.19,{"$f":"(((P45*Database!$U$3)+(Q45*Database!$V$3)+(R45*Database!$W$3))*O45)","v":0},100,{"$f":"COUNTIFS(Output!$K$5:$K$36,Indoor!A45,Output!$J$6:$J$37,Indoor!T45)","v":0},0.19,0.19,0.19,{"$f":"(((V45*Database!$U$3)+(W45*Database!$V$3)+(X45*Database!$W$3))*U45)","v":0},100,{"$f":"COUNTIFS(Output!$M$5:$M$36,Indoor!A45,Output!$L$6:$L$37,Indoor!Z45)","v":0},0.19,0.19,0.19,{"$f":"(((AB45*Database!$U$3)+(AC45*Database!$V$3)+(AD45*Database!$W$3))*AA45)","v":0},100,{"$f":"COUNTIFS(Output!$O$5:$O$36,Indoor!A45,Output!$N$6:$N$37,Indoor!AF45)","v":0},0.19,0.19,0.19,{"$f":"(((AH45*Database!$U$3)+(AI45*Database!$V$3)+(AJ45*Database!$W$3))*AG45)","v":0},100,{"$f":"COUNTIFS(Output!$Q$5:$Q$36,Indoor!A45,Output!$P$6:$P$37,Indoor!AL45)","v":0},0.19,0.19,0.19,{"$f":"(((AN45*Database!$U$3)+(AO45*Database!$V$3)+(AP45*Database!$W$3))*AM45)","v":0},100,{"$f":"COUNTIFS(Output!$S$5:$S$36,Indoor!A45,Output!$R$6:$R$37,Indoor!AR45)","v":0},0.19,0.19,0.19,{"$f":"(((AT45*Database!$U$3)+(AU45*Database!$V$3)+(AV45*Database!$W$3))*AS45)","v":0},100,{"$f":"COUNTIFS(Output!$U$5:$U$36,Indoor!A45,Output!$T$6:$T$37,Indoor!AX45)","v":0},0.19,0.19,0.19,{"$f":"(((AZ45*Database!$U$3)+(BA45*Database!$V$3)+(BB45*Database!$W$3))*AY45)","v":0},100,{"$f":"COUNTIFS(Output!$W$5:$W$36,Indoor!A45,Output!$V$6:$V$37,Indoor!BD45)","v":0},0.19,0.19,0.19,{"$f":"(((BF45*Database!$U$3)+(BG45*Database!$V$3)+(BH45*Database!$W$3))*BE45)","v":0},1]
[{"$f":"Lists!$F$5","v":"Ceiling Suspended"},125,{"$f":"COUNTIFS(Output!$E$5:$E$36,Indoor!A46,Output!$D$6:$D$37,Indoor!B46)","v":0},null,null,0,{"$f":"(((D46*Database!$U$3)+(E46*Database!$V$3)+(F46*Database!$W$3))*C46)","v":0},125,{"$f":"COUNTIFS(Output!$G$5:$G$36,Indoor!A46,Output!$F$6:$F$37,Indoor!H46)","v":0},0,0,0,{"$f":"(((J46*Database!$U$3)+(K46*Database!$V$3)+(L46*Database!$W$3))*I46)","v":0},125,{"$f":"COUNTIFS(Output!$I$5:$I$36,Indoor!A46,Output!$H$6:$H$37,Indoor!N46)","v":0},0,0,0,{"$f":"(((P46*Database!$U$3)+(Q46*Database!$V$3)+(R46*Database!$W$3))*O46)","v":0},125,{"$f":"COUNTIFS(Output!$K$5:$K$36,Indoor!A46,Output!$J$6:$J$37,Indoor!T46)","v":0},0,0,0,{"$f":"(((V46*Database!$U$3)+(W46*Database!$V$3)+(X46*Database!$W$3))*U46)","v":0},125,{"$f":"COUNTIFS(Output!$M$5:$M$36,Indoor!A46,Output!$L$6:$L$37,Indoor!Z46)","v":0},0,0,0,{"$f":"(((AB46*Database!$U$3)+(AC46*Database!$V$3)+(AD46*Database!$W$3))*AA46)","v":0},125,{"$f":"COUNTIFS(Output!$O$5:$O$36,Indoor!A46,Output!$N$6:$N$37,Indoor!AF46)","v":0},0,0,0,{"$f":"(((AH46*Database!$U$3)+(AI46*Database!$V$3)+(AJ46*Database!$W$3))*AG46)","v":0},125,{"$f":"COUNTIFS(Output!$Q$5:$Q$36,Indoor!A46,Output!$P$6:$P$37,Indoor!AL46)","v":0},0,0,0,{"$f":"(((AN46*Database!$U$3)+(AO46*Database!$V$3)+(AP46*Database!$W$3))*AM46)","v":0},125,{"$f":"COUNTIFS(Output!$S$5:$S$36,Indoor!A46,Output!$R$6:$R$37,Indoor!AR46)","v":0},0,0,0,{"$f":"(((AT46*Database!$U$3)+(AU46*Database!$V$3)+(AV46*Database!$W$3))*AS46)","v":0},125,{"$f":"COUNTIFS(Output!$U$5:$U$36,Indoor!A46,Output!$T$6:$T$37,Indoor!AX46)","v":0},0,0,0,{"$f":"(((AZ46*Database!$U$3)+(BA46*Database!$V$3)+(BB46*Database!$W$3))*AY46)","v":0},125,{"$f":"COUNTIFS(Output!$W$5:$W$36,Indoor!A46,Output!$V$6:$V$37,Indoor!BD46)","v":0},0,0,0,{"$f":"(((BF46*Database!$U$3)+(BG46*Database!$V$3)+(BH46*Database!$W$3))*BE46)","v":0},0]
[{"$f":"Lists!$F$5","v":"Ceiling Suspended"},200,{"$f":"COUNTIFS(Output!$E$5:$E$36,Indoor!A47,Output!$D$6:$D$37,Indoor!B47)","v":0},null,null,0,{"$f":"(((D47*Database!$U$3)+(E47*Database!$V$3)+(F47*Database!$W$3))*C47)","v":0},200,{"$f":"COUNTIFS(Output!$G$5:$G$36,Indoor!A47,Output!$F$6:$F$37,Indoor!H47)","v":0},0,0,0,{"$f":"(((J47*Database!$U$3)+(K47*Database!$V$3)+(L47*Database!$W$3))*I47)","v":0},200,{"$f":"COUNTIFS(Output!$I$5:$I$36,Indoor!A47,Output!$H$6:$H$37,Indoor!N47)","v":0},0,0,0,{"$f":"(((P47*Database!$U$3)+(Q47*Database!$V$3)+(R47*Database!$W$3))*O47)","v":0},200,{"$f":"COUNTIFS(Output!$K$5:$K$36,Indoor!A47,Output!$J$6:$J$37,Indoor!T47)","v":0},0,0,0,{"$f":"(((V47*Database!$U$3)+(W47*Database!$V$3)+(X47*Database!$W$3))*U47)","v":0},200,{"$f":"COUNTIFS(Output!$M$5:$M$36,Indoor!A47,Output!$L$6:$L$37,Indoor!Z47)","v":0},0,0,0,{"$f":"(((AB47*Database!$U$3)+(AC47*Database!$V$3)+(AD47*Database!$W$3))*AA47)","v":0},200,{"$f":"COUNTIFS(Output!$O$5:$O$36,Indoor!A47,Output!$N$6:$N$37,Indoor!AF47)","v":0},0,0,0,{"$f":"(((AH47*Database!$U$3)+(AI47*Database!$V$3)+(AJ47*Database!$W$3))*AG47)","v":0},200,{"$f":"COUNTIFS(Output!$Q$5:$Q$36,Indoor!A47,Output!$P$6:$P$37,Indoor!AL47)","v":0},0,0,0,{"$f":"(((AN47*Database!$U$3)+(AO47*Database!$V$3)+(AP47*Database!$W$3))*AM47)","v":0},200,{"$f":"COUNTIFS(Output!$S$5:$S$36,Indoor!A47,Output!$R$6:$R$37,Indoor!AR47)","v":0},0,0,0,{"$f":"(((AT47*Database!$U$3)+(AU47*Database!$V$3)+(AV47*Database!$W$3))*AS47)","v":0},200,{"$f":"COUNTIFS(Output!$U$5:$U$36,Indoor!A47,Output!$T$6:$T$37,Indoor!AX47)","v":0},0,0,0,{"$f":"(((AZ47*Database!$U$3)+(BA47*Database!$V$3)+(BB47*Database!$W$3))*AY47)","v":0},200,{"$f":"COUNTIFS(Output!$W$5:$W$36,Indoor!A47,Output!$V$6:$V$37,Indoor!BD47)","v":0},0,0,0,{"$f":"(((BF47*Database!$U$3)+(BG47*Database!$V$3)+(BH47*Database!$W$3))*BE47)","v":0},0]
[{"$f":"Lists!$F$5","v":"Ceiling Suspended"},250,{"$f":"COUNTIFS(Output!$E$5:$E$36,Indoor!A48,Output!$D$6:$D$37,Indoor!B48)","v":0},null,null,0,{"$f":"(((D48*Database!$U$3)+(E48*Database!$V$3)+(F48*Database!$W$3))*C48)","v":0},250,{"$f":"COUNTIFS(Output!$G$5:$G$36,Indoor!A48,Output!$F$6:$F$37,Indoor!H48)","v":0},0,0,0,{"$f":"(((J48*Database!$U$3)+(K48*Database!$V$3)+(L48*Database!$W$3))*I48)","v":0},250,{"$f":"COUNTIFS(Output!$I$5:$I$36,Indoor!A48,Output!$H$6:$H$37,Indoor!N48)","v":0},0,0,0,{"$f":"(((P48*Database!$U$3)+(Q48*Database!$V$3)+(R48*Database!$W$3))*O48)","v":0},250,{"$f":"COUNTIFS(Output!$K$5:$K$36,Indoor!A48,Output!$J$6:$J$37,Indoor!T48)","v":0},0,0,0,{"$f":"(((V48*Database!$U$3)+(W48*Database!$V$3)+(X48*Database!$W$3))*U48)","v":0},250,{"$f":"COUNTIFS(Output!$M$5:$M$36,Indoor!A48,Output!$L$6:$L$37,Indoor!Z48)","v":0},0,0,0,{"$f":"(((AB48*Database!$U$3)+(AC48*Database!$V$3)+(AD48*Database!$W$3))*AA48)","v":0},250,{"$f":"COUNTIFS(Output!$O$5:$O$36,Indoor!A48,Output!$N$6:$N$37,Indoor!AF48)","v":0},0,0,0,{"$f":"(((AH48*Database!$U$3)+(AI48*Database!$V$3)+(AJ48*Database!$W$3))*AG48)","v":0},250,{"$f":"COUNTIFS(Output!$Q$5:$Q$36,Indoor!A48,Output!$P$6:$P$37,Indoor!AL48)","v":0},0,0,0,{"$f":"(((AN48*Database!$U$3)+(AO48*Database!$V$3)+(AP48*Database!$W$3))*AM48)","v":0},250,{"$f":"COUNTIFS(Output!$S$5:$S$36,Indoor!A48,Output!$R$6:$R$37,Indoor!AR48)","v":0},0,0,0,{"$f":"(((AT48*Database!$U$3)+(AU48*Database!$V$3)+(AV48*Database!$W$3))*AS48)","v":0},250,{"$f":"COUNTIFS(Output!$U$5:$U$36,Indoor!A48,Output!$T$6:$T$37,Indoor!AX48)","v":0},0,0,0,{"$f":"(((AZ48*Database!$U$3)+(BA48*Database!$V$3)+(BB48*Database!$W$3))*AY48)","v":0},250,{"$f":"COUNTIFS(Output!$W$5:$W$36,Indoor!A48,Output!$V$6:$V$37,Indoor!BD48)","v":0},0,0,0,{"$f":"(((BF48*Database!$U$3)+(BG48*Database!$V$3)+(BH48*Database!$W$3))*BE48)","v":0},0]
[null,null,{"$f":"SUM(C38:C48)","v":2},null,null,null,null,null,{"$f":"SUM(I38:I48)","v":0},null,null,null,null,null,{"$f":"SUM(O38:O48)","v":0},null,null,null,null,null,{"$f":"SUM(U38:U48)","v":0},null,null,null,null,null,{"$f":"SUM(AA38:AA48)","v":0},null,null,null,null,null,{"$f":"SUM(AG38:AG48)","v":0},null,null,null,null,null,{"$f":"SUM(AM38:AM48)","v":0},null,null,null,null,null,{"$f":"SUM(AS38:AS48)","v":0},null,null,null,null,null,{"$f":"SUM(AY38:AY48)","v":0},null,null,null,null,null,{"$f":"SUM(BE38:BE48)","v":0}]
[{"$f":"Lists!$F$7","v":"Floor Standing"},20,{"$f":"COUNTIFS(Output!$E$5:$E$36,Indoor!A50,Output!$D$6:$D$37,Indoor!B50)","v":0},null,null,0,{"$f":"(((D50*Database!$U$3)+(E50*Database!$V$3)+(F50*Database!$W$3))*C50)","v":0},20,{"$f":"COUNTIFS(Output!$G$5:$G$36,Indoor!A50,Output!$F$6:$F$37,Indoor!H50)","v":0},0,0,0,{"$f":"(((J50*Database!$U$3)+(K50*Database!$V$3)+(L50*Database!$W$3))*I50)","v":0},20,{"$f":"COUNTIFS(Output!$I$5:$I$36,Indoor!A50,Output!$H$6:$H$37,Indoor!N50)","v":0},0,0,0,{"$f":"(((P50*Database!$U$3)+(Q50*Database!$V$3)+(R50*Database!$W$3))*O50)","v":0},20,{"$f":"COUNTIFS(Output!$K$5:$K$36,Indoor!A50,Output!$J$6:$J$37,Indoor!T50)","v":0},0,0,0,{"$f":"(((V50*Database!$U$3)+(W50*Database!$V$3)+(X50*Database!$W$3))*U50)","v":0},20,{"$f":"COUNTIFS(Output!$M$5:$M$36,Indoor!A50,Output!$L$6:$L$37,Indoor!Z50)","v":0},0,0,0,{"$f":"(((AB50*Database!$U$3)+(AC50*Database!$V$3)+(AD50*Database!$W$3))*AA50)","v":0},20,{"$f":"COUNTIFS(Output!$O$5:$O$36,Indoor!A50,Output!$N$6:$N$37,Indoor!AF50)","v":0},0,0,0,{"$f":"(((AH50*Database!$U$3)+(AI50*Database!$V$3)+(AJ50*Database!$W$3))*AG50)","v":0},20,{"$f":"COUNTIFS(Output!$Q$5:$Q$36,Indoor!A50,Output!$P$6:$P$37,Indoor!AL50)","v":0},0,0,0,{"$f":"(((AN50*Database!$U$3)+(AO50*Database!$V$3)+(AP50*Database!$W$3))*AM50)","v":0},20,{"$f":"COUNTIFS(Output!$S$5:$S$36,Indoor!A50,Output!$R$6:$R$37,Indoor!AR50)","v":0},0,0,0,{"$f":"(((AT50*Database!$U$3)+(AU50*Database!$V$3)+(AV50*Database!$W$3))*AS50)","v":0},20,{"$f":"COUNTIFS(Output!$U$5:$U$36,Indoor!A50,Output!$T$6:$T$37,Indoor!AX50)","v":0},0,0,0,{"$f":"(((AZ50*Database!$U$3)+(BA50*Database!$V$3)+(BB50*Database!$W$3))*AY50)","v":0},20,{"$f":"COUNTIFS(Output!$W$5:$W$36,Indoor!A50,Output!$V$6:$V$37,Indoor!BD50)","v":0},0,0,0,{"$f":"(((BF50*Database!$U$3)+(BG50*Database!$V$3)+(BH50*Database!$W$3))*BE50)","v":0},{"$f":"SUM(BE50+AY50+AS50+AM50+AG50+AA50+U50+O50+I50+C50)","v":0}]
[{"$f":"Lists!$F$7","v":"Floor Standing"},25,{"$f":"COUNTIFS(Output!$E$5:$E$36,Indoor!A51,Output!$D$6:$D$37,Indoor!B51)","v":0},4.3999999999999997E-2,4.3999999999999997E-2,4.3999999999999997E-2,{"$f":"(((D51*Database!$U$3)+(E51*Database!$V$3)+(F51*Database!$W$3))*C51)","v":0},25,{"$f":"COUNTIFS(Output!$G$5:$G$36,Indoor!A51,Output!$F$6:$F$37,Indoor!H51)","v":0},4.3999999999999997E-2,4.3999999999999997E-2,4.3999999999999997E-2,{"$f":"(((J51*Database!$U$3)+(K51*Database!$V$3)+(L51*Database!$W$3))*I51)","v":0},25,{"$f":"COUNTIFS(Output!$I$5:$I$36,Indoor!A51,Output!$H$6:$H$37,Indoor!N51)","v":0},4.3999999999999997E-2,4.3999999999999997E-2,4.3999999999999997E-2,{"$f":"(((P51*Database!$U$3)+(Q51*Database!$V$3)+(R51*Database!$W$3))*O51)","v":0},25,{"$f":"COUNTIFS(Output!$K$5:$K$36,Indoor!A51,Output!$J$6:$J$37,Indoor!T51)","v":0},4.3999999999999997E-2,4.3999999999999997E-2,4.3999999999999997E-2,{"$f":"(((V51*Database!$U$3)+(W51*Database!$V$3)+(X51*Database!$W$3))*U51)","v":0},25,{"$f":"COUNTIFS(Output!$M$5:$M$36,Indoor!A51,Output!$L$6:$L$37,Indoor!Z51)","v":0},4.3999999999999997E-2,4.3999999999999997E-2,4.3999999999999997E-2,{"$f":"(((AB51*Database!$U$3)+(AC51*Database!$V$3)+(AD51*Database!$W$3))*AA51)","v":0},25,{"$f":"COUNTIFS(Output!$O$5:$O$36,Indoor!A51,Output!$N$6:$N$37,Indoor!AF51)","v":0},4.3999999999999997E-2,4.3999999999999997E-2,4.3999999999999997E-2,{"$f":"(((AH51*Database!$U$3)+(AI51*Database!$V$3)+(AJ51*Database!$W$3))*AG51)","v":0},25,{"$f":"COUNTIFS(Output!$Q$5:$Q$36,Indoor!A51,Output!$P$6:$P$37,Indoor!AL51)","v":0},4.3999999999999997E-2,4.3999999999999997E-2,4.3999999999999997E-2,{"$f":"(((AN51*Database!$U$3)+(AO51*Database!$V$3)+(AP51*Database!$W$3))*AM51)","v":0},25,{"$f":"COUNTIFS(Output!$S$5:$S$36,Indoor!A51,Output!$R$6:$R$37,Indoor!AR51)","v":0},4.3999999999999997E-2,4.3999999999999997E-2,4.3999999999999997E-2,{"$f":"(((AT51*Database!$U$3)+(AU51*Database!$V$3)+(AV51*Database!$W$3))*AS51)","v":0},25,{"$f":"COUNTIFS(Output!$U$5:$U$36,Indoor!A51,Output!$T$6:$T$37,Indoor!AX51)","v":0},4.3999999999999997E-2,4.3999999999999997E-2,4.3999999999999997E-2,{"$f":"(((AZ51*Database!$U$3)+(BA51*Database!$V$3)+(BB51*Database!$W$3))*AY51)","v":0},25,{"$f":"COUNTIFS(Output!$W$5:$W$36,Indoor!A51,Output!$V$6:$V$37,Indoor!BD51)","v":0},4.3999999999999997E-2,4.3999999999999997E-2,4.3999999999999997E-2,{"$f":"(((BF51*Database!$U$3)+(BG51*Database!$V$3)+(BH51*Database!$W$3))*BE51)","v":0},0]
[{"$f":"Lists!$F$7","v":"Floor Standing"},31.25,{"$f":"COUNTIFS(Output!$E$5:$E$36,Indoor!A52,Output!$D$6:$D$37,Indoor!B52)","v":0},null,null,0,{"$f":"(((D52*Database!$U$3)+(E52*Database!$V$3)+(F52*Database!$W$3))*C52)","v":0},31.25,{"$f":"COUNTIFS(Output!$G$5:$G$36,Indoor!A52,Output!$F$6:$F$37,Indoor!H52)","v":0},0,0,0,{"$f":"(((J52*Database!$U$3)+(K52*Database!$V$3)+(L52*Database!$W$3))*I52)","v":0},31.25,{"$f":"COUNTIFS(Output!$I$5:$I$36,Indoor!A52,Output!$H$6:$H$37,Indoor!N52)","v":0},0,0,0,{"$f":"(((P52*Database!$U$3)+(Q52*Database!$V$3)+(R52*Database!$W$3))*O52)","v":0},31.25,{"$f":"COUNTIFS(Output!$K$5:$K$36,Indoor!A52,Output!$J$6:$J$37,Indoor!T52)","v":0},0,0,0,{"$f":"(((V52*Database!$U$3)+(W52*Database!$V$3)+(X52*Database!$W$3))*U52)","v":0},31.25,{"$f":"COUNTIFS(Output!$M$5:$M$36,Indoor!A52,Output!$L$6:$L$37,Indoor!Z52)","v":0},0,0,0,{"$f":"(((AB52*Database!$U$3)+(AC52*Database!$V$3)+(AD52*Database!$W$3))*AA52)","v":0},31.25,{"$f":"COUNTIFS(Output!$O$5:$O$36,Indoor!A52,Output!$N$6:$N$37,Indoor!AF52)","v":0},0,0,0,{"$f":"(((AH52*Database!$U$3)+(AI52*Database!$V$3)+(AJ52*Database!$W$3))*AG52)","v":0},31.25,{"$f":"COUNTIFS(Output!$Q$5:$Q$36,Indoor!A52,Output!$P$6:$P$37,Indoor!AL52)","v":0},0,0,0,{"$f":"(((AN52*Database!$U$3)+(AO52*Database!$V$3)+(AP52*Database!$W$3))*AM52)","v":0},31.25,{"$f":"COUNTIFS(Output!$S$5:$S$36,Indoor!A52,Output!$R$6:$R$37,Indoor!AR52)","v":0},0,0,0,{"$f":"(((AT52*Database!$U$3)+(AU52*Database!$V$3)+(AV52*Database!$W$3))*AS52)","v":0},31.25,{"$f":"COUNTIFS(Output!$U$5:$U$36,Indoor!A52,Output!$T$6:$T$37,Indoor!AX52)","v":0},0,0,0,{"$f":"(((AZ52*Database!$U$3)+(BA52*Database!$V$3)+(BB52*Database!$W$3))*AY52)","v":0},31.25,{"$f":"COUNTIFS(Output!$W$5:$W$36,Indoor!A52,Output!$V$6:$V$37,Indoor!BD52)","v":0},0,0,0,{"$f":"(((BF52*Database!$U$3)+(BG52*Database!$V$3)+(BH52*Database!$W$3))*BE52)","v":0},0]
[{"$f":"Lists!$F$7","v":"Floor Standing"},40,{"$f":"COUNTIFS(Output!$E$5:$E$36,Indoor!A53,Output!$D$6:$D$37,Indoor!B53)","v":0},7.5999999999999998E-2,7.5999999999999998E-2,7.5999999999999998E-2,{"$f":"(((D53*Database!$U$3)+(E53*Database!$V$3)+(F53*Database!$W$3))*C53)","v":0},40,{"$f":"COUNTIFS(Output!$G$5:$G$36,Indoor!A53,Output!$F$6:$F$37,Indoor!H53)","v":0},7.5999999999999998E-2,7.5999999999999998E-2,7.5999999999999998E-2,{"$f":"(((J53*Database!$U$3)+(K53*Database!$V$3)+(L53*Database!$W$3))*I53)","v":0},40,{"$f":"COUNTIFS(Output!$I$5:$I$36,Indoor!A53,Output!$H$6:$H$37,Indoor!N53)","v":0},7.5999999999999998E-2,7.5999999999999998E-2,7.5999999999999998E-2,{"$f":"(((P53*Database!$U$3)+(Q53*Database!$V$3)+(R53*Database!$W$3))*O53)","v":0},40,{"$f":"COUNTIFS(Output!$K$5:$K$36,Indoor!A53,Output!$J$6:$J$37,Indoor!T53)","v":0},7.5999999999999998E-2,7.5999999999999998E-2,7.5999999999999998E-2,{"$f":"(((V53*Database!$U$3)+(W53*Database!$V$3)+(X53*Database!$W$3))*U53)","v":0},40,{"$f":"COUNTIFS(Output!$M$5:$M$36,Indoor!A53,Output!$L$6:$L$37,Indoor!Z53)","v":0},7.5999999999999998E-2,7.5999999999999998E-2,7.5999999999999998E-2,{"$f":"(((AB53*Database!$U$3)+(AC53*Database!$V$3)+(AD53*Database!$W$3))*AA53)","v":0},40,{"$f":"COUNTIFS(Output!$O$5:$O$36,Indoor!A53,Output!$N$6:$N$37,Indoor!AF53)","v":0},7.5999999999999998E-2,7.5999999999999998E-2,7.5999999999999998E-2,{"$f":"(((AH53*Database!$U$3)+(AI53*Database!$V$3)+(AJ53*Database!$W$3))*AG53)","v":0},40,{"$f":"COUNTIFS(Output!$Q$5:$Q$36,Indoor!A53,Output!$P$6:$P$37,Indoor!AL53)","v":0},7.5999999999999998E-2,7.5999999999999998E-2,7.5999999999999998E-2,{"$f":"(((AN53*Database!$U$3)+(AO53*Database!$V$3)+(AP53*Database!$W$3))*AM53)","v":0},40,{"$f":"COUNTIFS(Output!$S$5:$S$36,Indoor!A53,Output!$R$6:$R$37,Indoor!AR53)","v":0},7.5999999999999998E-2,7.5999999999999998E-2,7.5999999999999998E-2,{"$f":"(((AT53*Database!$U$3)+(AU53*Database!$V$3)+(AV53*Database!$W$3))*AS53)","v":0},40,{"$f":"COUNTIFS(Output!$U$5:$U$36,Indoor!A53,Output!$T$6:$T$37,Indoor!AX53)","v":0},7.5999999999999998E-2,7.5999999999999998E-2,7.5999999999999998E-2,{"$f":"(((AZ53*Database!$U$3)+(BA53*Database!$V$3)+(BB53*Database!$W$3))*AY53)","v":0},40,{"$f":"COUNTIFS(Output!$W$5:$W$36,Indoor!A53,Output!$V$6:$V$37,Indoor!BD53)","v":0},7.5999999999999998E-2,7.5999999999999998E-2,7.5999999999999998E-2,{"$f":"(((BF53*Database!$U$3)+(BG53*Database!$V$3)+(BH53*Database!$W$3))*BE53)","v":0},0]
[{"$f":"Lists!$F$7","v":"Floor Standing"},50,{"$f":"COUNTIFS(Output!$E$5:$E$36,Indoor!A54,Output!$D$6:$D$37,Indoor!B54)","v":0},null,null,0,{"$f":"(((D54*Database!$U$3)+(E54*Database!$V$3)+(F54*Database!$W$3))*C54)","v":0},50,{"$f":"COUNTIFS(Output!$G$5:$G$36,Indoor!A54,Output!$F$6:$F$37,Indoor!H54)","v":0},0,0,0,{"$f":"(((J54*Database!$U$3)+(K54*Database!$V$3)+(L54*Database!$W$3))*I54)","v":0},50,{"$f":"COUNTIFS(Output!$I$5:$I$36,Indoor!A54,Output!$H$6:$H$37,Indoor!N54)","v":0},0,0,0,{"$f":"(((P54*Database!$U$3)+(Q54*Database!$V$3)+(R54*Database!$W$3))*O54)","v":0},50,{"$f":"COUNTIFS(Output!$K$5:$K$36,Indoor!A54,Output!$J$6:$J$37,Indoor!T54)","v":0},0,0,0,{"$f":"(((V54*Database!$U$3)+(W54*Database!$V$3)+(X54*Database!$W$3))*U54)","v":0},50,{"$f":"COUNTIFS(Output!$M$5:$M$36,Indoor!A54,Output!$L$6:$L$37,Indoor!Z54)","v":0},0,0,0,{"$f":"(((AB54*Database!$U$3)+(AC54*Database!$V$3)+(AD54*Database!$W$3))*AA54)","v":0},50,{"$f":"COUNTIFS(Output!$O$5:$O$36,Indoor!A54,Output!$N$6:$N$37,Indoor!AF54)","v":0},0,0,0,{"$f":"(((AH54*Database!$U$3)+(AI54*Database!$V$3)+(AJ54*Database!$W$3))*AG54)","v":0},50,{"$f":"COUNTIFS(Output!$Q$5:$Q$36,Indoor!A54,Output!$P$6:$P$37,Indoor!AL54)","v":0},0,0,0,{"$f":"(((AN54*Database!$U$3)+(AO54*Database!$V$3)+(AP54*Database!$W$3))*AM54)","v":0},50,{"$f":"COUNTIFS(Output!$S$5:$S$36,Indoor!A54,Output!$R$6:$R$37,Indoor!AR54)","v":0},0,0,0,{"$f":"(((AT54*Database!$U$3)+(AU54*Database!$V$3)+(AV54*Database!$W$3))*AS54)","v":0},50,{"$f":"COUNTIFS(Output!$U$5:$U$36,Indoor!A54,Output!$T$6:$T$37,Indoor!AX54)","v":0},0,0,0,{"$f":"(((AZ54*Database!$U$3)+(BA54*Database!$V$3)+(BB54*Database!$W$3))*AY54)","v":0},50,{"$f":"COUNTIFS(Output!$W$5:$W$36,Indoor!A54,Output!$V$6:$V$37,Indoor!BD54)","v":0},0,0,0,{"$f":"(((BF54*Database!$U$3)+(BG54*Database!$V$3)+(BH54*Database!$W$3))*BE54)","v":0},0]
[{"$f":"Lists!$F$7","v":"Floor Standing"},63,{"$f":"COUNTIFS(Output!$E$5:$E$36,Indoor!A55,Output!$D$6:$D$37,Indoor!B55)","v":0},0.109,0.109,0.109,{"$f":"(((D55*Database!$U$3)+(E55*Database!$V$3)+(F55*Database!$W$3))*C55)","v":0},63,{"$f":"COUNTIFS(Output!$G$5:$G$36,Indoor!A55,Output!$F$6:$F$37,Indoor!H55)","v":0},0.109,0.109,0.109,{"$f":"(((J55*Database!$U$3)+(K55*Database!$V$3)+(L55*Database!$W$3))*I55)","v":0},63,{"$f":"COUNTIFS(Output!$I$5:$I$36,Indoor!A55,Output!$H$6:$H$37,Indoor!N55)","v":0},0.109,0.109,0.109,{"$f":"(((P55*Database!$U$3)+(Q55*Database!$V$3)+(R55*Database!$W$3))*O55)","v":0},63,{"$f":"COUNTIFS(Output!$K$5:$K$36,Indoor!A55,Output!$J$6:$J$37,Indoor!T55)","v":0},0.109,0.109,0.109,{"$f":"(((V55*Database!$U$3)+(W55*Database!$V$3)+(X55*Database!$W$3))*U55)","v":0},63,{"$f":"COUNTIFS(Output!$M$5:$M$36,Indoor!A55,Output!$L$6:$L$37,Indoor!Z55)","v":0},0.109,0.109,0.109,{"$f":"(((AB55*Database!$U$3)+(AC55*Database!$V$3)+(AD55*Database!$W$3))*AA55)","v":0},63,{"$f":"COUNTIFS(Output!$O$5:$O$36,Indoor!A55,Output!$N$6:$N$37,Indoor!AF55)","v":0},0.109,0.109,0.109,{"$f":"(((AH55*Database!$U$3)+(AI55*Database!$V$3)+(AJ55*Database!$W$3))*AG55)","v":0},63,{"$f":"COUNTIFS(Output!$Q$5:$Q$36,Indoor!A55,Output!$P$6:$P$37,Indoor!AL55)","v":0},0.109,0.109,0.109,{"$f":"(((AN55*Database!$U$3)+(AO55*Database!$V$3)+(AP55*Database!$W$3))*AM55)","v":0},63,{"$f":"COUNTIFS(Output!$S$5:$S$36,Indoor!A55,Output!$R$6:$R$37,Indoor!AR55)","v":0},0.109,0.109,0.109,{"$f":"(((AT55*Database!$U$3)+(AU55*Database!$V$3)+(AV55*Database!$W$3))*AS55)","v":0},63,{"$f":"COUNTIFS(Output!$U$5:$U$36,Indoor!A55,Output!$T$6:$T$37,Indoor!AX55)","v":0},0.109,0.109,0.109,{"$f":"(((AZ55*Database!$U$3)+(BA55*Database!$V$3)+(BB55*Database!$W$3))*AY55)","v":0},63,{"$f":"COUNTIFS(Output!$W$5:$W$36,Indoor!A55,Output!$V$6:$V$37,Indoor!BD55)","v":0},0.109,0.109,0.109,{"$f":"(((BF55*Database!$U$3)+(BG55*Database!$V$3)+(BH55*Database!$W$3))*BE55)","v":0},0]
[{"$f":"Lists!$F$7","v":"Floor Standing"},80,{"$f":"COUNTIFS(Output!$E$5:$E$36,Indoor!A56,Output!$D$6:$D$37,Indoor!B56)","v":0},null,null,0,{"$f":"(((D56*Database!$U$3)+(E56*Database!$V$3)+(F56*Database!$W$3))*C56)","v":0},80,{"$f":"COUNTIFS(Output!$G$5:$G$36,Indoor!A56,Output!$F$6:$F$37,Indoor!H56)","v":0},0,0,0,{"$f":"(((J56*Database!$U$3)+(K56*Database!$V$3)+(L56*Database!$W$3))*I56)","v":0},80,{"$f":"COUNTIFS(Output!$I$5:$I$36,Indoor!A56,Output!$H$6:$H$37,Indoor!N56)","v":0},0,0,0,{"$f":"(((P56*Database!$U$3)+(Q56*Database!$V$3)+(R56*Database!$W$3))*O56)","v":0},80,{"$f":"COUNTIFS(Output!$K$5:$K$36,Indoor!A56,Output!$J$6:$J$37,Indoor!T56)","v":0},0,0,0,{"$f":"(((V56*Database!$U$3)+(W56*Database!$V$3)+(X56*Database!$W$3))*U56)","v":0},80,{"$f":"COUNTIFS(Output!$M$5:$M$36,Indoor!A56,Output!$L$6:$L$37,Indoor!Z56)","v":0},0,0,0,{"$f":"(((AB56*Database!$U$3)+(AC56*Database!$V$3)+(AD56*Database!$W$3))*AA56)","v":0},80,{"$f":"COUNTIFS(Output!$O$5:$O$36,Indoor!A56,Output!$N$6:$N$37,Indoor!AF56)","v":0},0,0,0,{"$f":"(((AH56*Database!$U$3)+(AI56*Database!$V$3)+(AJ56*Database!$W$3))*AG56)","v":0},80,{"$f":"COUNTIFS(Output!$Q$5:$Q$36,Indoor!A56,Output!$P$6:$P$37,Indoor!AL56)","v":0},0,0,0,{"$f":"(((AN56*Database!$U$3)+(AO56*Database!$V$3)+(AP56*Database!$W$3))*AM56)","v":0},80,{"$f":"COUNTIFS(Output!$S$5:$S$36,Indoor!A56,Output!$R$6:$R$37,Indoor!AR56)","v":0},0,0,0,{"$f":"(((AT56*Database!$U$3)+(AU56*Database!$V$3)+(AV56*Database!$W$3))*AS56)","v":0},80,{"$f":"COUNTIFS(Output!$U$5:$U$36,Indoor!A56,Output!$T$6:$T$37,Indoor!AX56)","v":0},0,0,0,{"$f":"(((AZ56*Database!$U$3)+(BA56*Database!$V$3)+(BB56*Database!$W$3))*AY56)","v":0},80,{"$f":"COUNTIFS(Output!$W$5:$W$36,Indoor!A56,Output!$V$6:$V$37,Indoor!BD56)","v":0},0,0,0,{"$f":"(((BF56*Database!$U$3)+(BG56*Database!$V$3)+(BH56*Database!$W$3))*BE56)","v":0},0]
[{"$f":"Lists!$F$7","v":"Floor Standing"},100,{"$f":"COUNTIFS(Output!$E$5:$E$36,Indoor!A57,Output!$D$6:$D$37,Indoor!B57)","v":0},null,null,0,{"$f":"(((D57*Database!$U$3)+(E57*Database!$V$3)+(F57*Database!$W$3))*C57)","v":0},100,{"$f":"COUNTIFS(Output!$G$5:$G$36,Indoor!A57,Output!$F$6:$F$37,Indoor!H57)","v":0},0,0,0,{"$f":"(((J57*Database!$U$3)+(K57*Database!$V$3)+(L57*Database!$W$3))*I57)","v":0},100,{"$f":"COUNTIFS(Output!$I$5:$I$36,Indoor!A57,Output!$H$6:$H$37,Indoor!N57)","v":0},0,0,0,{"$f":"(((P57*Database!$U$3)+(Q57*Database!$V$3)+(R57*Database!$W$3))*O57)","v":0},100,{"$f":"COUNTIFS(Output!$K$5:$K$36,Indoor!A57,Output!$J$6:$J$37,Indoor!T57)","v":0},0,0,0,{"$f":"(((V57*Database!$U$3)+(W57*Database!$V$3)+(X57*Database!$W$3))*U57)","v":0},100,{"$f":"COUNTIFS(Output!$M$5:$M$36,Indoor!A57,Output!$L$6:$L$37,Indoor!Z57)","v":0},0,0,0,{"$f":"(((AB57*Database!$U$3)+(AC57*Database!$V$3)+(AD57*Database!$W$3))*AA57)","v":0},100,{"$f":"COUNTIFS(Output!$O$5:$O$36,Indoor!A57,Output!$N$6:$N$37,Indoor!AF57)","v":0},0,0,0,{"$f":"(((AH57*Database!$U$3)+(AI57*Database!$V$3)+(AJ57*Database!$W$3))*AG57)","v":0},100,{"$f":"COUNTIFS(Output!$Q$5:$Q$36,Indoor!A57,Output!$P$6:$P$37,Indoor!AL57)","v":0},0,0,0,{"$f":"(((AN57*Database!$U$3)+(AO57*Database!$V$3)+(AP57*Database!$W$3))*AM57)","v":0},100,{"$f":"COUNTIFS(Output!$S$5:$S$36,Indoor!A57,Output!$R$6:$R$37,Indoor!AR57)","v":0},0,0,0,{"$f":"(((AT57*Database!$U$3)+(AU57*Database!$V$3)+(AV57*Database!$W$3))*AS57)","v":0},100,{"$f":"COUNTIFS(Output!$U$5:$U$36,Indoor!A57,Output!$T$6:$T$37,Indoor!AX57)","v":0},0,0,0,{"$f":"(((AZ57*Database!$U$3)+(BA57*Database!$V$3)+(BB57*Database!$W$3))*AY57)","v":0},100,{"$f":"COUNTIFS(Output!$W$5:$W$36,Indoor!A57,Output!$V$6:$V$37,Indoor!BD57)","v":0},0,0,0,{"$f":"(((BF57*Database!$U$3)+(BG57*Database!$V$3)+(BH57*Database!$W$3))*BE57)","v":0},0]
[{"$f":"Lists!$F$7","v":"Floor Standing"},125,{"$f":"COUNTIFS(Output!$E$5:$E$36,Indoor!A58,Output!$D$6:$D$37,Indoor!B58)","v":0},null,null,0,{"$f":"(((D58*Database!$U$3)+(E58*Database!$V$3)+(F58*Database!$W$3))*C58)","v":0},125,{"$f":"COUNTIFS(Output!$G$5:$G$36,Indoor!A58,Output!$F$6:$F$37,Indoor!H58)","v":0},0,0,0,{"$f":"(((J58*Database!$U$3)+(K58*Database!$V$3)+(L58*Database!$W$3))*I58)","v":0},125,{"$f":"COUNTIFS(Output!$I$5:$I$36,Indoor!A58,Output!$H$6:$H$37,Indoor!N58)","v":0},0,0,0,{"$f":"(((P58*Database!$U$3)+(Q58*Database!$V$3)+(R58*Database!$W$3))*O58)","v":0},125,{"$f":"COUNTIFS(Output!$K$5:$K$36,Indoor!A58,Output!$J$6:$J$37,Indoor!T58)","v":0},0,0,0,{"$f":"(((V58*Database!$U$3)+(W58*Database!$V$3)+(X58*Database!$W$3))*U58)","v":0},125,{"$f":"COUNTIFS(Output!$M$5:$M$36,Indoor!A58,Output!$L$6:$L$37,Indoor!Z58)","v":0},0,0,0,{"$f":"(((AB58*Database!$U$3)+(AC58*Database!$V$3)+(AD58*Database!$W$3))*AA58)","v":0},125,{"$f":"COUNTIFS(Output!$O$5:$O$36,Indoor!A58,Output!$N$6:$N$37,Indoor!AF58)","v":0},0,0,0,{"$f":"(((AH58*Database!$U$3)+(AI58*Database!$V$3)+(AJ58*Database!$W$3))*AG58)","v":0},125,{"$f":"COUNTIFS(Output!$Q$5:$Q$36,Indoor!A58,Output!$P$6:$P$37,Indoor!AL58)","v":0},0,0,0,{"$f":"(((AN58*Database!$U$3)+(AO58*Database!$V$3)+(AP58*Database!$W$3))*AM58)","v":0},125,{"$f":"COUNTIFS(Output!$S$5:$S$36,Indoor!A58,Output!$R$6:$R$37,Indoor!AR58)","v":0},0,0,0,{"$f":"(((AT58*Database!$U$3)+(AU58*Database!$V$3)+(AV58*Database!$W$3))*AS58)","v":0},125,{"$f":"COUNTIFS(Output!$U$5:$U$36,Indoor!A58,Output!$T$6:$T$37,Indoor!AX58)","v":0},0,0,0,{"$f":"(((AZ58*Database!$U$3)+(BA58*Database!$V$3)+(BB58*Database!$W$3))*AY58)","v":0},125,{"$f":"COUNTIFS(Output!$W$5:$W$36,Indoor!A58,Output!$V$6:$V$37,Indoor!BD58)","v":0},0,0,0,{"$f":"(((BF58*Database!$U$3)+(BG58*Database!$V$3)+(BH58*Database!$W$3))*BE58)","v":0},0]
[{"$f":"Lists!$F$7","v":"Floor Standing"},200,{"$f":"COUNTIFS(Output!$E$5:$E$36,Indoor!A59,Output!$D$6:$D$37,Indoor!B59)","v":0},null,null,0,{"$f":"(((D59*Database!$U$3)+(E59*Database!$V$3)+(F59*Database!$W$3))*C59)","v":0},200,{"$f":"COUNTIFS(Output!$G$5:$G$36,Indoor!A59,Output!$F$6:$F$37,Indoor!H59)","v":0},0,0,0,{"$f":"(((J59*Database!$U$3)+(K59*Database!$V$3)+(L59*Database!$W$3))*I59)","v":0},200,{"$f":"COUNTIFS(Output!$I$5:$I$36,Indoor!A59,Output!$H$6:$H$37,Indoor!N59)","v":0},0,0,0,{"$f":"(((P59*Database!$U$3)+(Q59*Database!$V$3)+(R59*Database!$W$3))*O59)","v":0},200,{"$f":"COUNTIFS(Output!$K$5:$K$36,Indoor!A59,Output!$J$6:$J$37,Indoor!T59)","v":0},0,0,0,{"$f":"(((V59*Database!$U$3)+(W59*Database!$V$3)+(X59*Database!$W$3))*U59)","v":0},200,{"$f":"COUNTIFS(Output!$M$5:$M$36,Indoor!A59,Output!$L$6:$L$37,Indoor!Z59)","v":0},0,0,0,{"$f":"(((AB59*Database!$U$3)+(AC59*Database!$V$3)+(AD59*Database!$W$3))*AA59)","v":0},200,{"$f":"COUNTIFS(Output!$O$5:$O$36,Indoor!A59,Output!$N$6:$N$37,Indoor!AF59)","v":0},0,0,0,{"$f":"(((AH59*Database!$U$3)+(AI59*Database!$V$3)+(AJ59*Database!$W$3))*AG59)","v":0},200,{"$f":"COUNTIFS(Output!$Q$5:$Q$36,Indoor!A59,Output!$P$6:$P$37,Indoor!AL59)","v":0},0,0,0,{"$f":"(((AN59*Database!$U$3)+(AO59*Database!$V$3)+(AP59*Database!$W$3))*AM59)","v":0},200,{"$f":"COUNTIFS(Output!$S$5:$S$36,Indoor!A59,Output!$R$6:$R$37,Indoor!AR59)","v":0},0,0,0,{"$f":"(((AT59*Database!$U$3)+(AU59*Database!$V$3)+(AV59*Database!$W$3))*AS59)","v":0},200,{"$f":"COUNTIFS(Output!$U$5:$U$36,Indoor!A59,Output!$T$6:$T$37,Indoor!AX59)","v":0},0,0,0,{"$f":"(((AZ59*Database!$U$3)+(BA59*Database!$V$3)+(BB59*Database!$W$3))*AY59)","v":0},200,{"$f":"COUNTIFS(Output!$W$5:$W$36,Indoor!A59,Output!$V$6:$V$37,Indoor!BD59)","v":0},0,0,0,{"$f":"(((BF59*Database!$U$3)+(BG59*Database!$V$3)+(BH59*Database!$W$3))*BE59)","v":0},0]
[{"$f":"Lists!$F$7","v":"Floor Standing"},250,{"$f":"COUNTIFS(Output!$E$5:$E$36,Indoor!A60,Output!$D$6:$D$37,Indoor!B60)","v":0},null,null,0,{"$f":"(((D60*Database!$U$3)+(E60*Database!$V$3)+(F60*Database!$W$3))*C60)","v":0},250,{"$f":"COUNTIFS(Output!$G$5:$G$36,Indoor!A60,Output!$F$6:$F$37,Indoor!H60)","v":0},0,0,0,{"$f":"(((J60*Database!$U$3)+(K60*Database!$V$3)+(L60*Database!$W$3))*I60)","v":0},250,{"$f":"COUNTIFS(Output!$I$5:$I$36,Indoor!A60,Output!$H$6:$H$37,Indoor!N60)","v":0},0,0,0,{"$f":"(((P60*Database!$U$3)+(Q60*Database!$V$3)+(R60*Database!$W$3))*O60)","v":0},250,{"$f":"COUNTIFS(Output!$K$5:$K$36,Indoor!A60,Output!$J$6:$J$37,Indoor!T60)","v":0},0,0,0,{"$f":"(((V60*Database!$U$3)+(W60*Database!$V$3)+(X60*Database!$W$3))*U60)","v":0},250,{"$f":"COUNTIFS(Output!$M$5:$M$36,Indoor!A60,Output!$L$6:$L$37,Indoor!Z60)","v":0},0,0,0,{"$f":"(((AB60*Database!$U$3)+(AC60*Database!$V$3)+(AD60*Database!$W$3))*AA60)","v":0},250,{"$f":"COUNTIFS(Output!$O$5:$O$36,Indoor!A60,Output!$N$6:$N$37,Indoor!AF60)","v":0},0,0,0,{"$f":"(((AH60*Database!$U$3)+(AI60*Database!$V$3)+(AJ60*Database!$W$3))*AG60)","v":0},250,{"$f":"COUNTIFS(Output!$Q$5:$Q$36,Indoor!A60,Output!$P$6:$P$37,Indoor!AL60)","v":0},0,0,0,{"$f":"(((AN60*Database!$U$3)+(AO60*Database!$V$3)+(AP60*Database!$W$3))*AM60)","v":0},250,{"$f":"COUNTIFS(Output!$S$5:$S$36,Indoor!A60,Output!$R$6:$R$37,Indoor!AR60)","v":0},0,0,0,{"$f":"(((AT60*Database!$U$3)+(AU60*Database!$V$3)+(AV60*Database!$W$3))*AS60)","v":0},250,{"$f":"COUNTIFS(Output!$U$5:$U$36,Indoor!A60,Output!$T$6:$T$37,Indoor!AX60)","v":0},0,0,0,{"$f":"(((AZ60*Database!$U$3)+(BA60*Database!$V$3)+(BB60*Database!$W$3))*AY60)","v":0},250,{"$f":"COUNTIFS(Output!$W$5:$W$36,Indoor!A60,Output!$V$6:$V$37,Indoor!BD60)","v":0},0,0,0,{"$f":"(((BF60*Database!$U$3)+(BG60*Database!$V$3)+(BH60*Database!$W$3))*BE60)","v":0},0]
[null,null,{"$f":"SUM(C50:C60)","v":0},null,null,null,null,null,{"$f":"SUM(I50:I60)","v":0},null,null,null,null,null,{"$f":"SUM(O50:O60)","v":0},null,null,null,null,null,{"$f":"SUM(U50:U60)","v":0},null,null,null,null,null,{"$f":"SUM(AA50:AA60)","v":0},null,null,null,null,null,{"$f":"SUM(AG50:AG60)","v":0},null,null,null,null,null,{"$f":"SUM(AM50:AM60)","v":0},null,null,null,null,null,{"$f":"SUM(AS50:AS60)","v":0},null,null,null,null,null,{"$f":"SUM(AY50:AY60)","v":0},null,null,null,null,null,{"$f":"SUM(BE50:BE60)","v":0}]
[{"$f":"Lists!$F$8","v":"Concealed Floor"},20,{"$f":"COUNTIFS(Output!$E$5:$E$36,Indoor!A62,Output!$D$6:$D$37,Indoor!B62)","v":0},null,null,0,{"$f":"(((D62*Database!$U$3)+(E62*Database!$V$3)+(F62*Database!$W$3))*C62)","v":0},20,{"$f":"COUNTIFS(Output!$G$5:$G$36,Indoor!A62,Output!$F$6:$F$37,Indoor!H62)","v":0},0,0,0,{"$f":"(((J62*Database!$U$3)+(K62*Database!$V$3)+(L62*Database!$W$3))*I62)","v":0},20,{"$f":"COUNTIFS(Output!$I$5:$I$36,Indoor!A62,Output!$H$6:$H$37,Indoor!N62)","v":0},0,0,0,{"$f":"(((P62*Database!$U$3)+(Q62*Database!$V$3)+(R62*Database!$W$3))*O62)","v":0},20,{"$f":"COUNTIFS(Output!$K$5:$K$36,Indoor!A62,Output!$J$6:$J$37,Indoor!T62)","v":0},0,0,0,{"$f":"(((V62*Database!$U$3)+(W62*Database!$V$3)+(X62*Database!$W$3))*U62)","v":0},20,{"$f":"COUNTIFS(Output!$M$5:$M$36,Indoor!A62,Output!$L$6:$L$37,Indoor!Z62)","v":0},0,0,0,{"$f":"(((AB62*Database!$U$3)+(AC62*Database!$V$3)+(AD62*Database!$W$3))*AA62)","v":0},20,{"$f":"COUNTIFS(Output!$O$5:$O$36,Indoor!A62,Output!$N$6:$N$37,Indoor!AF62)","v":0},0,0,0,{"$f":"(((AH62*Database!$U$3)+(AI62*Database!$V$3)+(AJ62*Database!$W$3))*AG62)","v":0},20,{"$f":"COUNTIFS(Output!$Q$5:$Q$36,Indoor!A62,Output!$P$6:$P$37,Indoor!AL62)","v":0},0,0,0,{"$f":"(((AN62*Database!$U$3)+(AO62*Database!$V$3)+(AP62*Database!$W$3))*AM62)","v":0},20,{"$f":"COUNTIFS(Output!$S$5:$S$36,Indoor!A62,Output!$R$6:$R$37,Indoor!AR62)","v":0},0,0,0,{"$f":"(((AT62*Database!$U$3)+(AU62*Database!$V$3)+(AV62*Database!$W$3))*AS62)","v":0},20,{"$f":"COUNTIFS(Output!$U$5:$U$36,Indoor!A62,Output!$T$6:$T$37,Indoor!AX62)","v":0},0,0,0,{"$f":"(((AZ62*Database!$U$3)+(BA62*Database!$V$3)+(BB62*Database!$W$3))*AY62)","v":0},20,{"$f":"COUNTIFS(Output!$W$5:$W$36,Indoor!A62,Output!$V$6:$V$37,Indoor!BD62)","v":0},0,0,0,{"$f":"(((BF62*Database!$U$3)+(BG62*Database!$V$3)+(BH62*Database!$W$3))*BE62)","v":0},{"$f":"SUM(BE62+AY62+AS62+AM62+AG62+AA62+U62+O62+I62+C62)","v":0}]
[{"$f":"Lists!$F$8","v":"Concealed Floor"},25,{"$f":"COUNTIFS(Output!$E$5:$E$36,Indoor!A63,Output!$D$6:$D$37,Indoor!B63)","v":0},4.3999999999999997E-2,4.3999999999999997E-2,4.3999999999999997E-2,{"$f":"(((D63*Database!$U$3)+(E63*Database!$V$3)+(F63*Database!$W$3))*C63)","v":0},25,{"$f":"COUNTIFS(Output!$G$5:$G$36,Indoor!A63,Output!$F$6:$F$37,Indoor!H63)","v":0},4.3999999999999997E-2,4.3999999999999997E-2,4.3999999999999997E-2,{"$f":"(((J63*Database!$U$3)+(K63*Database!$V$3)+(L63*Database!$W$3))*I63)","v":0},25,{"$f":"COUNTIFS(Output!$I$5:$I$36,Indoor!A63,Output!$H$6:$H$37,Indoor!N63)","v":0},4.3999999999999997E-2,4.3999999999999997E-2,4.3999999999999997E-2,{"$f":"(((P63*Database!$U$3)+(Q63*Database!$V$3)+(R63*Database!$W$3))*O63)","v":0},25,{"$f":"COUNTIFS(Output!$K$5:$K$36,Indoor!A63,Output!$J$6:$J$37,Indoor!T63)","v":0},4.3999999999999997E-2,4.3999999999999997E-2,4.3999999999999997E-2,{"$f":"(((V63*Database!$U$3)+(W63*Database!$V$3)+(X63*Database!$W$3))*U63)","v":0},25,{"$f":"COUNTIFS(Output!$M$5:$M$36,Indoor!A63,Output!$L$6:$L$37,Indoor!Z63)","v":0},4.3999999999999997E-2,4.3999999999999997E-2,4.3999999999999997E-2,{"$f":"(((AB63*Database!$U$3)+(AC63*Database!$V$3)+(AD63*Database!$W$3))*AA63)","v":0},25,{"$f":"COUNTIFS(Output!$O$5:$O$36,Indoor!A63,Output!$N$6:$N$37,Indoor!AF63)","v":0},4.3999999999999997E-2,4.3999999999999997E-2,4.3999999999999997E-2,{"$f":"(((AH63*Database!$U$3)+(AI63*Database!$V$3)+(AJ63*Database!$W$3))*AG63)","v":0},25,{"$f":"COUNTIFS(Output!$Q$5:$Q$36,Indoor!A63,Output!$P$6:$P$37,Indoor!AL63)","v":0},4.3999999999999997E-2,4.3999999999999997E-2,4.3999999999999997E-2,{"$f":"(((AN63*Database!$U$3)+(AO63*Database!$V$3)+(AP63*Database!$W$3))*AM63)","v":0},25,{"$f":"COUNTIFS(Output!$S$5:$S$36,Indoor!A63,Output!$R$6:$R$37,Indoor!AR63)","v":0},4.3999999999999997E-2,4.3999999999999997E-2,4.3999999999999997E-2,{"$f":"(((AT63*Database!$U$3)+(AU63*Database!$V$3)+(AV63*Database!$W$3))*AS63)","v":0},25,{"$f":"COUNTIFS(Output!$U$5:$U$36,Indoor!A63,Output!$T$6:$T$37,Indoor!AX63)","v":0},4.3999999999999997E-2,4.3999999999999997E-2,4.3999999999999997E-2,{"$f":"(((AZ63*Database!$U$3)+(BA63*Database!$V$3)+(BB63*Database!$W$3))*AY63)","v":0},25,{"$f":"COUNTIFS(Output!$W$5:$W$36,Indoor!A63,Output!$V$6:$V$37,Indoor!BD63)","v":0},4.3999999999999997E-2,4.3999999999999997E-2,4.3999999999999997E-2,{"$f":"(((BF63*Database!$U$3)+(BG63*Database!$V$3)+(BH63*Database!$W$3))*BE63)","v":0},0]
[{"$f":"Lists!$F$8","v":"Concealed Floor"},31.25,{"$f":"COUNTIFS(Output!$E$5:$E$36,Indoor!A64,Output!$D$6:$D$37,Indoor!B64)","v":0},null,null,0,{"$f":"(((D64*Database!$U$3)+(E64*Database!$V$3)+(F64*Database!$W$3))*C64)","v":0},31.25,{"$f":"COUNTIFS(Output!$G$5:$G$36,Indoor!A64,Output!$F$6:$F$37,Indoor!H64)","v":0},0,0,0,{"$f":"(((J64*Database!$U$3)+(K64*Database!$V$3)+(L64*Database!$W$3))*I64)","v":0},31.25,{"$f":"COUNTIFS(Output!$I$5:$I$36,Indoor!A64,Output!$H$6:$H$37,Indoor!N64)","v":0},0,0,0,{"$f":"(((P64*Database!$U$3)+(Q64*Database!$V$3)+(R64*Database!$W$3))*O64)","v":0},31.25,{"$f":"COUNTIFS(Output!$K$5:$K$36,Indoor!A64,Output!$J$6:$J$37,Indoor!T64)","v":0},0,0,0,{"$f":"(((V64*Database!$U$3)+(W64*Database!$V$3)+(X64*Database!$W$3))*U64)","v":0},31.25,{"$f":"COUNTIFS(Output!$M$5:$M$36,Indoor!A64,Output!$L$6:$L$37,Indoor!Z64)","v":0},0,0,0,{"$f":"(((AB64*Database!$U$3)+(AC64*Database!$V$3)+(AD64*Database!$W$3))*AA64)","v":0},31.25,{"$f":"COUNTIFS(Output!$O$5:$O$36,Indoor!A64,Output!$N$6:$N$37,Indoor!AF64)","v":0},0,0,0,{"$f":"(((AH64*Database!$U$3)+(AI64*Database!$V$3)+(AJ64*Database!$W$3))*AG64)","v":0},31.25,{"$f":"COUNTIFS(Output!$Q$5:$Q$36,Indoor!A64,Output!$P$6:$P$37,Indoor!AL64)","v":0},0,0,0,{"$f":"(((AN64*Database!$U$3)+(AO64*Database!$V$3)+(AP64*Database!$W$3))*AM64)","v":0},31.25,{"$f":"COUNTIFS(Output!$S$5:$S$36,Indoor!A64,Output!$R$6:$R$37,Indoor!AR64)","v":0},0,0,0,{"$f":"(((AT64*Database!$U$3)+(AU64*Database!$V$3)+(AV64*Database!$W$3))*AS64)","v":0},31.25,{"$f":"COUNTIFS(Output!$U$5:$U$36,Indoor!A64,Output!$T$6:$T$37,Indoor!AX64)","v":0},0,0,0,{"$f":"(((AZ64*Database!$U$3)+(BA64*Database!$V$3)+(BB64*Database!$W$3))*AY64)","v":0},31.25,{"$f":"COUNTIFS(Output!$W$5:$W$36,Indoor!A64,Output!$V$6:$V$37,Indoor!BD64)","v":0},0,0,0,{"$f":"(((BF64*Database!$U$3)+(BG64*Database!$V$3)+(BH64*Database!$W$3))*BE64)","v":0},0]
[{"$f":"Lists!$F$8","v":"Concealed Floor"},40,{"$f":"COUNTIFS(Output!$E$5:$E$36,Indoor!A65,Output!$D$6:$D$37,Indoor!B65)","v":0},7.5999999999999998E-2,7.5999999999999998E-2,7.5999999999999998E-2,{"$f":"(((D65*Database!$U$3)+(E65*Database!$V$3)+(F65*Database!$W$3))*C65)","v":0},40,{"$f":"COUNTIFS(Output!$G$5:$G$36,Indoor!A65,Output!$F$6:$F$37,Indoor!H65)","v":0},7.5999999999999998E-2,7.5999999999999998E-2,7.5999999999999998E-2,{"$f":"(((J65*Database!$U$3)+(K65*Database!$V$3)+(L65*Database!$W$3))*I65)","v":0},40,{"$f":"COUNTIFS(Output!$I$5:$I$36,Indoor!A65,Output!$H$6:$H$37,Indoor!N65)","v":0},7.5999999999999998E-2,7.5999999999999998E-2,7.5999999999999998E-2,{"$f":"(((P65*Database!$U$3)+(Q65*Database!$V$3)+(R65*Database!$W$3))*O65)","v":0},40,{"$f":"COUNTIFS(Output!$K$5:$K$36,Indoor!A65,Output!$J$6:$J$37,Indoor!T65)","v":0},7.5999999999999998E-2,7.5999999999999998E-2,7.5999999999999998E-2,{"$f":"(((V65*Database!$U$3)+(W65*Database!$V$3)+(X65*Database!$W$3))*U65)","v":0},40,{"$f":"COUNTIFS(Output!$M$5:$M$36,Indoor!A65,Output!$L$6:$L$37,Indoor!Z65)","v":0},7.5999999999999998E-2,7.5999999999999998E-2,7.5999999999999998E-2,{"$f":"(((AB65*Database!$U$3)+(AC65*Database!$V$3)+(AD65*Database!$W$3))*AA65)","v":0},40,{"$f":"COUNTIFS(Output!$O$5:$O$36,Indoor!A65,Output!$N$6:$N$37,Indoor!AF65)","v":0},7.5999999999999998E-2,7.5999999999999998E-2,7.5999999999999998E-2,{"$f":"(((AH65*Database!$U$3)+(AI65*Database!$V$3)+(AJ65*Database!$W$3))*AG65)","v":0},40,{"$f":"COUNTIFS(Output!$Q$5:$Q$36,Indoor!A65,Output!$P$6:$P$37,Indoor!AL65)","v":0},7.5999999999999998E-2,7.5999999999999998E-2,7.5999999999999998E-2,{"$f":"(((AN65*Database!$U$3)+(AO65*Database!$V$3)+(AP65*Database!$W$3))*AM65)","v":0},40,{"$f":"COUNTIFS(Output!$S$5:$S$36,Indoor!A65,Output!$R$6:$R$37,Indoor!AR65)","v":0},7.5999999999999998E-2,7.5999999999999998E-2,7.5999999999999998E-2,{"$f":"(((AT65*Database!$U$3)+(AU65*Database!$V$3)+(AV65*Database!$W$3))*AS65)","v":0},40,{"$f":"COUNTIFS(Output!$U$5:$U$36,Indoor!A65,Output!$T$6:$T$37,Indoor!AX65)","v":0},7.5999999999999998E-2,7.5999999999999998E-2,7.5999999999999998E-2,{"$f":"(((AZ65*Database!$U$3)+(BA65*Database!$V$3)+(BB65*Database!$W$3))*AY65)","v":0},40,{"$f":"COUNTIFS(Output!$W$5:$W$36,Indoor!A65,Output!$V$6:$V$37,Indoor!BD65)","v":0},7.5999999999999998E-2,7.5999999999999998E-2,7.5999999999999998E-2,{"$f":"(((BF65*Database!$U$3)+(BG65*Database!$V$3)+(BH65*Database!$W$3))*BE65)","v":0},0]
[{"$f":"Lists!$F$8","v":"Concealed Floor"},50,{"$f":"COUNTIFS(Output!$E$5:$E$36,Indoor!A66,Output!$D$6:$D$37,Indoor!B66)","v":0},null,null,0,{"$f":"(((D66*Database!$U$3)+(E66*Database!$V$3)+(F66*Database!$W$3))*C66)","v":0},50,{"$f":"COUNTIFS(Output!$G$5:$G$36,Indoor!A66,Output!$F$6:$F$37,Indoor!H66)","v":0},0,0,0,{"$f":"(((J66*Database!$U$3)+(K66*Database!$V$3)+(L66*Database!$W$3))*I66)","v":0},50,{"$f":"COUNTIFS(Output!$I$5:$I$36,Indoor!A66,Output!$H$6:$H$37,Indoor!N66)","v":0},0,0,0,{"$f":"(((P66*Database!$U$3)+(Q66*Database!$V$3)+(R66*Database!$W$3))*O66)","v":0},50,{"$f":"COUNTIFS(Output!$K$5:$K$36,Indoor!A66,Output!$J$6:$J$37,Indoor!T66)","v":0},0,0,0,{"$f":"(((V66*Database!$U$3)+(W66*Database!$V$3)+(X66*Database!$W$3))*U66)","v":0},50,{"$f":"COUNTIFS(Output!$M$5:$M$36,Indoor!A66,Output!$L$6:$L$37,Indoor!Z66)","v":0},0,0,0,{"$f":"(((AB66*Database!$U$3)+(AC66*Database!$V$3)+(AD66*Database!$W$3))*AA66)","v":0},50,{"$f":"COUNTIFS(Output!$O$5:$O$36,Indoor!A66,Output!$N$6:$N$37,Indoor!AF66)","v":0},0,0,0,{"$f":"(((AH66*Database!$U$3)+(AI66*Database!$V$3)+(AJ66*Database!$W$3))*AG66)","v":0},50,{"$f":"COUNTIFS(Output!$Q$5:$Q$36,Indoor!A66,Output!$P$6:$P$37,Indoor!AL66)","v":0},0,0,0,{"$f":"(((AN66*Database!$U$3)+(AO66*Database!$V$3)+(AP66*Database!$W$3))*AM66)","v":0},50,{"$f":"COUNTIFS(Output!$S$5:$S$36,Indoor!A66,Output!$R$6:$R$37,Indoor!AR66)","v":0},0,0,0,{"$f":"(((AT66*Database!$U$3)+(AU66*Database!$V$3)+(AV66*Database!$W$3))*AS66)","v":0},50,{"$f":"COUNTIFS(Output!$U$5:$U$36,Indoor!A66,Output!$T$6:$T$37,Indoor!AX66)","v":0},0,0,0,{"$f":"(((AZ66*Database!$U$3)+(BA66*Database!$V$3)+(BB66*Database!$W$3))*AY66)","v":0},50,{"$f":"COUNTIFS(Output!$W$5:$W$36,Indoor!A66,Output!$V$6:$V$37,Indoor!BD66)","v":0},0,0,0,{"$f":"(((BF66*Database!$U$3)+(BG66*Database!$V$3)+(BH66*Database!$W$3))*BE66)","v":0},0]
[{"$f":"Lists!$F$8","v":"Concealed Floor"},63,{"$f":"COUNTIFS(Output!$E$5:$E$36,Indoor!A67,Output!$D$6:$D$37,Indoor!B67)","v":0},0.109,0.109,{"$f":"(D67+E67)/2","v":0.109},{"$f":"(((D67*Database!$U$3)+(E67*Database!$V$3)+(F67*Database!$W$3))*C67)","v":0},63,{"$f":"COUNTIFS(Output!$G$5:$G$36,Indoor!A67,Output!$F$6:$F$37,Indoor!H67)","v":0},{"$f":"D67","v":0.109},0.109,0.109,{"$f":"(((J67*Database!$U$3)+(K67*Database!$V$3)+(L67*Database!$W$3))*I67)","v":0},63,{"$f":"COUNTIFS(Output!$I$5:$I$36,Indoor!A67,Output!$H$6:$H$37,Indoor!N67)","v":0},{"$f":"D67","v":0.109},0.109,0.109,{"$f":"(((P67*Database!$U$3)+(Q67*Database!$V$3)+(R67*Database!$W$3))*O67)","v":0},63,{"$f":"COUNTIFS(Output!$K$5:$K$36,Indoor!A67,Output!$J$6:$J$37,Indoor!T67)","v":0},{"$f":"D67","v":0.109},0.109,0.109,{"$f":"(((V67*Database!$U$3)+(W67*Database!$V$3)+(X67*Database!$W$3))*U67)","v":0},63,{"$f":"COUNTIFS(Output!$M$5:$M$36,Indoor!A67,Output!$L$6:$L$37,Indoor!Z67)","v":0},{"$f":"D67","v":0.109},0.109,0.109,{"$f":"(((AB67*Database!$U$3)+(AC67*Database!$V$3)+(AD67*Database!$W$3))*AA67)","v":0},63,{"$f":"COUNTIFS(Output!$O$5:$O$36,Indoor!A67,Output!$N$6:$N$37,Indoor!AF67)","v":0},{"$f":"D67","v":0.109},0.109,0.109,{"$f":"(((AH67*Database!$U$3)+(AI67*Database!$V$3)+(AJ67*Database!$W$3))*AG67)","v":0},63,{"$f":"COUNTIFS(Output!$Q$5:$Q$36,Indoor!A67,Output!$P$6:$P$37,Indoor!AL67)","v":0},{"$f":"D67","v":0.109},0.109,0.109,{"$f":"(((AN67*Database!$U$3)+(AO67*Database!$V$3)+(AP67*Database!$W$3))*AM67)","v":0},63,{"$f":"COUNTIFS(Output!$S$5:$S$36,Indoor!A67,Output!$R$6:$R$37,Indoor!AR67)","v":0},{"$f":"D67","v":0.109},0.109,0.109,{"$f":"(((AT67*Database!$U$3)+(AU67*Database!$V$3)+(AV67*Database!$W$3))*AS67)","v":0},63,{"$f":"COUNTIFS(Output!$U$5:$U$36,Indoor!A67,Output!$T$6:$T$37,Indoor!AX67)","v":0},{"$f":"D67","v":0.109},0.109,0.109,{"$f":"(((AZ67*Database!$U$3)+(BA67*Database!$V$3)+(BB67*Database!$W$3))*AY67)","v":0},63,{"$f":"COUNTIFS(Output!$W$5:$W$36,Indoor!A67,Output!$V$6:$V$37,Indoor!BD67)","v":0},{"$f":"D67","v":0.109},0.109,0.109,{"$f":"(((BF67*Database!$U$3)+(BG67*Database!$V$3)+(BH67*Database!$W$3))*BE67)","v":0},0]
[{"$f":"Lists!$F$8","v":"Concealed Floor"},80,{"$f":"COUNTIFS(Output!$E$5:$E$36,Indoor!A68,Output!$D$6:$D$37,Indoor!B68)","v":0},null,null,0,{"$f":"(((D68*Database!$U$3)+(E68*Database!$V$3)+(F68*Database!$W$3))*C68)","v":0},80,{"$f":"COUNTIFS(Output!$G$5:$G$36,Indoor!A68,Output!$F$6:$F$37,Indoor!H68)","v":0},0,0,0,{"$f":"(((J68*Database!$U$3)+(K68*Database!$V$3)+(L68*Database!$W$3))*I68)","v":0},80,{"$f":"COUNTIFS(Output!$I$5:$I$36,Indoor!A68,Output!$H$6:$H$37,Indoor!N68)","v":0},0,0,0,{"$f":"(((P68*Database!$U$3)+(Q68*Database!$V$3)+(R68*Database!$W$3))*O68)","v":0},80,{"$f":"COUNTIFS(Output!$K$5:$K$36,Indoor!A68,Output!$J$6:$J$37,Indoor!T68)","v":0},0,0,0,{"$f":"(((V68*Database!$U$3)+(W68*Database!$V$3)+(X68*Database!$W$3))*U68)","v":0},80,{"$f":"COUNTIFS(Output!$M$5:$M$36,Indoor!A68,Output!$L$6:$L$37,Indoor!Z68)","v":0},0,0,0,{"$f":"(((AB68*Database!$U$3)+(AC68*Database!$V$3)+(AD68*Database!$W$3))*AA68)","v":0},80,{"$f":"COUNTIFS(Output!$O$5:$O$36,Indoor!A68,Output!$N$6:$N$37,Indoor!AF68)","v":0},0,0,0,{"$f":"(((AH68*Database!$U$3)+(AI68*Database!$V$3)+(AJ68*Database!$W$3))*AG68)","v":0},80,{"$f":"COUNTIFS(Output!$Q$5:$Q$36,Indoor!A68,Output!$P$6:$P$37,Indoor!AL68)","v":0},0,0,0,{"$f":"(((AN68*Database!$U$3)+(AO68*Database!$V$3)+(AP68*Database!$W$3))*AM68)","v":0},80,{"$f":"COUNTIFS(Output!$S$5:$S$36,Indoor!A68,Output!$R$6:$R$37,Indoor!AR68)","v":0},0,0,0,{"$f":"(((AT68*Database!$U$3)+(AU68*Database!$V$3)+(AV68*Database!$W$3))*AS68)","v":0},80,{"$f":"COUNTIFS(Output!$U$5:$U$36,Indoor!A68,Output!$T$6:$T$37,Indoor!AX68)","v":0},0,0,0,{"$f":"(((AZ68*Database!$U$3)+(BA68*Database!$V$3)+(BB68*Database!$W$3))*AY68)","v":0},80,{"$f":"COUNTIFS(Output!$W$5:$W$36,Indoor!A68,Output!$V$6:$V$37,Indoor!BD68)","v":0},0,0,0,{"$f":"(((BF68*Database!$U$3)+(BG68*Database!$V$3)+(BH68*Database!$W$3))*BE68)","v":0},0]
[{"$f":"Lists!$F$8","v":"Concealed Floor"},100,{"$f":"COUNTIFS(Output!$E$5:$E$36,Indoor!A69,Output!$D$6:$D$37,Indoor!B69)","v":0},null,null,0,{"$f":"(((D69*Database!$U$3)+(E69*Database!$V$3)+(F69*Database!$W$3))*C69)","v":0},100,{"$f":"COUNTIFS(Output!$G$5:$G$36,Indoor!A69,Output!$F$6:$F$37,Indoor!H69)","v":0},0,0,0,{"$f":"(((J69*Database!$U$3)+(K69*Database!$V$3)+(L69*Database!$W$3))*I69)","v":0},100,{"$f":"COUNTIFS(Output!$I$5:$I$36,Indoor!A69,Output!$H$6:$H$37,Indoor!N69)","v":0},0,0,0,{"$f":"(((P69*Database!$U$3)+(Q69*Database!$V$3)+(R69*Database!$W$3))*O69)","v":0},100,{"$f":"COUNTIFS(Output!$K$5:$K$36,Indoor!A69,Output!$J$6:$J$37,Indoor!T69)","v":0},0,0,0,{"$f":"(((V69*Database!$U$3)+(W69*Database!$V$3)+(X69*Database!$W$3))*U69)","v":0},100,{"$f":"COUNTIFS(Output!$M$5:$M$36,Indoor!A69,Output!$L$6:$L$37,Indoor!Z69)","v":0},0,0,0,{"$f":"(((AB69*Database!$U$3)+(AC69*Database!$V$3)+(AD69*Database!$W$3))*AA69)","v":0},100,{"$f":"COUNTIFS(Output!$O$5:$O$36,Indoor!A69,Output!$N$6:$N$37,Indoor!AF69)","v":0},0,0,0,{"$f":"(((AH69*Database!$U$3)+(AI69*Database!$V$3)+(AJ69*Database!$W$3))*AG69)","v":0},100,{"$f":"COUNTIFS(Output!$Q$5:$Q$36,Indoor!A69,Output!$P$6:$P$37,Indoor!AL69)","v":0},0,0,0,{"$f":"(((AN69*Database!$U$3)+(AO69*Database!$V$3)+(AP69*Database!$W$3))*AM69)","v":0},100,{"$f":"COUNTIFS(Output!$S$5:$S$36,Indoor!A69,Output!$R$6:$R$37,Indoor!AR69)","v":0},0,0,0,{"$f":"(((AT69*Database!$U$3)+(AU69*Database!$V$3)+(AV69*Database!$W$3))*AS69)","v":0},100,{"$f":"COUNTIFS(Output!$U$5:$U$36,Indoor!A69,Output!$T$6:$T$37,Indoor!AX69)","v":0},0,0,0,{"$f":"(((AZ69*Database!$U$3)+(BA69*Database!$V$3)+(BB69*Database!$W$3))*AY69)","v":0},100,{"$f":"COUNTIFS(Output!$W$5:$W$36,Indoor!A69,Output!$V$6:$V$37,Indoor!BD69)","v":0},0,0,0,{"$f":"(((BF69*Database!$U$3)+(BG69*Database!$V$3)+(BH69*Database!$W$3))*BE69)","v":0},0]
[{"$f":"Lists!$F$8","v":"Concealed Floor"},125,{"$f":"COUNTIFS(Output!$E$5:$E$36,Indoor!A70,Output!$D$6:$D$37,Indoor!B70)","v":0},null,null,0,{"$f":"(((D70*Database!$U$3)+(E70*Database!$V$3)+(F70*Database!$W$3))*C70)","v":0},125,{"$f":"COUNTIFS(Output!$G$5:$G$36,Indoor!A70,Output!$F$6:$F$37,Indoor!H70)","v":0},0,0,0,{"$f":"(((J70*Database!$U$3)+(K70*Database!$V$3)+(L70*Database!$W$3))*I70)","v":0},125,{"$f":"COUNTIFS(Output!$I$5:$I$36,Indoor!A70,Output!$H$6:$H$37,Indoor!N70)","v":0},0,0,0,{"$f":"(((P70*Database!$U$3)+(Q70*Database!$V$3)+(R70*Database!$W$3))*O70)","v":0},125,{"$f":"COUNTIFS(Output!$K$5:$K$36,Indoor!A70,Output!$J$6:$J$37,Indoor!T70)","v":0},0,0,0,{"$f":"(((V70*Database!$U$3)+(W70*Database!$V$3)+(X70*Database!$W$3))*U70)","v":0},125,{"$f":"COUNTIFS(Output!$M$5:$M$36,Indoor!A70,Output!$L$6:$L$37,Indoor!Z70)","v":0},0,0,0,{"$f":"(((AB70*Database!$U$3)+(AC70*Database!$V$3)+(AD70*Database!$W$3))*AA70)","v":0},125,{"$f":"COUNTIFS(Output!$O$5:$O$36,Indoor!A70,Output!$N$6:$N$37,Indoor!AF70)","v":0},0,0,0,{"$f":"(((AH70*Database!$U$3)+(AI70*Database!$V$3)+(AJ70*Database!$W$3))*AG70)","v":0},125,{"$f":"COUNTIFS(Output!$Q$5:$Q$36,Indoor!A70,Output!$P$6:$P$37,Indoor!AL70)","v":0},0,0,0,{"$f":"(((AN70*Database!$U$3)+(AO70*Database!$V$3)+(AP70*Database!$W$3))*AM70)","v":0},125,{"$f":"COUNTIFS(Output!$S$5:$S$36,Indoor!A70,Output!$R$6:$R$37,Indoor!AR70)","v":0},0,0,0,{"$f":"(((AT70*Database!$U$3)+(AU70*Database!$V$3)+(AV70*Database!$W$3))*AS70)","v":0},125,{"$f":"COUNTIFS(Output!$U$5:$U$36,Indoor!A70,Output!$T$6:$T$37,Indoor!AX70)","v":0},0,0,0,{"$f":"(((AZ70*Database!$U$3)+(BA70*Database!$V$3)+(BB70*Database!$W$3))*AY70)","v":0},125,{"$f":"COUNTIFS(Output!$W$5:$W$36,Indoor!A70,Output!$V$6:$V$37,Indoor!BD70)","v":0},0,0,0,{"$f":"(((BF70*Database!$U$3)+(BG70*Database!$V$3)+(BH70*Database!$W$3))*BE70)","v":0},0]
[{"$f":"Lists!$F$8","v":"Concealed Floor"},200,{"$f":"COUNTIFS(Output!$E$5:$E$36,Indoor!A71,Output!$D$6:$D$37,Indoor!B71)","v":0},null,null,0,{"$f":"(((D71*Database!$U$3)+(E71*Database!$V$3)+(F71*Database!$W$3))*C71)","v":0},200,{"$f":"COUNTIFS(Output!$G$5:$G$36,Indoor!A71,Output!$F$6:$F$37,Indoor!H71)","v":0},0,0,0,{"$f":"(((J71*Database!$U$3)+(K71*Database!$V$3)+(L71*Database!$W$3))*I71)","v":0},200,{"$f":"COUNTIFS(Output!$I$5:$I$36,Indoor!A71,Output!$H$6:$H$37,Indoor!N71)","v":0},0,0,0,{"$f":"(((P71*Database!$U$3)+(Q71*Database!$V$3)+(R71*Database!$W$3))*O71)","v":0},200,{"$f":"COUNTIFS(Output!$K$5:$K$36,Indoor!A71,Output!$J$6:$J$37,Indoor!T71)","v":0},0,0,0,{"$f":"(((V71*Database!$U$3)+(W71*Database!$V$3)+(X71*Database!$W$3))*U71)","v":0},200,{"$f":"COUNTIFS(Output!$M$5:$M$36,Indoor!A71,Output!$L$6:$L$37,Indoor!Z71)","v":0},0,0,0,{"$f":"(((AB71*Database!$U$3)+(AC71*Database!$V$3)+(AD71*Database!$W$3))*AA71)","v":0},200,{"$f":"COUNTIFS(Output!$O$5:$O$36,Indoor!A71,Output!$N$6:$N$37,Indoor!AF71)","v":0},0,0,0,{"$f":"(((AH71*Database!$U$3)+(AI71*Database!$V$3)+(AJ71*Database!$W$3))*AG71)","v":0},200,{"$f":"COUNTIFS(Output!$Q$5:$Q$36,Indoor!A71,Output!$P$6:$P$37,Indoor!AL71)","v":0},0,0,0,{"$f":"(((AN71*Database!$U$3)+(AO71*Database!$V$3)+(AP71*Database!$W$3))*AM71)","v":0},200,{"$f":"COUNTIFS(Output!$S$5:$S$36,Indoor!A71,Output!$R$6:$R$37,Indoor!AR71)","v":0},0,0,0,{"$f":"(((AT71*Database!$U$3)+(AU71*Database!$V$3)+(AV71*Database!$W$3))*AS71)","v":0},200,{"$f":"COUNTIFS(Output!$U$5:$U$36,Indoor!A71,Output!$T$6:$T$37,Indoor!AX71)","v":0},0,0,0,{"$f":"(((AZ71*Database!$U$3)+(BA71*Database!$V$3)+(BB71*Database!$W$3))*AY71)","v":0},200,{"$f":"COUNTIFS(Output!$W$5:$W$36,Indoor!A71,Output!$V$6:$V$37,Indoor!BD71)","v":0},0,0,0,{"$f":"(((BF71*Database!$U$3)+(BG71*Database!$V$3)+(BH71*Database!$W$3))*BE71)","v":0},0]
[{"$f":"Lists!$F$8","v":"Concealed Floor"},250,{"$f":"COUNTIFS(Output!$E$5:$E$36,Indoor!A72,Output!$D$6:$D$37,Indoor!B72)","v":0},null,null,0,{"$f":"(((D72*Database!$U$3)+(E72*Database!$V$3)+(F72*Database!$W$3))*C72)","v":0},250,{"$f":"COUNTIFS(Output!$G$5:$G$36,Indoor!A72,Output!$F$6:$F$37,Indoor!H72)","v":0},0,0,0,{"$f":"(((J72*Database!$U$3)+(K72*Database!$V$3)+(L72*Database!$W$3))*I72)","v":0},250,{"$f":"COUNTIFS(Output!$I$5:$I$36,Indoor!A72,Output!$H$6:$H$37,Indoor!N72)","v":0},0,0,0,{"$f":"(((P72*Database!$U$3)+(Q72*Database!$V$3)+(R72*Database!$W$3))*O72)","v":0},250,{"$f":"COUNTIFS(Output!$K$5:$K$36,Indoor!A72,Output!$J$6:$J$37,Indoor!T72)","v":0},0,0,0,{"$f":"(((V72*Database!$U$3)+(W72*Database!$V$3)+(X72*Database!$W$3))*U72)","v":0},250,{"$f":"COUNTIFS(Output!$M$5:$M$36,Indoor!A72,Output!$L$6:$L$37,Indoor!Z72)","v":0},0,0,0,{"$f":"(((AB72*Database!$U$3)+(AC72*Database!$V$3)+(AD72*Database!$W$3))*AA72)","v":0},250,{"$f":"COUNTIFS(Output!$O$5:$O$36,Indoor!A72,Output!$N$6:$N$37,Indoor!AF72)","v":0},0,0,0,{"$f":"(((AH72*Database!$U$3)+(AI72*Database!$V$3)+(AJ72*Database!$W$3))*AG72)","v":0},250,{"$f":"COUNTIFS(Output!$Q$5:$Q$36,Indoor!A72,Output!$P$6:$P$37,Indoor!AL72)","v":0},0,0,0,{"$f":"(((AN72*Database!$U$3)+(AO72*Database!$V$3)+(AP72*Database!$W$3))*AM72)","v":0},250,{"$f":"COUNTIFS(Output!$S$5:$S$36,Indoor!A72,Output!$R$6:$R$37,Indoor!AR72)","v":0},0,0,0,{"$f":"(((AT72*Database!$U$3)+(AU72*Database!$V$3)+(AV72*Database!$W$3))*AS72)","v":0},250,{"$f":"COUNTIFS(Output!$U$5:$U$36,Indoor!A72,Output!$T$6:$T$37,Indoor!AX72)","v":0},0,0,0,{"$f":"(((AZ72*Database!$U$3)+(BA72*Database!$V$3)+(BB72*Database!$W$3))*AY72)","v":0},250,{"$f":"COUNTIFS(Output!$W$5:$W$36,Indoor!A72,Output!$V$6:$V$37,Indoor!BD72)","v":0},0,0,0,{"$f":"(((BF72*Database!$U$3)+(BG72*Database!$V$3)+(BH72*Database!$W$3))*BE72)","v":0},0]
[null,null,{"$f":"SUM(C62:C72)","v":0},null,null,null,null,null,{"$f":"SUM(I62:I72)","v":0},null,null,null,null,null,{"$f":"SUM(O62:O72)","v":0},null,null,null,null,null,{"$f":"SUM(U62:U72)","v":0},null,null,null,null,null,{"$f":"SUM(AA62:AA72)","v":0},null,null,null,null,null,{"$f":"SUM(AG62:AG72)","v":0},null,null,null,null,null,{"$f":"SUM(AM62:AM72)","v":0},null,null,null,null,null,{"$f":"SUM(AS62:AS72)","v":0},null,null,null,null,null,{"$f":"SUM(AY62:AY72)","v":0},null,null,null,null,null,{"$f":"SUM(BE62:BE72)","v":0},null,null,null,null,{"$f":"SUM(BJ2:BJ72)","v":3}]
["NEW IDU",1,{"$f":"F74+G74","v":5804.6905000000006},null,null,{"$f":"VLOOKUP(Output!D5,Database!$A$8:$AR$53,20,FALSE)/VLOOKUP(Output!D5,Database!$A$8:$AR$53,41,FALSE)","v":5442.01},{"$f":"SUM(G2:G72)","v":362.68050000000005},2,{"$f":"L74+M74","v":{"$error":"#DIV/0!"}},null,null,{"$f":"IFERROR(VLOOKUP(Output!F5,Database!$A$8:$AR$53,20,FALSE),0)/IFERROR(VLOOKUP(Output!F5,Database!$A$8:$AR$53,41,FALSE),0)","v":{"$error":"#DIV/0!"}},{"$f":"SUM(M2:M72)","v":0},3,{"$f":"R74+S74","v":{"$error":"#DIV/0!"}},null,null,{"$f":"IFERROR(VLOOKUP(Output!H5,Database!$A$8:$AR$53,20,FALSE),0)/IFERROR(VLOOKUP(Output!H5,Database!$A$8:$AR$53,41,FALSE),0)","v":{"$error":"#DIV/0!"}},0,4,{"$f":"X74+Y74","v":{"$error":"#DIV/0!"}},null,null,{"$f":"IFERROR(VLOOKUP(Output!J5,Database!$A$8:$AR$53,20,FALSE),0)/IFERROR(VLOOKUP(Output!J5,Database!$A$8:$AR$53,41,FALSE),0)","v":{"$error":"#DIV/0!"}},0,5,{"$f":"AD74+AE74","v":{"$error":"#DIV/0!"}},null,null,{"$f":"IFERROR(VLOOKUP(Output!L5,Database!$A$8:$AR$53,20,FALSE),0)/IFERROR(VLOOKUP(Output!L5,Database!$A$8:$AR$53,41,FALSE),0)","v":{"$error":"#DIV/0!"}},0,6,{"$f":"AJ74+AK74","v":{"$error":"#DIV/0!"}},null,null,{"$f":"IFERROR(VLOOKUP(Output!N5,Database!$A$8:$AR$53,20,FALSE),0)/IFERROR(VLOOKUP(Output!N5,Database!$A$8:$AR$53,41,FALSE),0)","v":{"$error":"#DIV/0!"}},0,7,{"$f":"AP74+AQ74","v":{"$error":"#DIV/0!"}},null,null,{"$f":"IFERROR(VLOOKUP(Output!P5,Database!$A$8:$AR$53,20,FALSE),0)/IFERROR(VLOOKUP(Output!P5,Database!$A$8:$AR$53,41,FALSE),0)","v":{"$error":"#DIV/0!"}},0,8,{"$f":"AV74+AW74","v":{"$error":"#DIV/0!"}},null,null,{"$f":"IFERROR(VLOOKUP(Output!R5,Database!$A$8:$AR$53,20,FALSE),0)/IFERROR(VLOOKUP(Output!R5,Database!$A$8:$AR$53,41,FALSE),0)","v":{"$error":"#DIV/0!"}},0,9,{"$f":"BB74+BC74","v":{"$error":"#DIV/0!"}},null,null,{"$f":"IFERROR(VLOOKUP(Output!T5,Database!$A$8:$AR$53,20,FALSE),0)/IFERROR(VLOOKUP(Output!T5,Database!$A$8:$AR$53,41,FALSE),0)","v":{"$error":"#DIV/0!"}},0,10,{"$f":"BH74+BI74","v":{"$error":"#DIV/0!"}},null,null,{"$f":"IFERROR(VLOOKUP(Output!V5,Database!$A$8:$AR$53,20,FALSE),0)/IFERROR(VLOOKUP(Output!V5,Database!$A$8:$AR$53,41,FALSE),0)","v":{"$error":"#DIV/0!"}},0]
["FXAQ","Outdoor Unit 1",null,"Cooling","Heating","Inter.","Tot PI","Outdoor Unit 2",null,"Cooling","Heating","Inter.","Tot PI","Outdoor Unit 3",null,"Cooling","Heating","Inter.","Tot PI","Outdoor Unit 4",null,"Cooling","Heating","Inter.","Tot PI","Outdoor Unit 5",null,"Cooling","Heating","Inter.","Tot PI","Outdoor Unit 6",null,"Cooling","Heating","Inter.","Tot PI","Outdoor Unit 7",null,"Cooling","Heating","Inter.","Tot PI","Outdoor Unit 8",null,"Cooling","Heating","Inter.","Tot PI","Outdoor Unit 9",null,"Cooling","Heating","Inter.","Tot PI","Outdoor Unit 10",null,"Cooling","Heating","Inter.","Tot PI","Total"]
[{"$f":"A2","v":"Wall Mounted"},20,{"$f":"COUNTIFS(Output!$E$5:$E$36,Indoor!A76,Output!$D$6:$D$37,Indoor!B76)","v":0},1.9E-2,2.9000000000000001E-2,{"$f":"(D76+E76)/2","v":2.4E-2},{"$f":"(((D76*Database!$U$3)+(E76*Database!$V$3)+(F76*Database!$W$3))*C76)","v":0},20,{"$f":"COUNTIFS(Output!$G$5:$G$36,Indoor!A76,Output!$F$6:$F$37,Indoor!H76)","v":0},{"$f":"D76","v":1.9E-2},{"$f":"E76","v":2.9000000000000001E-2},{"$f":"F76","v":2.4E-2},{"$f":"(((J76*Database!$U$3)+(K76*Database!$V$3)+(L76*Database!$W$3))*I76)","v":0},20,{"$f":"COUNTIFS(Output!$I$5:$I$36,Indoor!A76,Output!$H$6:$H$37,Indoor!N76)","v":0},{"$f":"D76","v":1.9E-2},{"$f":"E76","v":2.9000000000000001E-2},{"$f":"F76","v":2.4E-2},{"$f":"(((P76*Database!$U$3)+(Q76*Database!$V$3)+(R76*Database!$W$3))*O76)","v":0},20,{"$f":"COUNTIFS(Output!$K$5:$K$36,Indoor!A76,Output!$J$6:$J$37,Indoor!T76)","v":0},{"$f":"D76","v":1.9E-2},{"$f":"E76","v":2.9000000000000001E-2},{"$f":"F76","v":2.4E-2},{"$f":"(((V76*Database!$U$3)+(W76*Database!$V$3)+(X76*Database!$W$3))*U76)","v":0},20,{"$f":"COUNTIFS(Output!$M$5:$M$36,Indoor!A76,Output!$L$6:$L$37,Indoor!Z76)","v":0},{"$f":"D76","v":1.9E-2},{"$f":"E76","v":2.9000000000000001E-2},{"$f":"F76","v":2.4E-2},{"$f":"(((AB76*Database!$U$3)+(AC76*Database!$V$3)+(AD76*Database!$W$3))*AA76)","v":0},20,{"$f":"COUNTIFS(Output!$O$5:$O$36,Indoor!A76,Output!$N$6:$N$37,Indoor!AF76)","v":0},{"$f":"D76","v":1.9E-2},{"$f":"E76","v":2.9000000000000001E-2},{"$f":"F76","v":2.4E-2},{"$f":"(((AH76*Database!$U$3)+(AI76*Database!$V$3)+(AJ76*Database!$W$3))*AG76)","v":0},20,{"$f":"COUNTIFS(Output!$Q$5:$Q$36,Indoor!A76,Output!$P$6:$P$37,Indoor!AL76)","v":0},{"$f":"D76","v":1.9E-2},{"$f":"E76","v":2.9000000000000001E-2},{"$f":"F76","v":2.4E-2},{"$f":"(((AN76*Database!$U$3)+(AO76*Database!$V$3)+(AP76*Database!$W$3))*AM76)","v":0},20,{"$f":"COUNTIFS(Output!$S$5:$S$36,Indoor!A76,Output!$R$6:$R$37,Indoor!AR76)","v":0},{"$f":"D76","v":1.9E-2},{"$f":"E76","v":2.9000000000000001E-2},{"$f":"F76","v":2.4E-2},{"$f":"(((AT76*Database!$U$3)+(AU76*Database!$V$3)+(AV76*Database!$W$3))*AS76)","v":0},20,{"$f":"COUNTIFS(Output!$U$5:$U$36,Indoor!A76,Output!$T$6:$T$37,Indoor!AX76)","v":0},{"$f":"D76","v":1.9E-2},{"$f":"E76","v":2.9000000000000001E-2},{"$f":"F76","v":2.4E-2},{"$f":"(((AZ76*Database!$U$3)+(BA76*Database!$V$3)+(BB76*Database!$W$3))*AY76)","v":0},20,{"$f":"COUNTIFS(Output!$W$5:$W$36,Indoor!A76,Output!$V$6:$V$37,Indoor!BD76)","v":0},{"$f":"D76","v":1.9E-2},{"$f":"E76","v":2.9000000000000001E-2},{"$f":"F76","v":2.4E-2},{"$f":"(((BF76*Database!$U$3)+(BG76*Database!$V$3)+(BH76*Database!$W$3))*BE76)","v":0},{"$f":"SUM(BE76+AY76+AS76+AM76+AG76+AA76+U76+O76+I76+C76)","v":0}]
[{"$f":"A3","v":"Wall Mounted"},25,{"$f":"COUNTIFS(Output!$E$5:$E$36,Indoor!A77,Output!$D$6:$D$37,Indoor!B77)","v":0},2.8000000000000001E-2,3.4000000000000002E-2,{"$f":"(D77+E77)/2","v":3.1E-2},{"$f":"(((D77*Database!$U$3)+(E77*Database!$V$3)+(F77*Database!$W$3))*C77)","v":0},25,{"$f":"COUNTIFS(Output!$G$5:$G$36,Indoor!A77,Output!$F$6:$F$37,Indoor!H77)","v":0},{"$f":"D77","v":2.8000000000000001E-2},{"$f":"E77","v":3.4000000000000002E-2},{"$f":"F77","v":3.1E-2},{"$f":"(((J77*Database!$U$3)+(K77*Database!$V$3)+(L77*Database!$W$3))*I77)","v":0},25,{"$f":"COUNTIFS(Output!$I$5:$I$36,Indoor!A77,Output!$H$6:$H$37,Indoor!N77)","v":0},{"$f":"D77","v":2.8000000000000001E-2},3.4000000000000002E-2,3.1E-2,{"$f":"(((P77*Database!$U$3)+(Q77*Database!$V$3)+(R77*Database!$W$3))*O77)","v":0},25,{"$f":"COUNTIFS(Output!$K$5:$K$36,Indoor!A77,Output!$J$6:$J$37,Indoor!T77)","v":0},{"$f":"D77","v":2.8000000000000001E-2},3.4000000000000002E-2,3.1E-2,{"$f":"(((V77*Database!$U$3)+(W77*Database!$V$3)+(X77*Database!$W$3))*U77)","v":0},25,{"$f":"COUNTIFS(Output!$M$5:$M$36,Indoor!A77,Output!$L$6:$L$37,Indoor!Z77)","v":0},{"$f":"D77","v":2.8000000000000001E-2},3.4000000000000002E-2,3.1E-2,{"$f":"(((AB77*Database!$U$3)+(AC77*Database!$V$3)+(AD77*Database!$W$3))*AA77)","v":0},25,{"$f":"COUNTIFS(Output!$O$5:$O$36,Indoor!A77,Output!$N$6:$N$37,Indoor!AF77)","v":0},{"$f":"D77","v":2.8000000000000001E-2},3.4000000000000002E-2,3.1E-2,{"$f":"(((AH77*Database!$U$3)+(AI77*Database!$V$3)+(AJ77*Database!$W$3))*AG77)","v":0},25,{"$f":"COUNTIFS(Output!$Q$5:$Q$36,Indoor!A77,Output!$P$6:$P$37,Indoor!AL77)","v":0},{"$f":"D77","v":2.8000000000000001E-2},3.4000000000000002E-2,3.1E-2,{"$f":"(((AN77*Database!$U$3)+(AO77*Database!$V$3)+(AP77*Database!$W$3))*AM77)","v":0},25,{"$f":"COUNTIFS(Output!$S$5:$S$36,Indoor!A77,Output!$R$6:$R$37,Indoor!AR77)","v":0},{"$f":"D77","v":2.8000000000000001E-2},3.4000000000000002E-2,3.1E-2,{"$f":"(((AT77*Database!$U$3)+(AU77*Database!$V$3)+(AV77*Database!$W$3))*AS77)","v":0},25,{"$f":"COUNTIFS(Output!$U$5:$U$36,Indoor!A77,Output!$T$6:$T$37,Indoor!AX77)","v":0},{"$f":"D77","v":2.8000000000000001E-2},3.4000000000000002E-2,3.1E-2,{"$f":"(((AZ77*Database!$U$3)+(BA77*Database!$V$3)+(BB77*Database!$W$3))*AY77)","v":0},25,{"$f":"COUNTIFS(Output!$W$5:$W$36,Indoor!A77,Output!$V$6:$V$37,Indoor!BD77)","v":0},{"$f":"D77","v":2.8000000000000001E-2},{"$f":"E77","v":3.4000000000000002E-2},{"$f":"F77","v":3.1E-2},{"$f":"(((BF77*Database!$U$3)+(BG77*Database!$V$3)+(BH77*Database!$W$3))*BE77)","v":0},0]
["Wall Mounted",31.25,{"$f":"COUNTIFS(Output!$E$5:$E$36,Indoor!A78,Output!$D$6:$D$37,Indoor!B78)","v":0},0.03,3.5000000000000003E-2,3.2500000000000001E-2,{"$f":"(((D78*Database!$U$3)+(E78*Database!$V$3)+(F78*Database!$W$3))*C78)","v":0},31.25,{"$f":"COUNTIFS(Output!$G$5:$G$36,Indoor!A78,Output!$F$6:$F$37,Indoor!H78)","v":0},0.03,3.5000000000000003E-2,3.2500000000000001E-2,{"$f":"(((J78*Database!$U$3)+(K78*Database!$V$3)+(L78*Database!$W$3))*I78)","v":0},31.25,{"$f":"COUNTIFS(Output!$I$5:$I$36,Indoor!A78,Output!$H$6:$H$37,Indoor!N78)","v":0},0.03,3.5000000000000003E-2,3.2500000000000001E-2,{"$f":"(((P78*Database!$U$3)+(Q78*Database!$V$3)+(R78*Database!$W$3))*O78)","v":0},31.25,{"$f":"COUNTIFS(Output!$K$5:$K$36,Indoor!A78,Output!$J$6:$J$37,Indoor!T78)","v":0},0.03,3.5000000000000003E-2,3.2500000000000001E-2,{"$f":"(((V78*Database!$U$3)+(W78*Database!$V$3)+(X78*Database!$W$3))*U78)","v":0},31.25,{"$f":"COUNTIFS(Output!$M$5:$M$36,Indoor!A78,Output!$L$6:$L$37,Indoor!Z78)","v":0},0.03,3.5000000000000003E-2,3.2500000000000001E-2,{"$f":"(((AB78*Database!$U$3)+(AC78*Database!$V$3)+(AD78*Database!$W$3))*AA78)","v":0},31.25,{"$f":"COUNTIFS(Output!$O$5:$O$36,Indoor!A78,Output!$N$6:$N$37,Indoor!AF78)","v":0},0.03,3.5000000000000003E-2,3.2500000000000001E-2,{"$f":"(((AH78*Database!$U$3)+(AI78*Database!$V$3)+(AJ78*Database!$W$3))*AG78)","v":0},31.25,{"$f":"COUNTIFS(Output!$Q$5:$Q$36,Indoor!A78,Output!$P$6:$P$37,Indoor!AL78)","v":0},0.03,3.5000000000000003E-2,3.2500000000000001E-2,{"$f":"(((AN78*Database!$U$3)+(AO78*Database!$V$3)+(AP78*Database!$W$3))*AM78)","v":0},31.25,{"$f":"COUNTIFS(Output!$S$5:$S$36,Indoor!A78,Output!$R$6:$R$37,Indoor!AR78)","v":0},0.03,3.5000000000000003E-2,3.2500000000000001E-2,{"$f":"(((AT78*Database!$U$3)+(AU78*Database!$V$3)+(AV78*Database!$W$3))*AS78)","v":0},31.25,{"$f":"COUNTIFS(Output!$U$5:$U$36,Indoor!A78,Output!$T$6:$T$37,Indoor!AX78)","v":0},0.03,3.5000000000000003E-2,3.2500000000000001E-2,{"$f":"(((AZ78*Database!$U$3)+(BA78*Database!$V$3)+(BB78*Database!$W$3))*AY78)","v":0},31.25,{"$f":"COUNTIFS(Output!$W$5:$W$36,Indoor!A78,Output!$V$6:$V$37,Indoor!BD78)","v":0},0.03,3.5000000000000003E-2,3.2500000000000001E-2,{"$f":"(((BF78*Database!$U$3)+(BG78*Database!$V$3)+(BH78*Database!$W$3))*BE78)","v":0},0]
["Wall Mounted",40,{"$f":"COUNTIFS(Output!$E$5:$E$36,Indoor!A79,Output!$D$6:$D$37,Indoor!B79)","v":0},0.02,0.02,0.02,{"$f":"(((D79*Database!$U$3)+(E79*Database!$V$3)+(F79*Database!$W$3))*C79)","v":0},40,{"$f":"COUNTIFS(Output!$G$5:$G$36,Indoor!A79,Output!$F$6:$F$37,Indoor!H79)","v":0},0.02,0.02,0.02,{"$f":"(((J79*Database!$U$3)+(K79*Database!$V$3)+(L79*Database!$W$3))*I79)","v":0},40,{"$f":"COUNTIFS(Output!$I$5:$I$36,Indoor!A79,Output!$H$6:$H$37,Indoor!N79)","v":0},0.02,0.02,0.02,{"$f":"(((P79*Database!$U$3)+(Q79*Database!$V$3)+(R79*Database!$W$3))*O79)","v":0},40,{"$f":"COUNTIFS(Output!$K$5:$K$36,Indoor!A79,Output!$J$6:$J$37,Indoor!T79)","v":0},0.02,0.02,0.02,{"$f":"(((V79*Database!$U$3)+(W79*Database!$V$3)+(X79*Database!$W$3))*U79)","v":0},40,{"$f":"COUNTIFS(Output!$M$5:$M$36,Indoor!A79,Output!$L$6:$L$37,Indoor!Z79)","v":0},0.02,0.02,0.02,{"$f":"(((AB79*Database!$U$3)+(AC79*Database!$V$3)+(AD79*Database!$W$3))*AA79)","v":0},40,{"$f":"COUNTIFS(Output!$O$5:$O$36,Indoor!A79,Output!$N$6:$N$37,Indoor!AF79)","v":0},0.02,0.02,0.02,{"$f":"(((AH79*Database!$U$3)+(AI79*Database!$V$3)+(AJ79*Database!$W$3))*AG79)","v":0},40,{"$f":"COUNTIFS(Output!$Q$5:$Q$36,Indoor!A79,Output!$P$6:$P$37,Indoor!AL79)","v":0},0.02,0.02,0.02,{"$f":"(((AN79*Database!$U$3)+(AO79*Database!$V$3)+(AP79*Database!$W$3))*AM79)","v":0},40,{"$f":"COUNTIFS(Output!$S$5:$S$36,Indoor!A79,Output!$R$6:$R$37,Indoor!AR79)","v":0},0.02,0.02,0.02,{"$f":"(((AT79*Database!$U$3)+(AU79*Database!$V$3)+(AV79*Database!$W$3))*AS79)","v":0},40,{"$f":"COUNTIFS(Output!$U$5:$U$36,Indoor!A79,Output!$T$6:$T$37,Indoor!AX79)","v":0},0.02,0.02,0.02,{"$f":"(((AZ79*Database!$U$3)+(BA79*Database!$V$3)+(BB79*Database!$W$3))*AY79)","v":0},40,{"$f":"COUNTIFS(Output!$W$5:$W$36,Indoor!A79,Output!$V$6:$V$37,Indoor!BD79)","v":0},0.02,0.02,0.02,{"$f":"(((BF79*Database!$U$3)+(BG79*Database!$V$3)+(BH79*Database!$W$3))*BE79)","v":0},0]
["Wall Mounted",50,{"$f":"COUNTIFS(Output!$E$5:$E$36,Indoor!A80,Output!$D$6:$D$37,Indoor!B80)","v":0},3.3000000000000002E-2,3.9E-2,3.6000000000000004E-2,{"$f":"(((D80*Database!$U$3)+(E80*Database!$V$3)+(F80*Database!$W$3))*C80)","v":0},50,{"$f":"COUNTIFS(Output!$G$5:$G$36,Indoor!A80,Output!$F$6:$F$37,Indoor!H80)","v":0},3.3000000000000002E-2,3.9E-2,3.6000000000000004E-2,{"$f":"(((J80*Database!$U$3)+(K80*Database!$V$3)+(L80*Database!$W$3))*I80)","v":0},50,{"$f":"COUNTIFS(Output!$I$5:$I$36,Indoor!A80,Output!$H$6:$H$37,Indoor!N80)","v":0},3.3000000000000002E-2,3.9E-2,3.6000000000000004E-2,{"$f":"(((P80*Database!$U$3)+(Q80*Database!$V$3)+(R80*Database!$W$3))*O80)","v":0},50,{"$f":"COUNTIFS(Output!$K$5:$K$36,Indoor!A80,Output!$J$6:$J$37,Indoor!T80)","v":0},3.3000000000000002E-2,3.9E-2,3.6000000000000004E-2,{"$f":"(((V80*Database!$U$3)+(W80*Database!$V$3)+(X80*Database!$W$3))*U80)","v":0},50,{"$f":"COUNTIFS(Output!$M$5:$M$36,Indoor!A80,Output!$L$6:$L$37,Indoor!Z80)","v":0},3.3000000000000002E-2,3.9E-2,3.6000000000000004E-2,{"$f":"(((AB80*Database!$U$3)+(AC80*Database!$V$3)+(AD80*Database!$W$3))*AA80)","v":0},50,{"$f":"COUNTIFS(Output!$O$5:$O$36,Indoor!A80,Output!$N$6:$N$37,Indoor!AF80)","v":0},3.3000000000000002E-2,3.9E-2,3.6000000000000004E-2,{"$f":"(((AH80*Database!$U$3)+(AI80*Database!$V$3)+(AJ80*Database!$W$3))*AG80)","v":0},50,{"$f":"COUNTIFS(Output!$Q$5:$Q$36,Indoor!A80,Output!$P$6:$P$37,Indoor!AL80)","v":0},3.3000000000000002E-2,3.9E-2,3.6000000000000004E-2,{"$f":"(((AN80*Database!$U$3)+(AO80*Database!$V$3)+(AP80*Database!$W$3))*AM80)","v":0},50,{"$f":"COUNTIFS(Output!$S$5:$S$36,Indoor!A80,Output!$R$6:$R$37,Indoor!AR80)","v":0},3.3000000000000002E-2,3.9E-2,3.6000000000000004E-2,{"$f":"(((AT80*Database!$U$3)+(AU80*Database!$V$3)+(AV80*Database!$W$3))*AS80)","v":0},50,{"$f":"COUNTIFS(Output!$U$5:$U$36,Indoor!A80,Output!$T$6:$T$37,Indoor!AX80)","v":0},3.3000000000000002E-2,3.9E-2,3.6000000000000004E-2,{"$f":"(((AZ80*Database!$U$3)+(BA80*Database!$V$3)+(BB80*Database!$W$3))*AY80)","v":0},50,{"$f":"COUNTIFS(Output!$W$5:$W$36,Indoor!A80,Output!$V$6:$V$37,Indoor!BD80)","v":0},3.3000000000000002E-2,3.9E-2,3.6000000000000004E-2,{"$f":"(((BF80*Database!$U$3)+(BG80*Database!$V$3)+(BH80*Database!$W$3))*BE80)","v":0},0]
["Wall Mounted",63,{"$f":"COUNTIFS(Output!$E$5:$E$36,Indoor!A81,Output!$D$6:$D$37,Indoor!B81)","v":0},0.05,0.06,5.5E-2,{"$f":"(((D81*Database!$U$3)+(E81*Database!$V$3)+(F81*Database!$W$3))*C81)","v":0},63,{"$f":"COUNTIFS(Output!$G$5:$G$36,Indoor!A81,Output!$F$6:$F$37,Indoor!H81)","v":0},0.05,0.06,5.5E-2,{"$f":"(((J81*Database!$U$3)+(K81*Database!$V$3)+(L81*Database!$W$3))*I81)","v":0},63,{"$f":"COUNTIFS(Output!$I$5:$I$36,Indoor!A81,Output!$H$6:$H$37,Indoor!N81)","v":0},0.05,0.06,5.5E-2,{"$f":"(((P81*Database!$U$3)+(Q81*Database!$V$3)+(R81*Database!$W$3))*O81)","v":0},63,{"$f":"COUNTIFS(Output!$K$5:$K$36,Indoor!A81,Output!$J$6:$J$37,Indoor!T81)","v":0},0.05,0.06,5.5E-2,{"$f":"(((V81*Database!$U$3)+(W81*Database!$V$3)+(X81*Database!$W$3))*U81)","v":0},63,{"$f":"COUNTIFS(Output!$M$5:$M$36,Indoor!A81,Output!$L$6:$L$37,Indoor!Z81)","v":0},0.05,0.06,5.5E-2,{"$f":"(((AB81*Database!$U$3)+(AC81*Database!$V$3)+(AD81*Database!$W$3))*AA81)","v":0},63,{"$f":"COUNTIFS(Output!$O$5:$O$36,Indoor!A81,Output!$N$6:$N$37,Indoor!AF81)","v":0},0.05,0.06,5.5E-2,{"$f":"(((AH81*Database!$U$3)+(AI81*Database!$V$3)+(AJ81*Database!$W$3))*AG81)","v":0},63,{"$f":"COUNTIFS(Output!$Q$5:$Q$36,Indoor!A81,Output!$P$6:$P$37,Indoor!AL81)","v":0},0.05,0.06,5.5E-2,{"$f":"(((AN81*Database!$U$3)+(AO81*Database!$V$3)+(AP81*Database!$W$3))*AM81)","v":0},63,{"$f":"COUNTIFS(Output!$S$5:$S$36,Indoor!A81,Output!$R$6:$R$37,Indoor!AR81)","v":0},0.05,0.06,5.5E-2,{"$f":"(((AT81*Database!$U$3)+(AU81*Database!$V$3)+(AV81*Database!$W$3))*AS81)","v":0},63,{"$f":"COUNTIFS(Output!$U$5:$U$36,Indoor!A81,Output!$T$6:$T$37,Indoor!AX81)","v":0},0.05,0.06,5.5E-2,{"$f":"(((AZ81*Database!$U$3)+(BA81*Database!$V$3)+(BB81*Database!$W$3))*AY81)","v":0},63,{"$f":"COUNTIFS(Output!$W$5:$W$36,Indoor!A81,Output!$V$6:$V$37,Indoor!BD81)","v":0},0.05,0.06,5.5E-2,{"$f":"(((BF81*Database!$U$3)+(BG81*Database!$V$3)+(BH81*Database!$W$3))*BE81)","v":0},0]
["Wall Mounted",80,{"$f":"COUNTIFS(Output!$E$5:$E$36,Indoor!A82,Output!$D$6:$D$37,Indoor!B82)","v":0},null,null,0,{"$f":"(((D82*Database!$U$3)+(E82*Database!$V$3)+(F82*Database!$W$3))*C82)","v":0},80,{"$f":"COUNTIFS(Output!$G$5:$G$36,Indoor!A82,Output!$F$6:$F$37,Indoor!H82)","v":0},0,0,0,{"$f":"(((J82*Database!$U$3)+(K82*Database!$V$3)+(L82*Database!$W$3))*I82)","v":0},80,{"$f":"COUNTIFS(Output!$I$5:$I$36,Indoor!A82,Output!$H$6:$H$37,Indoor!N82)","v":0},0,0,0,{"$f":"(((P82*Database!$U$3)+(Q82*Database!$V$3)+(R82*Database!$W$3))*O82)","v":0},80,{"$f":"COUNTIFS(Output!$K$5:$K$36,Indoor!A82,Output!$J$6:$J$37,Indoor!T82)","v":0},0,0,0,{"$f":"(((V82*Database!$U$3)+(W82*Database!$V$3)+(X82*Database!$W$3))*U82)","v":0},80,{"$f":"COUNTIFS(Output!$M$5:$M$36,Indoor!A82,Output!$L$6:$L$37,Indoor!Z82)","v":0},0,0,0,{"$f":"(((AB82*Database!$U$3)+(AC82*Database!$V$3)+(AD82*Database!$W$3))*AA82)","v":0},80,{"$f":"COUNTIFS(Output!$O$5:$O$36,Indoor!A82,Output!$N$6:$N$37,Indoor!AF82)","v":0},0,0,0,{"$f":"(((AH82*Database!$U$3)+(AI82*Database!$V$3)+(AJ82*Database!$W$3))*AG82)","v":0},80,{"$f":"COUNTIFS(Output!$Q$5:$Q$36,Indoor!A82,Output!$P$6:$P$37,Indoor!AL82)","v":0},0,0,0,{"$f":"(((AN82*Database!$U$3)+(AO82*Database!$V$3)+(AP82*Database!$W$3))*AM82)","v":0},80,{"$f":"COUNTIFS(Output!$S$5:$S$36,Indoor!A82,Output!$R$6:$R$37,Indoor!AR82)","v":0},0,0,0,{"$f":"(((AT82*Database!$U$3)+(AU82*Database!$V$3)+(AV82*Database!$W$3))*AS82)","v":0},80,{"$f":"COUNTIFS(Output!$U$5:$U$36,Indoor!A82,Output!$T$6:$T$37,Indoor!AX82)","v":0},0,0,0,{"$f":"(((AZ82*Database!$U$3)+(BA82*Database!$V$3)+(BB82*Database!$W$3))*AY82)","v":0},80,{"$f":"COUNTIFS(Output!$W$5:$W$36,Indoor!A82,Output!$V$6:$V$37,Indoor!BD82)","v":0},0,0,0,{"$f":"(((BF82*Database!$U$3)+(BG82*Database!$V$3)+(BH82*Database!$W$3))*BE82)","v":0},0]
["Wall Mounted",100,{"$f":"COUNTIFS(Output!$E$5:$E$36,Indoor!A83,Output!$D$6:$D$37,Indoor!B83)","v":0},null,null,0,{"$f":"(((D83*Database!$U$3)+(E83*Database!$V$3)+(F83*Database!$W$3))*C83)","v":0},100,{"$f":"COUNTIFS(Output!$G$5:$G$36,Indoor!A83,Output!$F$6:$F$37,Indoor!H83)","v":0},0,0,0,{"$f":"(((J83*Database!$U$3)+(K83*Database!$V$3)+(L83*Database!$W$3))*I83)","v":0},100,{"$f":"COUNTIFS(Output!$I$5:$I$36,Indoor!A83,Output!$H$6:$H$37,Indoor!N83)","v":0},0,0,0,{"$f":"(((P83*Database!$U$3)+(Q83*Database!$V$3)+(R83*Database!$W$3))*O83)","v":0},100,{"$f":"COUNTIFS(Output!$K$5:$K$36,Indoor!A83,Output!$J$6:$J$37,Indoor!T83)","v":0},0,0,0,{"$f":"(((V83*Database!$U$3)+(W83*Database!$V$3)+(X83*Database!$W$3))*U83)","v":0},100,{"$f":"COUNTIFS(Output!$M$5:$M$36,Indoor!A83,Output!$L$6:$L$37,Indoor!Z83)","v":0},0,0,0,{"$f":"(((AB83*Database!$U$3)+(AC83*Database!$V$3)+(AD83*Database!$W$3))*AA83)","v":0},100,{"$f":"COUNTIFS(Output!$O$5:$O$36,Indoor!A83,Output!$N$6:$N$37,Indoor!AF83)","v":0},0,0,0,{"$f":"(((AH83*Database!$U$3)+(AI83*Database!$V$3)+(AJ83*Database!$W$3))*AG83)","v":0},100,{"$f":"COUNTIFS(Output!$Q$5:$Q$36,Indoor!A83,Output!$P$6:$P$37,Indoor!AL83)","v":0},0,0,0,{"$f":"(((AN83*Database!$U$3)+(AO83*Database!$V$3)+(AP83*Database!$W$3))*AM83)","v":0},100,{"$f":"COUNTIFS(Output!$S$5:$S$36,Indoor!A83,Output!$R$6:$R$37,Indoor!AR83)","v":0},0,0,0,{"$f":"(((AT83*Database!$U$3)+(AU83*Database!$V$3)+(AV83*Database!$W$3))*AS83)","v":0},100,{"$f":"COUNTIFS(Output!$U$5:$U$36,Indoor!A83,Output!$T$6:$T$37,Indoor!AX83)","v":0},0,0,0,{"$f":"(((AZ83*Database!$U$3)+(BA83*Database!$V$3)+(BB83*Database!$W$3))*AY83)","v":0},100,{"$f":"COUNTIFS(Output!$W$5:$W$36,Indoor!A83,Output!$V$6:$V$37,Indoor!BD83)","v":0},0,0,0,{"$f":"(((BF83*Database!$U$3)+(BG83*Database!$V$3)+(BH83*Database!$W$3))*BE83)","v":0},0]
["Wall Mounted",125,{"$f":"COUNTIFS(Output!$E$5:$E$36,Indoor!A84,Output!$D$6:$D$37,Indoor!B84)","v":0},null,null,0,{"$f":"(((D84*Database!$U$3)+(E84*Database!$V$3)+(F84*Database!$W$3))*C84)","v":0},125,{"$f":"COUNTIFS(Output!$G$5:$G$36,Indoor!A84,Output!$F$6:$F$37,Indoor!H84)","v":0},0,0,0,{"$f":"(((J84*Database!$U$3)+(K84*Database!$V$3)+(L84*Database!$W$3))*I84)","v":0},125,{"$f":"COUNTIFS(Output!$I$5:$I$36,Indoor!A84,Output!$H$6:$H$37,Indoor!N84)","v":0},0,0,0,{"$f":"(((P84*Database!$U$3)+(Q84*Database!$V$3)+(R84*Database!$W$3))*O84)","v":0},125,{"$f":"COUNTIFS(Output!$K$5:$K$36,Indoor!A84,Output!$J$6:$J$37,Indoor!T84)","v":0},0,0,0,{"$f":"(((V84*Database!$U$3)+(W84*Database!$V$3)+(X84*Database!$W$3))*U84)","v":0},125,{"$f":"COUNTIFS(Output!$M$5:$M$36,Indoor!A84,Output!$L$6:$L$37,Indoor!Z84)","v":0},0,0,0,{"$f":"(((AB84*Database!$U$3)+(AC84*Database!$V$3)+(AD84*Database!$W$3))*AA84)","v":0},125,{"$f":"COUNTIFS(Output!$O$5:$O$36,Indoor!A84,Output!$N$6:$N$37,Indoor!AF84)","v":0},0,0,0,{"$f":"(((AH84*Database!$U$3)+(AI84*Database!$V$3)+(AJ84*Database!$W$3))*AG84)","v":0},125,{"$f":"COUNTIFS(Output!$Q$5:$Q$36,Indoor!A84,Output!$P$6:$P$37,Indoor!AL84)","v":0},0,0,0,{"$f":"(((AN84*Database!$U$3)+(AO84*Database!$V$3)+(AP84*Database!$W$3))*AM84)","v":0},125,{"$f":"COUNTIFS(Output!$S$5:$S$36,Indoor!A84,Output!$R$6:$R$37,Indoor!AR84)","v":0},0,0,0,{"$f":"(((AT84*Database!$U$3)+(AU84*Database!$V$3)+(AV84*Database!$W$3))*AS84)","v":0},125,{"$f":"COUNTIFS(Output!$U$5:$U$36,Indoor!A84,Output!$T$6:$T$37,Indoor!AX84)","v":0},0,0,0,{"$f":"(((AZ84*Database!$U$3)+(BA84*Database!$V$3)+(BB84*Database!$W$3))*AY84)","v":0},125,{"$f":"COUNTIFS(Output!$W$5:$W$36,Indoor!A84,Output!$V$6:$V$37,Indoor!BD84)","v":0},0,0,0,{"$f":"(((BF84*Database!$U$3)+(BG84*Database!$V$3)+(BH84*Database!$W$3))*BE84)","v":0},0]
["Wall Mounted",200,{"$f":"COUNTIFS(Output!$E$5:$E$36,Indoor!A85,Output!$D$6:$D$37,Indoor!B85)","v":0},null,null,0,{"$f":"(((D85*Database!$U$3)+(E85*Database!$V$3)+(F85*Database!$W$3))*C85)","v":0},200,{"$f":"COUNTIFS(Output!$G$5:$G$36,Indoor!A85,Output!$F$6:$F$37,Indoor!H85)","v":0},0,0,0,{"$f":"(((J85*Database!$U$3)+(K85*Database!$V$3)+(L85*Database!$W$3))*I85)","v":0},200,{"$f":"COUNTIFS(Output!$I$5:$I$36,Indoor!A85,Output!$H$6:$H$37,Indoor!N85)","v":0},0,0,0,{"$f":"(((P85*Database!$U$3)+(Q85*Database!$V$3)+(R85*Database!$W$3))*O85)","v":0},200,{"$f":"COUNTIFS(Output!$K$5:$K$36,Indoor!A85,Output!$J$6:$J$37,Indoor!T85)","v":0},0,0,0,{"$f":"(((V85*Database!$U$3)+(W85*Database!$V$3)+(X85*Database!$W$3))*U85)","v":0},200,{"$f":"COUNTIFS(Output!$M$5:$M$36,Indoor!A85,Output!$L$6:$L$37,Indoor!Z85)","v":0},0,0,0,{"$f":"(((AB85*Database!$U$3)+(AC85*Database!$V$3)+(AD85*Database!$W$3))*AA85)","v":0},200,{"$f":"COUNTIFS(Output!$O$5:$O$36,Indoor!A85,Output!$N$6:$N$37,Indoor!AF85)","v":0},0,0,0,{"$f":"(((AH85*Database!$U$3)+(AI85*Database!$V$3)+(AJ85*Database!$W$3))*AG85)","v":0},200,{"$f":"COUNTIFS(Output!$Q$5:$Q$36,Indoor!A85,Output!$P$6:$P$37,Indoor!AL85)","v":0},0,0,0,{"$f":"(((AN85*Database!$U$3)+(AO85*Database!$V$3)+(AP85*Database!$W$3))*AM85)","v":0},200,{"$f":"COUNTIFS(Output!$S$5:$S$36,Indoor!A85,Output!$R$6:$R$37,Indoor!AR85)","v":0},0,0,0,{"$f":"(((AT85*Database!$U$3)+(AU85*Database!$V$3)+(AV85*Database!$W$3))*AS85)","v":0},200,{"$f":"COUNTIFS(Output!$U$5:$U$36,Indoor!A85,Output!$T$6:$T$37,Indoor!AX85)","v":0},0,0,0,{"$f":"(((AZ85*Database!$U$3)+(BA85*Database!$V$3)+(BB85*Database!$W$3))*AY85)","v":0},200,{"$f":"COUNTIFS(Output!$W$5:$W$36,Indoor!A85,Output!$V$6:$V$37,Indoor!BD85)","v":0},0,0,0,{"$f":"(((BF85*Database!$U$3)+(BG85*Database!$V$3)+(BH85*Database!$W$3))*BE85)","v":0},0]
["Wall Mounted",250,{"$f":"COUNTIFS(Output!$E$5:$E$36,Indoor!A86,Output!$D$6:$D$37,Indoor!B86)","v":0},null,null,0,{"$f":"(((D86*Database!$U$3)+(E86*Database!$V$3)+(F86*Database!$W$3))*C86)","v":0},250,{"$f":"COUNTIFS(Output!$G$5:$G$36,Indoor!A86,Output!$F$6:$F$37,Indoor!H86)","v":0},0,0,0,{"$f":"(((J86*Database!$U$3)+(K86*Database!$V$3)+(L86*Database!$W$3))*I86)","v":0},250,{"$f":"COUNTIFS(Output!$I$5:$I$36,Indoor!A86,Output!$H$6:$H$37,Indoor!N86)","v":0},0,0,0,{"$f":"(((P86*Database!$U$3)+(Q86*Database!$V$3)+(R86*Database!$W$3))*O86)","v":0},250,{"$f":"COUNTIFS(Output!$K$5:$K$36,Indoor!A86,Output!$J$6:$J$37,Indoor!T86)","v":0},0,0,0,{"$f":"(((V86*Database!$U$3)+(W86*Database!$V$3)+(X86*Database!$W$3))*U86)","v":0},250,{"$f":"COUNTIFS(Output!$M$5:$M$36,Indoor!A86,Output!$L$6:$L$37,Indoor!Z86)","v":0},0,0,0,{"$f":"(((AB86*Database!$U$3)+(AC86*Database!$V$3)+(AD86*Database!$W$3))*AA86)","v":0},250,{"$f":"COUNTIFS(Output!$O$5:$O$36,Indoor!A86,Output!$N$6:$N$37,Indoor!AF86)","v":0},0,0,0,{"$f":"(((AH86*Database!$U$3)+(AI86*Database!$V$3)+(AJ86*Database!$W$3))*AG86)","v":0},250,{"$f":"COUNTIFS(Output!$Q$5:$Q$36,Indoor!A86,Output!$P$6:$P$37,Indoor!AL86)","v":0},0,0,0,{"$f":"(((AN86*Database!$U$3)+(AO86*Database!$V$3)+(AP86*Database!$W$3))*AM86)","v":0},250,{"$f":"COUNTIFS(Output!$S$5:$S$36,Indoor!A86,Output!$R$6:$R$37,Indoor!AR86)","v":0},0,0,0,{"$f":"(((AT86*Database!$U$3)+(AU86*Database!$V$3)+(AV86*Database!$W$3))*AS86)","v":0},250,{"$f":"COUNTIFS(Output!$U$5:$U$36,Indoor!A86,Output!$T$6:$T$37,Indoor!AX86)","v":0},0,0,0,{"$f":"(((AZ86*Database!$U$3)+(BA86*Database!$V$3)+(BB86*Database!$W$3))*AY86)","v":0},250,{"$f":"COUNTIFS(Output!$W$5:$W$36,Indoor!A86,Output!$V$6:$V$37,Indoor!BD86)","v":0},0,0,0,{"$f":"(((BF86*Database!$U$3)+(BG86*Database!$V$3)+(BH86*Database!$W$3))*BE86)","v":0},0]
["FXFQ",null,{"$f":"SUM(C76:C86)","v":0},null,null,null,null,null,{"$f":"SUM(I76:I86)","v":0},null,null,null,null,null,{"$f":"SUM(O76:O86)","v":0},null,null,null,null,null,{"$f":"SUM(U76:U86)","v":0},null,null,null,null,null,{"$f":"SUM(AA76:AA86)","v":0},null,null,null,null,null,{"$f":"SUM(AG76:AG86)","v":0},null,null,null,null,null,{"$f":"SUM(AM76:AM86)","v":0},null,null,null,null,null,{"$f":"SUM(AS76:AS86)","v":0},null,null,null,null,null,{"$f":"SUM(AY76:AY86)","v":0},null,null,null,null,null,{"$f":"SUM(BE76:BE86)","v":0}]
[{"$f":"Lists!$F$3","v":"Ceiling Mounted Cassette"},20,{"$f":"COUNTIFS(Output!$E$5:$E$36,Indoor!A88,Output!$D$6:$D$37,Indoor!B88)","v":0},3.7999999999999999E-2,0.04,3.9E-2,{"$f":"(((D88*Database!$U$3)+(E88*Database!$V$3)+(F88*Database!$W$3))*C88)","v":0},20,{"$f":"COUNTIFS(Output!$G$5:$G$36,Indoor!A88,Output!$F$6:$F$37,Indoor!H88)","v":0},{"$f":"D88","v":3.7999999999999999E-2},{"$f":"E88","v":0.04},{"$f":"F88","v":3.9E-2},{"$f":"(((J88*Database!$U$3)+(K88*Database!$V$3)+(L88*Database!$W$3))*I88)","v":0},20,{"$f":"COUNTIFS(Output!$I$5:$I$36,Indoor!A88,Output!$H$6:$H$37,Indoor!N88)","v":0},{"$f":"D88","v":3.7999999999999999E-2},{"$f":"E88","v":0.04},{"$f":"F88","v":3.9E-2},{"$f":"(((P88*Database!$U$3)+(Q88*Database!$V$3)+(R88*Database!$W$3))*O88)","v":0},20,{"$f":"COUNTIFS(Output!$K$5:$K$36,Indoor!A88,Output!$J$6:$J$37,Indoor!T88)","v":0},{"$f":"D88","v":3.7999999999999999E-2},{"$f":"E88","v":0.04},{"$f":"F88","v":3.9E-2},{"$f":"(((V88*Database!$U$3)+(W88*Database!$V$3)+(X88*Database!$W$3))*U88)","v":0},20,{"$f":"COUNTIFS(Output!$M$5:$M$36,Indoor!A88,Output!$L$6:$L$37,Indoor!Z88)","v":0},{"$f":"D88","v":3.7999999999999999E-2},{"$f":"E88","v":0.04},{"$f":"F88","v":3.9E-2},{"$f":"(((AB88*Database!$U$3)+(AC88*Database!$V$3)+(AD88*Database!$W$3))*AA88)","v":0},20,{"$f":"COUNTIFS(Output!$O$5:$O$36,Indoor!A88,Output!$N$6:$N$37,Indoor!AF88)","v":0},{"$f":"D88","v":3.7999999999999999E-2},{"$f":"E88","v":0.04},{"$f":"F88","v":3.9E-2},{"$f":"(((AH88*Database!$U$3)+(AI88*Database!$V$3)+(AJ88*Database!$W$3))*AG88)","v":0},20,{"$f":"COUNTIFS(Output!$Q$5:$Q$36,Indoor!A88,Output!$P$6:$P$37,Indoor!AL88)","v":0},{"$f":"D88","v":3.7999999999999999E-2},{"$f":"E88","v":0.04},{"$f":"F88","v":3.9E-2},{"$f":"(((AN88*Database!$U$3)+(AO88*Database!$V$3)+(AP88*Database!$W$3))*AM88)","v":0},20,{"$f":"COUNTIFS(Output!$S$5:$S$36,Indoor!A88,Output!$R$6:$R$37,Indoor!AR88)","v":0},{"$f":"D88","v":3.7999999999999999E-2},{"$f":"E88","v":0.04},{"$f":"F88","v":3.9E-2},{"$f":"(((AT88*Database!$U$3)+(AU88*Database!$V$3)+(AV88*Database!$W$3))*AS88)","v":0},20,{"$f":"COUNTIFS(Output!$U$5:$U$36,Indoor!A88,Output!$T$6:$T$37,Indoor!AX88)","v":0},{"$f":"D88","v":3.7999999999999999E-2},{"$f":"E88","v":0.04},{"$f":"F88","v":3.9E-2},{"$f":"(((AZ88*Database!$U$3)+(BA88*Database!$V$3)+(BB88*Database!$W$3))*AY88)","v":0},20,{"$f":"COUNTIFS(Output!$W$5:$W$36,Indoor!A88,Output!$V$6:$V$37,Indoor!BD88)","v":0},{"$f":"D88","v":3.7999999999999999E-2},{"$f":"E88","v":0.04},{"$f":"F88","v":3.9E-2},{"$f":"(((BF88*Database!$U$3)+(BG88*Database!$V$3)+(BH88*Database!$W$3))*BE88)","v":0},{"$f":"SUM(BE88+AY88+AS88+AM88+AG88+AA88+U88+O88+I88+C88)","v":0}]
[{"$f":"Lists!$F$3","v":"Ceiling Mounted Cassette"},25,{"$f":"COUNTIFS(Output!$E$5:$E$36,Indoor!A89,Output!$D$6:$D$37,Indoor!B89)","v":0},3.7999999999999999E-2,4.4999999999999998E-2,4.1499999999999995E-2,{"$f":"(((D89*Database!$U$3)+(E89*Database!$V$3)+(F89*Database!$W$3))*C89)","v":0},25,{"$f":"COUNTIFS(Output!$G$5:$G$36,Indoor!A89,Output!$F$6:$F$37,Indoor!H89)","v":0},3.7999999999999999E-2,4.4999999999999998E-2,4.1499999999999995E-2,{"$f":"(((J89*Database!$U$3)+(K89*Database!$V$3)+(L89*Database!$W$3))*I89)","v":0},25,{"$f":"COUNTIFS(Output!$I$5:$I$36,Indoor!A89,Output!$H$6:$H$37,Indoor!N89)","v":0},3.7999999999999999E-2,4.4999999999999998E-2,4.1499999999999995E-2,{"$f":"(((P89*Database!$U$3)+(Q89*Database!$V$3)+(R89*Database!$W$3))*O89)","v":0},25,{"$f":"COUNTIFS(Output!$K$5:$K$36,Indoor!A89,Output!$J$6:$J$37,Indoor!T89)","v":0},3.7999999999999999E-2,4.4999999999999998E-2,4.1499999999999995E-2,{"$f":"(((V89*Database!$U$3)+(W89*Database!$V$3)+(X89*Database!$W$3))*U89)","v":0},25,{"$f":"COUNTIFS(Output!$M$5:$M$36,Indoor!A89,Output!$L$6:$L$37,Indoor!Z89)","v":0},3.7999999999999999E-2,4.4999999999999998E-2,4.1499999999999995E-2,{"$f":"(((AB89*Database!$U$3)+(AC89*Database!$V$3)+(AD89*Database!$W$3))*AA89)","v":0},25,{"$f":"COUNTIFS(Output!$O$5:$O$36,Indoor!A89,Output!$N$6:$N$37,Indoor!AF89)","v":0},3.7999999999999999E-2,4.4999999999999998E-2,4.1499999999999995E-2,{"$f":"(((AH89*Database!$U$3)+(AI89*Database!$V$3)+(AJ89*Database!$W$3))*AG89)","v":0},25,{"$f":"COUNTIFS(Output!$Q$5:$Q$36,Indoor!A89,Output!$P$6:$P$37,Indoor!AL89)","v":0},3.7999999999999999E-2,4.4999999999999998E-2,4.1499999999999995E-2,{"$f":"(((AN89*Database!$U$3)+(AO89*Database!$V$3)+(AP89*Database!$W$3))*AM89)","v":0},25,{"$f":"COUNTIFS(Output!$S$5:$S$36,Indoor!A89,Output!$R$6:$R$37,Indoor!AR89)","v":0},3.7999999999999999E-2,4.4999999999999998E-2,4.1499999999999995E-2,{"$f":"(((AT89*Database!$U$3)+(AU89*Database!$V$3)+(AV89*Database!$W$3))*AS89)","v":0},25,{"$f":"COUNTIFS(Output!$U$5:$U$36,Indoor!A89,Output!$T$6:$T$37,Indoor!AX89)","v":0},3.7999999999999999E-2,4.4999999999999998E-2,4.1499999999999995E-2,{"$f":"(((AZ89*Database!$U$3)+(BA89*Database!$V$3)+(BB89*Database!$W$3))*AY89)","v":0},25,{"$f":"COUNTIFS(Output!$W$5:$W$36,Indoor!A89,Output!$V$6:$V$37,Indoor!BD89)","v":0},3.7999999999999999E-2,4.4999999999999998E-2,4.1499999999999995E-2,{"$f":"(((BF89*Database!$U$3)+(BG89*Database!$V$3)+(BH89*Database!$W$3))*BE89)","v":0},0]
[{"$f":"Lists!$F$3","v":"Ceiling Mounted Cassette"},31.25,{"$f":"COUNTIFS(Output!$E$5:$E$36,Indoor!A90,Output!$D$6:$D$37,Indoor!B90)","v":0},3.7999999999999999E-2,4.4999999999999998E-2,4.1499999999999995E-2,{"$f":"(((D90*Database!$U$3)+(E90*Database!$V$3)+(F90*Database!$W$3))*C90)","v":0},31.25,{"$f":"COUNTIFS(Output!$G$5:$G$36,Indoor!A90,Output!$F$6:$F$37,Indoor!H90)","v":0},3.7999999999999999E-2,4.4999999999999998E-2,4.1499999999999995E-2,{"$f":"(((J90*Database!$U$3)+(K90*Database!$V$3)+(L90*Database!$W$3))*I90)","v":0},31.25,{"$f":"COUNTIFS(Output!$I$5:$I$36,Indoor!A90,Output!$H$6:$H$37,Indoor!N90)","v":0},3.7999999999999999E-2,4.4999999999999998E-2,4.1499999999999995E-2,{"$f":"(((P90*Database!$U$3)+(Q90*Database!$V$3)+(R90*Database!$W$3))*O90)","v":0},31.25,{"$f":"COUNTIFS(Output!$K$5:$K$36,Indoor!A90,Output!$J$6:$J$37,Indoor!T90)","v":0},3.7999999999999999E-2,4.4999999999999998E-2,4.1499999999999995E-2,{"$f":"(((V90*Database!$U$3)+(W90*Database!$V$3)+(X90*Database!$W$3))*U90)","v":0},31.25,{"$f":"COUNTIFS(Output!$M$5:$M$36,Indoor!A90,Output!$L$6:$L$37,Indoor!Z90)","v":0},3.7999999999999999E-2,4.4999999999999998E-2,4.1499999999999995E-2,{"$f":"(((AB90*Database!$U$3)+(AC90*Database!$V$3)+(AD90*Database!$W$3))*AA90)","v":0},31.25,{"$f":"COUNTIFS(Output!$O$5:$O$36,Indoor!A90,Output!$N$6:$N$37,Indoor!AF90)","v":0},3.7999999999999999E-2,4.4999999999999998E-2,4.1499999999999995E-2,{"$f":"(((AH90*Database!$U$3)+(AI90*Database!$V$3)+(AJ90*Database!$W$3))*AG90)","v":0},31.25,{"$f":"COUNTIFS(Output!$Q$5:$Q$36,Indoor!A90,Output!$P$6:$P$37,Indoor!AL90)","v":0},3.7999999999999999E-2,4.4999999999999998E-2,4.1499999999999995E-2,{"$f":"(((AN90*Database!$U$3)+(AO90*Database!$V$3)+(AP90*Database!$W$3))*AM90)","v":0},31.25,{"$f":"COUNTIFS(Output!$S$5:$S$36,Indoor!A90,Output!$R$6:$R$37,Indoor!AR90)","v":0},3.7999999999999999E-2,4.4999999999999998E-2,4.1499999999999995E-2,{"$f":"(((AT90*Database!$U$3)+(AU90*Database!$V$3)+(AV90*Database!$W$3))*AS90)","v":0},31.25,{"$f":"COUNTIFS(Output!$U$5:$U$36,Indoor!A90,Output!$T$6:$T$37,Indoor!AX90)","v":0},3.7999999999999999E-2,4.4999999999999998E-2,4.1499999999999995E-2,{"$f":"(((AZ90*Database!$U$3)+(BA90*Database!$V$3)+(BB90*Database!$W$3))*AY90)","v":0},31.25,{"$f":"COUNTIFS(Output!$W$5:$W$36,Indoor!A90,Output!$V$6:$V$37,Indoor!BD90)","v":0},3.7999999999999999E-2,4.4999999999999998E-2,4.1499999999999995E-2,{"$f":"(((BF90*Database!$U$3)+(BG90*Database!$V$3)+(BH90*Database!$W$3))*BE90)","v":0},0]
[{"$f":"Lists!$F$3","v":"Ceiling Mounted Cassette"},40,{"$f":"COUNTIFS(Output!$E$5:$E$36,Indoor!A91,Output!$D$6:$D$37,Indoor!B91)","v":0},3.7999999999999999E-2,5.5E-2,4.65E-2,{"$f":"(((D91*Database!$U$3)+(E91*Database!$V$3)+(F91*Database!$W$3))*C91)","v":0},40,{"$f":"COUNTIFS(Output!$G$5:$G$36,Indoor!A91,Output!$F$6:$F$37,Indoor!H91)","v":0},3.7999999999999999E-2,5.5E-2,4.65E-2,{"$f":"(((J91*Database!$U$3)+(K91*Database!$V$3)+(L91*Database!$W$3))*I91)","v":0},40,{"$f":"COUNTIFS(Output!$I$5:$I$36,Indoor!A91,Output!$H$6:$H$37,Indoor!N91)","v":0},3.7999999999999999E-2,5.5E-2,4.65E-2,{"$f":"(((P91*Database!$U$3)+(Q91*Database!$V$3)+(R91*Database!$W$3))*O91)","v":0},40,{"$f":"COUNTIFS(Output!$K$5:$K$36,Indoor!A91,Output!$J$6:$J$37,Indoor!T91)","v":0},3.7999999999999999E-2,5.5E-2,4.65E-2,{"$f":"(((V91*Database!$U$3)+(W91*Database!$V$3)+(X91*Database!$W$3))*U91)","v":0},40,{"$f":"COUNTIFS(Output!$M$5:$M$36,Indoor!A91,Output!$L$6:$L$37,Indoor!Z91)","v":0},3.7999999999999999E-2,5.5E-2,4.65E-2,{"$f":"(((AB91*Database!$U$3)+(AC91*Database!$V$3)+(AD91*Database!$W$3))*AA91)","v":0},40,{"$f":"COUNTIFS(Output!$O$5:$O$36,Indoor!A91,Output!$N$6:$N$37,Indoor!AF91)","v":0},3.7999999999999999E-2,5.5E-2,4.65E-2,{"$f":"(((AH91*Database!$U$3)+(AI91*Database!$V$3)+(AJ91*Database!$W$3))*AG91)","v":0},40,{"$f":"COUNTIFS(Output!$Q$5:$Q$36,Indoor!A91,Output!$P$6:$P$37,Indoor!AL91)","v":0},3.7999999999999999E-2,5.5E-2,4.65E-2,{"$f":"(((AN91*Database!$U$3)+(AO91*Database!$V$3)+(AP91*Database!$W$3))*AM91)","v":0},40,{"$f":"COUNTIFS(Output!$S$5:$S$36,Indoor!A91,Output!$R$6:$R$37,Indoor!AR91)","v":0},3.7999999999999999E-2,5.5E-2,4.65E-2,{"$f":"(((AT91*Database!$U$3)+(AU91*Database!$V$3)+(AV91*Database!$W$3))*AS91)","v":0},40,{"$f":"COUNTIFS(Output!$U$5:$U$36,Indoor!A91,Output!$T$6:$T$37,Indoor!AX91)","v":0},3.7999999999999999E-2,5.5E-2,4.65E-2,{"$f":"(((AZ91*Database!$U$3)+(BA91*Database!$V$3)+(BB91*Database!$W$3))*AY91)","v":0},40,{"$f":"COUNTIFS(Output!$W$5:$W$36,Indoor!A91,Output!$V$6:$V$37,Indoor!BD91)","v":0},3.7999999999999999E-2,5.5E-2,4.65E-2,{"$f":"(((BF91*Database!$U$3)+(BG91*Database!$V$3)+(BH91*Database!$W$3))*BE91)","v":0},0]
[{"$f":"Lists!$F$3","v":"Ceiling Mounted Cassette"},50,{"$f":"COUNTIFS(Output!$E$5:$E$36,Indoor!A92,Output!$D$6:$D$37,Indoor!B92)","v":0},5.2999999999999999E-2,6.7000000000000004E-2,0.06,{"$f":"(((D92*Database!$U$3)+(E92*Database!$V$3)+(F92*Database!$W$3))*C92)","v":0},50,{"$f":"COUNTIFS(Output!$G$5:$G$36,Indoor!A92,Output!$F$6:$F$37,Indoor!H92)","v":0},5.2999999999999999E-2,6.7000000000000004E-2,0.06,{"$f":"(((J92*Database!$U$3)+(K92*Database!$V$3)+(L92*Database!$W$3))*I92)","v":0},50,{"$f":"COUNTIFS(Output!$I$5:$I$36,Indoor!A92,Output!$H$6:$H$37,Indoor!N92)","v":0},5.2999999999999999E-2,6.7000000000000004E-2,0.06,{"$f":"(((P92*Database!$U$3)+(Q92*Database!$V$3)+(R92*Database!$W$3))*O92)","v":0},50,{"$f":"COUNTIFS(Output!$K$5:$K$36,Indoor!A92,Output!$J$6:$J$37,Indoor!T92)","v":0},5.2999999999999999E-2,6.7000000000000004E-2,0.06,{"$f":"(((V92*Database!$U$3)+(W92*Database!$V$3)+(X92*Database!$W$3))*U92)","v":0},50,{"$f":"COUNTIFS(Output!$M$5:$M$36,Indoor!A92,Output!$L$6:$L$37,Indoor!Z92)","v":0},5.2999999999999999E-2,6.7000000000000004E-2,0.06,{"$f":"(((AB92*Database!$U$3)+(AC92*Database!$V$3)+(AD92*Database!$W$3))*AA92)","v":0},50,{"$f":"COUNTIFS(Output!$O$5:$O$36,Indoor!A92,Output!$N$6:$N$37,Indoor!AF92)","v":0},5.2999999999999999E-2,6.7000000000000004E-2,0.06,{"$f":"(((AH92*Database!$U$3)+(AI92*Database!$V$3)+(AJ92*Database!$W$3))*AG92)","v":0},50,{"$f":"COUNTIFS(Output!$Q$5:$Q$36,Indoor!A92,Output!$P$6:$P$37,Indoor!AL92)","v":0},5.2999999999999999E-2,6.7000000000000004E-2,0.06,{"$f":"(((AN92*Database!$U$3)+(AO92*Database!$V$3)+(AP92*Database!$W$3))*AM92)","v":0},50,{"$f":"COUNTIFS(Output!$S$5:$S$36,Indoor!A92,Output!$R$6:$R$37,Indoor!AR92)","v":0},5.2999999999999999E-2,6.7000000000000004E-2,0.06,{"$f":"(((AT92*Database!$U$3)+(AU92*Database!$V$3)+(AV92*Database!$W$3))*AS92)","v":0},50,{"$f":"COUNTIFS(Output!$U$5:$U$36,Indoor!A92,Output!$T$6:$T$37,Indoor!AX92)","v":0},5.2999999999999999E-2,6.7000000000000004E-2,0.06,{"$f":"(((AZ92*Database!$U$3)+(BA92*Database!$V$3)+(BB92*Database!$W$3))*AY92)","v":0},50,{"$f":"COUNTIFS(Output!$W$5:$W$36,Indoor!A92,Output!$V$6:$V$37,Indoor!BD92)","v":0},5.2999999999999999E-2,6.7000000000000004E-2,0.06,{"$f":"(((BF92*Database!$U$3)+(BG92*Database!$V$3)+(BH92*Database!$W$3))*BE92)","v":0},0]
[{"$f":"Lists!$F$3","v":"Ceiling Mounted Cassette"},63,{"$f":"COUNTIFS(Output!$E$5:$E$36,Indoor!A93,Output!$D$6:$D$37,Indoor!B93)","v":0},6.0999999999999999E-2,0.114,8.7499999999999994E-2,{"$f":"(((D93*Database!$U$3)+(E93*Database!$V$3)+(F93*Database!$W$3))*C93)","v":0},63,{"$f":"COUNTIFS(Output!$G$5:$G$36,Indoor!A93,Output!$F$6:$F$37,Indoor!H93)","v":0},6.0999999999999999E-2,0.114,8.7499999999999994E-2,{"$f":"(((J93*Database!$U$3)+(K93*Database!$V$3)+(L93*Database!$W$3))*I93)","v":0},63,{"$f":"COUNTIFS(Output!$I$5:$I$36,Indoor!A93,Output!$H$6:$H$37,Indoor!N93)","v":0},6.0999999999999999E-2,0.114,8.7499999999999994E-2,{"$f":"(((P93*Database!$U$3)+(Q93*Database!$V$3)+(R93*Database!$W$3))*O93)","v":0},63,{"$f":"COUNTIFS(Output!$K$5:$K$36,Indoor!A93,Output!$J$6:$J$37,Indoor!T93)","v":0},6.0999999999999999E-2,0.114,8.7499999999999994E-2,{"$f":"(((V93*Database!$U$3)+(W93*Database!$V$3)+(X93*Database!$W$3))*U93)","v":0},63,{"$f":"COUNTIFS(Output!$M$5:$M$36,Indoor!A93,Output!$L$6:$L$37,Indoor!Z93)","v":0},6.0999999999999999E-2,0.114,8.7499999999999994E-2,{"$f":"(((AB93*Database!$U$3)+(AC93*Database!$V$3)+(AD93*Database!$W$3))*AA93)","v":0},63,{"$f":"COUNTIFS(Output!$O$5:$O$36,Indoor!A93,Output!$N$6:$N$37,Indoor!AF93)","v":0},6.0999999999999999E-2,0.114,8.7499999999999994E-2,{"$f":"(((AH93*Database!$U$3)+(AI93*Database!$V$3)+(AJ93*Database!$W$3))*AG93)","v":0},63,{"$f":"COUNTIFS(Output!$Q$5:$Q$36,Indoor!A93,Output!$P$6:$P$37,Indoor!AL93)","v":0},6.0999999999999999E-2,0.114,8.7499999999999994E-2,{"$f":"(((AN93*Database!$U$3)+(AO93*Database!$V$3)+(AP93*Database!$W$3))*AM93)","v":0},63,{"$f":"COUNTIFS(Output!$S$5:$S$36,Indoor!A93,Output!$R$6:$R$37,Indoor!AR93)","v":0},6.0999999999999999E-2,0.114,8.7499999999999994E-2,{"$f":"(((AT93*Database!$U$3)+(AU93*Database!$V$3)+(AV93*Database!$W$3))*AS93)","v":0},63,{"$f":"COUNTIFS(Output!$U$5:$U$36,Indoor!A93,Output!$T$6:$T$37,Indoor!AX93)","v":0},6.0999999999999999E-2,0.114,8.7499999999999994E-2,{"$f":"(((AZ93*Database!$U$3)+(BA93*Database!$V$3)+(BB93*Database!$W$3))*AY93)","v":0},63,{"$f":"COUNTIFS(Output!$W$5:$W$36,Indoor!A93,Output!$V$6:$V$37,Indoor!BD93)","v":0},6.0999999999999999E-2,0.114,8.7499999999999994E-2,{"$f":"(((BF93*Database!$U$3)+(BG93*Database!$V$3)+(BH93*Database!$W$3))*BE93)","v":0},0]
[{"$f":"Lists!$F$3","v":"Ceiling Mounted Cassette"},80,{"$f":"COUNTIFS(Output!$E$5:$E$36,Indoor!A94,Output!$D$6:$D$37,Indoor!B94)","v":0},9.1999999999999998E-2,0.108,0.1,{"$f":"(((D94*Database!$U$3)+(E94*Database!$V$3)+(F94*Database!$W$3))*C94)","v":0},80,{"$f":"COUNTIFS(Output!$G$5:$G$36,Indoor!A94,Output!$F$6:$F$37,Indoor!H94)","v":0},9.1999999999999998E-2,0.108,0.1,{"$f":"(((J94*Database!$U$3)+(K94*Database!$V$3)+(L94*Database!$W$3))*I94)","v":0},80,{"$f":"COUNTIFS(Output!$I$5:$I$36,Indoor!A94,Output!$H$6:$H$37,Indoor!N94)","v":0},9.1999999999999998E-2,0.108,0.1,{"$f":"(((P94*Database!$U$3)+(Q94*Database!$V$3)+(R94*Database!$W$3))*O94)","v":0},80,{"$f":"COUNTIFS(Output!$K$5:$K$36,Indoor!A94,Output!$J$6:$J$37,Indoor!T94)","v":0},9.1999999999999998E-2,0.108,0.1,{"$f":"(((V94*Database!$U$3)+(W94*Database!$V$3)+(X94*Database!$W$3))*U94)","v":0},80,{"$f":"COUNTIFS(Output!$M$5:$M$36,Indoor!A94,Output!$L$6:$L$37,Indoor!Z94)","v":0},9.1999999999999998E-2,0.108,0.1,{"$f":"(((AB94*Database!$U$3)+(AC94*Database!$V$3)+(AD94*Database!$W$3))*AA94)","v":0},80,{"$f":"COUNTIFS(Output!$O$5:$O$36,Indoor!A94,Output!$N$6:$N$37,Indoor!AF94)","v":0},9.1999999999999998E-2,0.108,0.1,{"$f":"(((AH94*Database!$U$3)+(AI94*Database!$V$3)+(AJ94*Database!$W$3))*AG94)","v":0},80,{"$f":"COUNTIFS(Output!$Q$5:$Q$36,Indoor!A94,Output!$P$6:$P$37,Indoor!AL94)","v":0},9.1999999999999998E-2,0.108,0.1,{"$f":"(((AN94*Database!$U$3)+(AO94*Database!$V$3)+(AP94*Database!$W$3))*AM94)","v":0},80,{"$f":"COUNTIFS(Output!$S$5:$S$36,Indoor!A94,Output!$R$6:$R$37,Indoor!AR94)","v":0},9.1999999999999998E-2,0.108,0.1,{"$f":"(((AT94*Database!$U$3)+(AU94*Database!$V$3)+(AV94*Database!$W$3))*AS94)","v":0},80,{"$f":"COUNTIFS(Output!$U$5:$U$36,Indoor!A94,Output!$T$6:$T$37,Indoor!AX94)","v":0},9.1999999999999998E-2,0.108,0.1,{"$f":"(((AZ94*Database!$U$3)+(BA94*Database!$V$3)+(BB94*Database!$W$3))*AY94)","v":0},80,{"$f":"COUNTIFS(Output!$W$5:$W$36,Indoor!A94,Output!$V$6:$V$37,Indoor!BD94)","v":0},9.1999999999999998E-2,0.108,0.1,{"$f":"(((BF94*Database!$U$3)+(BG94*Database!$V$3)+(BH94*Database!$W$3))*BE94)","v":0},0]
[{"$f":"Lists!$F$3","v":"Ceiling Mounted Cassette"},100,{"$f":"COUNTIFS(Output!$E$5:$E$36,Indoor!A95,Output!$D$6:$D$37,Indoor!B95)","v":0},0.115,0.17599999999999999,0.14549999999999999,{"$f":"(((D95*Database!$U$3)+(E95*Database!$V$3)+(F95*Database!$W$3))*C95)","v":0},100,{"$f":"COUNTIFS(Output!$G$5:$G$36,Indoor!A95,Output!$F$6:$F$37,Indoor!H95)","v":0},0.115,0.17599999999999999,0.14549999999999999,{"$f":"(((J95*Database!$U$3)+(K95*Database!$V$3)+(L95*Database!$W$3))*I95)","v":0},100,{"$f":"COUNTIFS(Output!$I$5:$I$36,Indoor!A95,Output!$H$6:$H$37,Indoor!N95)","v":0},0.115,0.17599999999999999,0.14549999999999999,{"$f":"(((P95*Database!$U$3)+(Q95*Database!$V$3)+(R95*Database!$W$3))*O95)","v":0},100,{"$f":"COUNTIFS(Output!$K$5:$K$36,Indoor!A95,Output!$J$6:$J$37,Indoor!T95)","v":0},0.115,0.17599999999999999,0.14549999999999999,{"$f":"(((V95*Database!$U$3)+(W95*Database!$V$3)+(X95*Database!$W$3))*U95)","v":0},100,{"$f":"COUNTIFS(Output!$M$5:$M$36,Indoor!A95,Output!$L$6:$L$37,Indoor!Z95)","v":0},0.115,0.17599999999999999,0.14549999999999999,{"$f":"(((AB95*Database!$U$3)+(AC95*Database!$V$3)+(AD95*Database!$W$3))*AA95)","v":0},100,{"$f":"COUNTIFS(Output!$O$5:$O$36,Indoor!A95,Output!$N$6:$N$37,Indoor!AF95)","v":0},0.115,0.17599999999999999,0.14549999999999999,{"$f":"(((AH95*Database!$U$3)+(AI95*Database!$V$3)+(AJ95*Database!$W$3))*AG95)","v":0},100,{"$f":"COUNTIFS(Output!$Q$5:$Q$36,Indoor!A95,Output!$P$6:$P$37,Indoor!AL95)","v":0},0.115,0.17599999999999999,0.14549999999999999,{"$f":"(((AN95*Database!$U$3)+(AO95*Database!$V$3)+(AP95*Database!$W$3))*AM95)","v":0},100,{"$f":"COUNTIFS(Output!$S$5:$S$36,Indoor!A95,Output!$R$6:$R$37,Indoor!AR95)","v":0},0.115,0.17599999999999999,0.14549999999999999,{"$f":"(((AT95*Database!$U$3)+(AU95*Database!$V$3)+(AV95*Database!$W$3))*AS95)","v":0},100,{"$f":"COUNTIFS(Output!$U$5:$U$36,Indoor!A95,Output!$T$6:$T$37,Indoor!AX95)","v":0},0.115,0.17599999999999999,0.14549999999999999,{"$f":"(((AZ95*Database!$U$3)+(BA95*Database!$V$3)+(BB95*Database!$W$3))*AY95)","v":0},100,{"$f":"COUNTIFS(Output!$W$5:$W$36,Indoor!A95,Output!$V$6:$V$37,Indoor!BD95)","v":0},0.115,0.17599999999999999,0.14549999999999999,{"$f":"(((BF95*Database!$U$3)+(BG95*Database!$V$3)+(BH95*Database!$W$3))*BE95)","v":0},0]
[{"$f":"Lists!$F$3","v":"Ceiling Mounted Cassette"},125,{"$f":"COUNTIFS(Output!$E$5:$E$36,Indoor!A96,Output!$D$6:$D$37,Indoor!B96)","v":0},0.186,0.246,0.216,{"$f":"(((D96*Database!$U$3)+(E96*Database!$V$3)+(F96*Database!$W$3))*C96)","v":0},125,{"$f":"COUNTIFS(Output!$G$5:$G$36,Indoor!A96,Output!$F$6:$F$37,Indoor!H96)","v":0},0.186,0.246,0.216,{"$f":"(((J96*Database!$U$3)+(K96*Database!$V$3)+(L96*Database!$W$3))*I96)","v":0},125,{"$f":"COUNTIFS(Output!$I$5:$I$36,Indoor!A96,Output!$H$6:$H$37,Indoor!N96)","v":0},0.186,0.246,0.216,{"$f":"(((P96*Database!$U$3)+(Q96*Database!$V$3)+(R96*Database!$W$3))*O96)","v":0},125,{"$f":"COUNTIFS(Output!$K$5:$K$36,Indoor!A96,Output!$J$6:$J$37,Indoor!T96)","v":0},0.186,0.246,0.216,{"$f":"(((V96*Database!$U$3)+(W96*Database!$V$3)+(X96*Database!$W$3))*U96)","v":0},125,{"$f":"COUNTIFS(Output!$M$5:$M$36,Indoor!A96,Output!$L$6:$L$37,Indoor!Z96)","v":0},0.186,0.246,0.216,{"$f":"(((AB96*Database!$U$3)+(AC96*Database!$V$3)+(AD96*Database!$W$3))*AA96)","v":0},125,{"$f":"COUNTIFS(Output!$O$5:$O$36,Indoor!A96,Output!$N$6:$N$37,Indoor!AF96)","v":0},0.186,0.246,0.216,{"$f":"(((AH96*Database!$U$3)+(AI96*Database!$V$3)+(AJ96*Database!$W$3))*AG96)","v":0},125,{"$f":"COUNTIFS(Output!$Q$5:$Q$36,Indoor!A96,Output!$P$6:$P$37,Indoor!AL96)","v":0},0.186,0.246,0.216,{"$f":"(((AN96*Database!$U$3)+(AO96*Database!$V$3)+(AP96*Database!$W$3))*AM96)","v":0},125,{"$f":"COUNTIFS(Output!$S$5:$S$36,Indoor!A96,Output!$R$6:$R$37,Indoor!AR96)","v":0},0.186,0.246,0.216,{"$f":"(((AT96*Database!$U$3)+(AU96*Database!$V$3)+(AV96*Database!$W$3))*AS96)","v":0},125,{"$f":"COUNTIFS(Output!$U$5:$U$36,Indoor!A96,Output!$T$6:$T$37,Indoor!AX96)","v":0},0.186,0.246,0.216,{"$f":"(((AZ96*Database!$U$3)+(BA96*Database!$V$3)+(BB96*Database!$W$3))*AY96)","v":0},125,{"$f":"COUNTIFS(Output!$W$5:$W$36,Indoor!A96,Output!$V$6:$V$37,Indoor!BD96)","v":0},0.186,0.246,0.216,{"$f":"(((BF96*Database!$U$3)+(BG96*Database!$V$3)+(BH96*Database!$W$3))*BE96)","v":0},0]
[{"$f":"Lists!$F$3","v":"Ceiling Mounted Cassette"},200,{"$f":"COUNTIFS(Output!$E$5:$E$36,Indoor!A97,Output!$D$6:$D$37,Indoor!B97)","v":0},null,null,0,{"$f":"(((D97*Database!$U$3)+(E97*Database!$V$3)+(F97*Database!$W$3))*C97)","v":0},200,{"$f":"COUNTIFS(Output!$G$5:$G$36,Indoor!A97,Output!$F$6:$F$37,Indoor!H97)","v":0},0,0,0,{"$f":"(((J97*Database!$U$3)+(K97*Database!$V$3)+(L97*Database!$W$3))*I97)","v":0},200,{"$f":"COUNTIFS(Output!$I$5:$I$36,Indoor!A97,Output!$H$6:$H$37,Indoor!N97)","v":0},0,0,0,{"$f":"(((P97*Database!$U$3)+(Q97*Database!$V$3)+(R97*Database!$W$3))*O97)","v":0},200,{"$f":"COUNTIFS(Output!$K$5:$K$36,Indoor!A97,Output!$J$6:$J$37,Indoor!T97)","v":0},0,0,0,{"$f":"(((V97*Database!$U$3)+(W97*Database!$V$3)+(X97*Database!$W$3))*U97)","v":0},200,{"$f":"COUNTIFS(Output!$M$5:$M$36,Indoor!A97,Output!$L$6:$L$37,Indoor!Z97)","v":0},0,0,0,{"$f":"(((AB97*Database!$U$3)+(AC97*Database!$V$3)+(AD97*Database!$W$3))*AA97)","v":0},200,{"$f":"COUNTIFS(Output!$O$5:$O$36,Indoor!A97,Output!$N$6:$N$37,Indoor!AF97)","v":0},0,0,0,{"$f":"(((AH97*Database!$U$3)+(AI97*Database!$V$3)+(AJ97*Database!$W$3))*AG97)","v":0},200,{"$f":"COUNTIFS(Output!$Q$5:$Q$36,Indoor!A97,Output!$P$6:$P$37,Indoor!AL97)","v":0},0,0,0,{"$f":"(((AN97*Database!$U$3)+(AO97*Database!$V$3)+(AP97*Database!$W$3))*AM97)","v":0},200,{"$f":"COUNTIFS(Output!$S$5:$S$36,Indoor!A97,Output!$R$6:$R$37,Indoor!AR97)","v":0},0,0,0,{"$f":"(((AT97*Database!$U$3)+(AU97*Database!$V$3)+(AV97*Database!$W$3))*AS97)","v":0},200,{"$f":"COUNTIFS(Output!$U$5:$U$36,Indoor!A97,Output!$T$6:$T$37,Indoor!AX97)","v":0},0,0,0,{"$f":"(((AZ97*Database!$U$3)+(BA97*Database!$V$3)+(BB97*Database!$W$3))*AY97)","v":0},200,{"$f":"COUNTIFS(Output!$W$5:$W$36,Indoor!A97,Output!$V$6:$V$37,Indoor!BD97)","v":0},0,0,0,{"$f":"(((BF97*Database!$U$3)+(BG97*Database!$V$3)+(BH97*Database!$W$3))*BE97)","v":0},0]
[{"$f":"Lists!$F$3","v":"Ceiling Mounted Cassette"},250,{"$f":"COUNTIFS(Output!$E$5:$E$36,Indoor!A98,Output!$D$6:$D$37,Indoor!B98)","v":0},null,null,0,{"$f":"(((D98*Database!$U$3)+(E98*Database!$V$3)+(F98*Database!$W$3))*C98)","v":0},250,{"$f":"COUNTIFS(Output!$G$5:$G$36,Indoor!A98,Output!$F$6:$F$37,Indoor!H98)","v":0},0,0,0,{"$f":"(((J98*Database!$U$3)+(K98*Database!$V$3)+(L98*Database!$W$3))*I98)","v":0},250,{"$f":"COUNTIFS(Output!$I$5:$I$36,Indoor!A98,Output!$H$6:$H$37,Indoor!N98)","v":0},0,0,0,{"$f":"(((P98*Database!$U$3)+(Q98*Database!$V$3)+(R98*Database!$W$3))*O98)","v":0},250,{"$f":"COUNTIFS(Output!$K$5:$K$36,Indoor!A98,Output!$J$6:$J$37,Indoor!T98)","v":0},0,0,0,{"$f":"(((V98*Database!$U$3)+(W98*Database!$V$3)+(X98*Database!$W$3))*U98)","v":0},250,{"$f":"COUNTIFS(Output!$M$5:$M$36,Indoor!A98,Output!$L$6:$L$37,Indoor!Z98)","v":0},0,0,0,{"$f":"(((AB98*Database!$U$3)+(AC98*Database!$V$3)+(AD98*Database!$W$3))*AA98)","v":0},250,{"$f":"COUNTIFS(Output!$O$5:$O$36,Indoor!A98,Output!$N$6:$N$37,Indoor!AF98)","v":0},0,0,0,{"$f":"(((AH98*Database!$U$3)+(AI98*Database!$V$3)+(AJ98*Database!$W$3))*AG98)","v":0},250,{"$f":"COUNTIFS(Output!$Q$5:$Q$36,Indoor!A98,Output!$P$6:$P$37,Indoor!AL98)","v":0},0,0,0,{"$f":"(((AN98*Database!$U$3)+(AO98*Database!$V$3)+(AP98*Database!$W$3))*AM98)","v":0},250,{"$f":"COUNTIFS(Output!$S$5:$S$36,Indoor!A98,Output!$R$6:$R$37,Indoor!AR98)","v":0},0,0,0,{"$f":"(((AT98*Database!$U$3)+(AU98*Database!$V$3)+(AV98*Database!$W$3))*AS98)","v":0},250,{"$f":"COUNTIFS(Output!$U$5:$U$36,Indoor!A98,Output!$T$6:$T$37,Indoor!AX98)","v":0},0,0,0,{"$f":"(((AZ98*Database!$U$3)+(BA98*Database!$V$3)+(BB98*Database!$W$3))*AY98)","v":0},250,{"$f":"COUNTIFS(Output!$W$5:$W$36,Indoor!A98,Output!$V$6:$V$37,Indoor!BD98)","v":0},0,0,0,{"$f":"(((BF98*Database!$U$3)+(BG98*Database!$V$3)+(BH98*Database!$W$3))*BE98)","v":0},0]
["FXSQ",null,{"$f":"SUM(C88:C98)","v":0},null,null,null,null,null,{"$f":"SUM(I88:I98)","v":0},null,null,null,null,null,{"$f":"SUM(O88:O98)","v":0},null,null,null,null,null,{"$f":"SUM(U88:U98)","v":0},null,null,null,null,null,{"$f":"SUM(AA88:AA98)","v":0},null,null,null,null,null,{"$f":"SUM(AG88:AG98)","v":0},null,null,null,null,null,{"$f":"SUM(AM88:AM98)","v":0},null,null,null,null,null,{"$f":"SUM(AS88:AS98)","v":0},null,null,null,null,null,{"$f":"SUM(AY88:AY98)","v":0},null,null,null,null,null,{"$f":"SUM(BE88:BE98)","v":0}]
[{"$f":"Lists!$F$4","v":"Horizontal Ducted"},20,{"$f":"COUNTIFS(Output!$E$5:$E$36,Indoor!A100,Output!$D$6:$D$37,Indoor!B100)","v":0},4.1000000000000002E-2,2.9000000000000001E-2,3.5000000000000003E-2,{"$f":"(((D100*Database!$U$3)+(E100*Database!$V$3)+(F100*Database!$W$3))*C100)","v":0},20,{"$f":"COUNTIFS(Output!$G$5:$G$36,Indoor!A100,Output!$F$6:$F$37,Indoor!H100)","v":0},{"$f":"D100","v":4.1000000000000002E-2},{"$f":"E100","v":2.9000000000000001E-2},{"$f":"F100","v":3.5000000000000003E-2},{"$f":"(((J100*Database!$U$3)+(K100*Database!$V$3)+(L100*Database!$W$3))*I100)","v":0},20,{"$f":"COUNTIFS(Output!$I$5:$I$36,Indoor!A100,Output!$H$6:$H$37,Indoor!N100)","v":0},{"$f":"D100","v":4.1000000000000002E-2},{"$f":"E100","v":2.9000000000000001E-2},{"$f":"F100","v":3.5000000000000003E-2},{"$f":"(((P100*Database!$U$3)+(Q100*Database!$V$3)+(R100*Database!$W$3))*O100)","v":0},20,{"$f":"COUNTIFS(Output!$K$5:$K$36,Indoor!A100,Output!$J$6:$J$37,Indoor!T100)","v":0},{"$f":"D100","v":4.1000000000000002E-2},{"$f":"E100","v":2.9000000000000001E-2},{"$f":"F100","v":3.5000000000000003E-2},{"$f":"(((V100*Database!$U$3)+(W100*Database!$V$3)+(X100*Database!$W$3))*U100)","v":0},20,{"$f":"COUNTIFS(Output!$M$5:$M$36,Indoor!A100,Output!$L$6:$L$37,Indoor!Z100)","v":0},{"$f":"D100","v":4.1000000000000002E-2},{"$f":"E100","v":2.9000000000000001E-2},{"$f":"F100","v":3.5000000000000003E-2},{"$f":"(((AB100*Database!$U$3)+(AC100*Database!$V$3)+(AD100*Database!$W$3))*AA100)","v":0},20,{"$f":"COUNTIFS(Output!$O$5:$O$36,Indoor!A100,Output!$N$6:$N$37,Indoor!AF100)","v":0},{"$f":"D100","v":4.1000000000000002E-2},{"$f":"E100","v":2.9000000000000001E-2},{"$f":"F100","v":3.5000000000000003E-2},{"$f":"(((AH100*Database!$U$3)+(AI100*Database!$V$3)+(AJ100*Database!$W$3))*AG100)","v":0},20,{"$f":"COUNTIFS(Output!$Q$5:$Q$36,Indoor!A100,Output!$P$6:$P$37,Indoor!AL100)","v":0},{"$f":"D100","v":4.1000000000000002E-2},{"$f":"E100","v":2.9000000000000001E-2},{"$f":"F100","v":3.5000000000000003E-2},{"$f":"(((AN100*Database!$U$3)+(AO100*Database!$V$3)+(AP100*Database!$W$3))*AM100)","v":0},20,{"$f":"COUNTIFS(Output!$S$5:$S$36,Indoor!A100,Output!$R$6:$R$37,Indoor!AR100)","v":0},{"$f":"D100","v":4.1000000000000002E-2},{"$f":"E100","v":2.9000000000000001E-2},{"$f":"F100","v":3.5000000000000003E-2},{"$f":"(((AT100*Database!$U$3)+(AU100*Database!$V$3)+(AV100*Database!$W$3))*AS100)","v":0},20,{"$f":"COUNTIFS(Output!$U$5:$U$36,Indoor!A100,Output!$T$6:$T$37,Indoor!AX100)","v":0},{"$f":"D100","v":4.1000000000000002E-2},{"$f":"E100","v":2.9000000000000001E-2},{"$f":"F100","v":3.5000000000000003E-2},{"$f":"(((AZ100*Database!$U$3)+(BA100*Database!$V$3)+(BB100*Database!$W$3))*AY100)","v":0},20,{"$f":"COUNTIFS(Output!$W$5:$W$36,Indoor!A100,Output!$V$6:$V$37,Indoor!BD100)","v":0},{"$f":"D100","v":4.1000000000000002E-2},{"$f":"E100","v":2.9000000000000001E-2},{"$f":"F100","v":3.5000000000000003E-2},{"$f":"(((BF100*Database!$U$3)+(BG100*Database!$V$3)+(BH100*Database!$W$3))*BE100)","v":0},{"$f":"SUM(BE100+AY100+AS100+AM100+AG100+AA100+U100+O100+I100+C100)","v":0}]
[{"$f":"Lists!$F$4","v":"Horizontal Ducted"},25,{"$f":"COUNTIFS(Output!$E$5:$E$36,Indoor!A101,Output!$D$6:$D$37,Indoor!B101)","v":0},4.1000000000000002E-2,2.9000000000000001E-2,3.5000000000000003E-2,{"$f":"(((D101*Database!$U$3)+(E101*Database!$V$3)+(F101*Database!$W$3))*C101)","v":0},25,{"$f":"COUNTIFS(Output!$G$5:$G$36,Indoor!A101,Output!$F$6:$F$37,Indoor!H101)","v":0},4.1000000000000002E-2,2.9000000000000001E-2,3.5000000000000003E-2,{"$f":"(((J101*Database!$U$3)+(K101*Database!$V$3)+(L101*Database!$W$3))*I101)","v":0},25,{"$f":"COUNTIFS(Output!$I$5:$I$36,Indoor!A101,Output!$H$6:$H$37,Indoor!N101)","v":0},4.1000000000000002E-2,2.9000000000000001E-2,3.5000000000000003E-2,{"$f":"(((P101*Database!$U$3)+(Q101*Database!$V$3)+(R101*Database!$W$3))*O101)","v":0},25,{"$f":"COUNTIFS(Output!$K$5:$K$36,Indoor!A101,Output!$J$6:$J$37,Indoor!T101)","v":0},4.1000000000000002E-2,2.9000000000000001E-2,3.5000000000000003E-2,{"$f":"(((V101*Database!$U$3)+(W101*Database!$V$3)+(X101*Database!$W$3))*U101)","v":0},25,{"$f":"COUNTIFS(Output!$M$5:$M$36,Indoor!A101,Output!$L$6:$L$37,Indoor!Z101)","v":0},4.1000000000000002E-2,2.9000000000000001E-2,3.5000000000000003E-2,{"$f":"(((AB101*Database!$U$3)+(AC101*Database!$V$3)+(AD101*Database!$W$3))*AA101)","v":0},25,{"$f":"COUNTIFS(Output!$O$5:$O$36,Indoor!A101,Output!$N$6:$N$37,Indoor!AF101)","v":0},4.1000000000000002E-2,2.9000000000000001E-2,3.5000000000000003E-2,{"$f":"(((AH101*Database!$U$3)+(AI101*Database!$V$3)+(AJ101*Database!$W$3))*AG101)","v":0},25,{"$f":"COUNTIFS(Output!$Q$5:$Q$36,Indoor!A101,Output!$P$6:$P$37,Indoor!AL101)","v":0},4.1000000000000002E-2,2.9000000000000001E-2,3.5000000000000003E-2,{"$f":"(((AN101*Database!$U$3)+(AO101*Database!$V$3)+(AP101*Database!$W$3))*AM101)","v":0},25,{"$f":"COUNTIFS(Output!$S$5:$S$36,Indoor!A101,Output!$R$6:$R$37,Indoor!AR101)","v":0},4.1000000000000002E-2,2.9000000000000001E-2,3.5000000000000003E-2,{"$f":"(((AT101*Database!$U$3)+(AU101*Database!$V$3)+(AV101*Database!$W$3))*AS101)","v":0},25,{"$f":"COUNTIFS(Output!$U$5:$U$36,Indoor!A101,Output!$T$6:$T$37,Indoor!AX101)","v":0},4.1000000000000002E-2,2.9000000000000001E-2,3.5000000000000003E-2,{"$f":"(((AZ101*Database!$U$3)+(BA101*Database!$V$3)+(BB101*Database!$W$3))*AY101)","v":0},25,{"$f":"COUNTIFS(Output!$W$5:$W$36,Indoor!A101,Output!$V$6:$V$37,Indoor!BD101)","v":0},4.1000000000000002E-2,2.9000000000000001E-2,3.5000000000000003E-2,{"$f":"(((BF101*Database!$U$3)+(BG101*Database!$V$3)+(BH101*Database!$W$3))*BE101)","v":0},0]
[{"$f":"Lists!$F$4","v":"Horizontal Ducted"},31.25,{"$f":"COUNTIFS(Output!$E$5:$E$36,Indoor!A102,Output!$D$6:$D$37,Indoor!B102)","v":1},4.3999999999999997E-2,3.2000000000000001E-2,3.7999999999999999E-2,{"$f":"(((D102*Database!$U$3)+(E102*Database!$V$3)+(F102*Database!$W$3))*C102)","v":33.750500000000002},31.25,{"$f":"COUNTIFS(Output!$G$5:$G$36,Indoor!A102,Output!$F$6:$F$37,Indoor!H102)","v":0},4.3999999999999997E-2,3.2000000000000001E-2,3.7999999999999999E-2,{"$f":"(((J102*Database!$U$3)+(K102*Database!$V$3)+(L102*Database!$W$3))*I102)","v":0},31.25,{"$f":"COUNTIFS(Output!$I$5:$I$36,Indoor!A102,Output!$H$6:$H$37,Indoor!N102)","v":0},4.3999999999999997E-2,3.2000000000000001E-2,3.7999999999999999E-2,{"$f":"(((P102*Database!$U$3)+(Q102*Database!$V$3)+(R102*Database!$W$3))*O102)","v":0},31.25,{"$f":"COUNTIFS(Output!$K$5:$K$36,Indoor!A102,Output!$J$6:$J$37,Indoor!T102)","v":0},4.3999999999999997E-2,3.2000000000000001E-2,3.7999999999999999E-2,{"$f":"(((V102*Database!$U$3)+(W102*Database!$V$3)+(X102*Database!$W$3))*U102)","v":0},31.25,{"$f":"COUNTIFS(Output!$M$5:$M$36,Indoor!A102,Output!$L$6:$L$37,Indoor!Z102)","v":0},4.3999999999999997E-2,3.2000000000000001E-2,3.7999999999999999E-2,{"$f":"(((AB102*Database!$U$3)+(AC102*Database!$V$3)+(AD102*Database!$W$3))*AA102)","v":0},31.25,{"$f":"COUNTIFS(Output!$O$5:$O$36,Indoor!A102,Output!$N$6:$N$37,Indoor!AF102)","v":0},4.3999999999999997E-2,3.2000000000000001E-2,3.7999999999999999E-2,{"$f":"(((AH102*Database!$U$3)+(AI102*Database!$V$3)+(AJ102*Database!$W$3))*AG102)","v":0},31.25,{"$f":"COUNTIFS(Output!$Q$5:$Q$36,Indoor!A102,Output!$P$6:$P$37,Indoor!AL102)","v":0},4.3999999999999997E-2,3.2000000000000001E-2,3.7999999999999999E-2,{"$f":"(((AN102*Database!$U$3)+(AO102*Database!$V$3)+(AP102*Database!$W$3))*AM102)","v":0},31.25,{"$f":"COUNTIFS(Output!$S$5:$S$36,Indoor!A102,Output!$R$6:$R$37,Indoor!AR102)","v":0},4.3999999999999997E-2,3.2000000000000001E-2,3.7999999999999999E-2,{"$f":"(((AT102*Database!$U$3)+(AU102*Database!$V$3)+(AV102*Database!$W$3))*AS102)","v":0},31.25,{"$f":"COUNTIFS(Output!$U$5:$U$36,Indoor!A102,Output!$T$6:$T$37,Indoor!AX102)","v":0},4.3999999999999997E-2,3.2000000000000001E-2,3.7999999999999999E-2,{"$f":"(((AZ102*Database!$U$3)+(BA102*Database!$V$3)+(BB102*Database!$W$3))*AY102)","v":0},31.25,{"$f":"COUNTIFS(Output!$W$5:$W$36,Indoor!A102,Output!$V$6:$V$37,Indoor!BD102)","v":0},4.3999999999999997E-2,3.2000000000000001E-2,3.7999999999999999E-2,{"$f":"(((BF102*Database!$U$3)+(BG102*Database!$V$3)+(BH102*Database!$W$3))*BE102)","v":0},1]
[{"$f":"Lists!$F$4","v":"Horizontal Ducted"},40,{"$f":"COUNTIFS(Output!$E$5:$E$36,Indoor!A103,Output!$D$6:$D$37,Indoor!B103)","v":0},9.7000000000000003E-2,8.5000000000000006E-2,9.0999999999999998E-2,{"$f":"(((D103*Database!$U$3)+(E103*Database!$V$3)+(F103*Database!$W$3))*C103)","v":0},40,{"$f":"COUNTIFS(Output!$G$5:$G$36,Indoor!A103,Output!$F$6:$F$37,Indoor!H103)","v":0},9.7000000000000003E-2,8.5000000000000006E-2,9.0999999999999998E-2,{"$f":"(((J103*Database!$U$3)+(K103*Database!$V$3)+(L103*Database!$W$3))*I103)","v":0},40,{"$f":"COUNTIFS(Output!$I$5:$I$36,Indoor!A103,Output!$H$6:$H$37,Indoor!N103)","v":0},9.7000000000000003E-2,8.5000000000000006E-2,9.0999999999999998E-2,{"$f":"(((P103*Database!$U$3)+(Q103*Database!$V$3)+(R103*Database!$W$3))*O103)","v":0},40,{"$f":"COUNTIFS(Output!$K$5:$K$36,Indoor!A103,Output!$J$6:$J$37,Indoor!T103)","v":0},9.7000000000000003E-2,8.5000000000000006E-2,9.0999999999999998E-2,{"$f":"(((V103*Database!$U$3)+(W103*Database!$V$3)+(X103*Database!$W$3))*U103)","v":0},40,{"$f":"COUNTIFS(Output!$M$5:$M$36,Indoor!A103,Output!$L$6:$L$37,Indoor!Z103)","v":0},9.7000000000000003E-2,8.5000000000000006E-2,9.0999999999999998E-2,{"$f":"(((AB103*Database!$U$3)+(AC103*Database!$V$3)+(AD103*Database!$W$3))*AA103)","v":0},40,{"$f":"COUNTIFS(Output!$O$5:$O$36,Indoor!A103,Output!$N$6:$N$37,Indoor!AF103)","v":0},9.7000000000000003E-2,8.5000000000000006E-2,9.0999999999999998E-2,{"$f":"(((AH103*Database!$U$3)+(AI103*Database!$V$3)+(AJ103*Database!$W$3))*AG103)","v":0},40,{"$f":"COUNTIFS(Output!$Q$5:$Q$36,Indoor!A103,Output!$P$6:$P$37,Indoor!AL103)","v":0},9.7000000000000003E-2,8.5000000000000006E-2,9.0999999999999998E-2,{"$f":"(((AN103*Database!$U$3)+(AO103*Database!$V$3)+(AP103*Database!$W$3))*AM103)","v":0},40,{"$f":"COUNTIFS(Output!$S$5:$S$36,Indoor!A103,Output!$R$6:$R$37,Indoor!AR103)","v":0},9.7000000000000003E-2,8.5000000000000006E-2,9.0999999999999998E-2,{"$f":"(((AT103*Database!$U$3)+(AU103*Database!$V$3)+(AV103*Database!$W$3))*AS103)","v":0},40,{"$f":"COUNTIFS(Output!$U$5:$U$36,Indoor!A103,Output!$T$6:$T$37,Indoor!AX103)","v":0},9.7000000000000003E-2,8.5000000000000006E-2,9.0999999999999998E-2,{"$f":"(((AZ103*Database!$U$3)+(BA103*Database!$V$3)+(BB103*Database!$W$3))*AY103)","v":0},40,{"$f":"COUNTIFS(Output!$W$5:$W$36,Indoor!A103,Output!$V$6:$V$37,Indoor!BD103)","v":0},9.7000000000000003E-2,8.5000000000000006E-2,9.0999999999999998E-2,{"$f":"(((BF103*Database!$U$3)+(BG103*Database!$V$3)+(BH103*Database!$W$3))*BE103)","v":0},0]
[{"$f":"Lists!$F$4","v":"Horizontal Ducted"},50,{"$f":"COUNTIFS(Output!$E$5:$E$36,Indoor!A104,Output!$D$6:$D$37,Indoor!B104)","v":0},9.7000000000000003E-2,8.5000000000000006E-2,9.0999999999999998E-2,{"$f":"(((D104*Database!$U$3)+(E104*Database!$V$3)+(F104*Database!$W$3))*C104)","v":0},50,{"$f":"COUNTIFS(Output!$G$5:$G$36,Indoor!A104,Output!$F$6:$F$37,Indoor!H104)","v":0},9.7000000000000003E-2,8.5000000000000006E-2,9.0999999999999998E-2,{"$f":"(((J104*Database!$U$3)+(K104*Database!$V$3)+(L104*Database!$W$3))*I104)","v":0},50,{"$f":"COUNTIFS(Output!$I$5:$I$36,Indoor!A104,Output!$H$6:$H$37,Indoor!N104)","v":0},9.7000000000000003E-2,8.5000000000000006E-2,9.0999999999999998E-2,{"$f":"(((P104*Database!$U$3)+(Q104*Database!$V$3)+(R104*Database!$W$3))*O104)","v":0},50,{"$f":"COUNTIFS(Output!$K$5:$K$36,Indoor!A104,Output!$J$6:$J$37,Indoor!T104)","v":0},9.7000000000000003E-2,8.5000000000000006E-2,9.0999999999999998E-2,{"$f":"(((V104*Database!$U$3)+(W104*Database!$V$3)+(X104*Database!$W$3))*U104)","v":0},50,{"$f":"COUNTIFS(Output!$M$5:$M$36,Indoor!A104,Output!$L$6:$L$37,Indoor!Z104)","v":0},9.7000000000000003E-2,8.5000000000000006E-2,9.0999999999999998E-2,{"$f":"(((AB104*Database!$U$3)+(AC104*Database!$V$3)+(AD104*Database!$W$3))*AA104)","v":0},50,{"$f":"COUNTIFS(Output!$O$5:$O$36,Indoor!A104,Output!$N$6:$N$37,Indoor!AF104)","v":0},9.7000000000000003E-2,8.5000000000000006E-2,9.0999999999999998E-2,{"$f":"(((AH104*Database!$U$3)+(AI104*Database!$V$3)+(AJ104*Database!$W$3))*AG104)","v":0},50,{"$f":"COUNTIFS(Output!$Q$5:$Q$36,Indoor!A104,Output!$P$6:$P$37,Indoor!AL104)","v":0},9.7000000000000003E-2,8.5000000000000006E-2,9.0999999999999998E-2,{"$f":"(((AN104*Database!$U$3)+(AO104*Database!$V$3)+(AP104*Database!$W$3))*AM104)","v":0},50,{"$f":"COUNTIFS(Output!$S$5:$S$36,Indoor!A104,Output!$R$6:$R$37,Indoor!AR104)","v":0},9.7000000000000003E-2,8.5000000000000006E-2,9.0999999999999998E-2,{"$f":"(((AT104*Database!$U$3)+(AU104*Database!$V$3)+(AV104*Database!$W$3))*AS104)","v":0},50,{"$f":"COUNTIFS(Output!$U$5:$U$36,Indoor!A104,Output!$T$6:$T$37,Indoor!AX104)","v":0},9.7000000000000003E-2,8.5000000000000006E-2,9.0999999999999998E-2,{"$f":"(((AZ104*Database!$U$3)+(BA104*Database!$V$3)+(BB104*Database!$W$3))*AY104)","v":0},50,{"$f":"COUNTIFS(Output!$W$5:$W$36,Indoor!A104,Output!$V$6:$V$37,Indoor!BD104)","v":0},9.7000000000000003E-2,8.5000000000000006E-2,9.0999999999999998E-2,{"$f":"(((BF104*Database!$U$3)+(BG104*Database!$V$3)+(BH104*Database!$W$3))*BE104)","v":0},0]
[{"$f":"Lists!$F$4","v":"Horizontal Ducted"},63,{"$f":"COUNTIFS(Output!$E$5:$E$36,Indoor!A105,Output!$D$6:$D$37,Indoor!B105)","v":0},7.3999999999999996E-2,6.2E-2,6.8000000000000005E-2,{"$f":"(((D105*Database!$U$3)+(E105*Database!$V$3)+(F105*Database!$W$3))*C105)","v":0},63,{"$f":"COUNTIFS(Output!$G$5:$G$36,Indoor!A105,Output!$F$6:$F$37,Indoor!H105)","v":0},7.3999999999999996E-2,6.2E-2,6.8000000000000005E-2,{"$f":"(((J105*Database!$U$3)+(K105*Database!$V$3)+(L105*Database!$W$3))*I105)","v":0},63,{"$f":"COUNTIFS(Output!$I$5:$I$36,Indoor!A105,Output!$H$6:$H$37,Indoor!N105)","v":0},7.3999999999999996E-2,6.2E-2,6.8000000000000005E-2,{"$f":"(((P105*Database!$U$3)+(Q105*Database!$V$3)+(R105*Database!$W$3))*O105)","v":0},63,{"$f":"COUNTIFS(Output!$K$5:$K$36,Indoor!A105,Output!$J$6:$J$37,Indoor!T105)","v":0},7.3999999999999996E-2,6.2E-2,6.8000000000000005E-2,{"$f":"(((V105*Database!$U$3)+(W105*Database!$V$3)+(X105*Database!$W$3))*U105)","v":0},63,{"$f":"COUNTIFS(Output!$M$5:$M$36,Indoor!A105,Output!$L$6:$L$37,Indoor!Z105)","v":0},7.3999999999999996E-2,6.2E-2,6.8000000000000005E-2,{"$f":"(((AB105*Database!$U$3)+(AC105*Database!$V$3)+(AD105*Database!$W$3))*AA105)","v":0},63,{"$f":"COUNTIFS(Output!$O$5:$O$36,Indoor!A105,Output!$N$6:$N$37,Indoor!AF105)","v":0},7.3999999999999996E-2,6.2E-2,6.8000000000000005E-2,{"$f":"(((AH105*Database!$U$3)+(AI105*Database!$V$3)+(AJ105*Database!$W$3))*AG105)","v":0},63,{"$f":"COUNTIFS(Output!$Q$5:$Q$36,Indoor!A105,Output!$P$6:$P$37,Indoor!AL105)","v":0},7.3999999999999996E-2,6.2E-2,6.8000000000000005E-2,{"$f":"(((AN105*Database!$U$3)+(AO105*Database!$V$3)+(AP105*Database!$W$3))*AM105)","v":0},63,{"$f":"COUNTIFS(Output!$S$5:$S$36,Indoor!A105,Output!$R$6:$R$37,Indoor!AR105)","v":0},7.3999999999999996E-2,6.2E-2,6.8000000000000005E-2,{"$f":"(((AT105*Database!$U$3)+(AU105*Database!$V$3)+(AV105*Database!$W$3))*AS105)","v":0},63,{"$f":"COUNTIFS(Output!$U$5:$U$36,Indoor!A105,Output!$T$6:$T$37,Indoor!AX105)","v":0},7.3999999999999996E-2,6.2E-2,6.8000000000000005E-2,{"$f":"(((AZ105*Database!$U$3)+(BA105*Database!$V$3)+(BB105*Database!$W$3))*AY105)","v":0},63,{"$f":"COUNTIFS(Output!$W$5:$W$36,Indoor!A105,Output!$V$6:$V$37,Indoor!BD105)","v":0},7.3999999999999996E-2,6.2E-2,6.8000000000000005E-2,{"$f":"(((BF105*Database!$U$3)+(BG105*Database!$V$3)+(BH105*Database!$W$3))*BE105)","v":0},0]
[{"$f":"Lists!$F$4","v":"Horizontal Ducted"},80,{"$f":"COUNTIFS(Output!$E$5:$E$36,Indoor!A106,Output!$D$6:$D$37,Indoor!B106)","v":0},0.11799999999999999,0.106,0.11199999999999999,{"$f":"(((D106*Database!$U$3)+(E106*Database!$V$3)+(F106*Database!$W$3))*C106)","v":0},80,{"$f":"COUNTIFS(Output!$G$5:$G$36,Indoor!A106,Output!$F$6:$F$37,Indoor!H106)","v":0},0.11799999999999999,0.106,0.11199999999999999,{"$f":"(((J106*Database!$U$3)+(K106*Database!$V$3)+(L106*Database!$W$3))*I106)","v":0},80,{"$f":"COUNTIFS(Output!$I$5:$I$36,Indoor!A106,Output!$H$6:$H$37,Indoor!N106)","v":0},0.11799999999999999,0.106,0.11199999999999999,{"$f":"(((P106*Database!$U$3)+(Q106*Database!$V$3)+(R106*Database!$W$3))*O106)","v":0},80,{"$f":"COUNTIFS(Output!$K$5:$K$36,Indoor!A106,Output!$J$6:$J$37,Indoor!T106)","v":0},0.11799999999999999,0.106,0.11199999999999999,{"$f":"(((V106*Database!$U$3)+(W106*Database!$V$3)+(X106*Database!$W$3))*U106)","v":0},80,{"$f":"COUNTIFS(Output!$M$5:$M$36,Indoor!A106,Output!$L$6:$L$37,Indoor!Z106)","v":0},0.11799999999999999,0.106,0.11199999999999999,{"$f":"(((AB106*Database!$U$3)+(AC106*Database!$V$3)+(AD106*Database!$W$3))*AA106)","v":0},80,{"$f":"COUNTIFS(Output!$O$5:$O$36,Indoor!A106,Output!$N$6:$N$37,Indoor!AF106)","v":0},0.11799999999999999,0.106,0.11199999999999999,{"$f":"(((AH106*Database!$U$3)+(AI106*Database!$V$3)+(AJ106*Database!$W$3))*AG106)","v":0},80,{"$f":"COUNTIFS(Output!$Q$5:$Q$36,Indoor!A106,Output!$P$6:$P$37,Indoor!AL106)","v":0},0.11799999999999999,0.106,0.11199999999999999,{"$f":"(((AN106*Database!$U$3)+(AO106*Database!$V$3)+(AP106*Database!$W$3))*AM106)","v":0},80,{"$f":"COUNTIFS(Output!$S$5:$S$36,Indoor!A106,Output!$R$6:$R$37,Indoor!AR106)","v":0},0.11799999999999999,0.106,0.11199999999999999,{"$f":"(((AT106*Database!$U$3)+(AU106*Database!$V$3)+(AV106*Database!$W$3))*AS106)","v":0},80,{"$f":"COUNTIFS(Output!$U$5:$U$36,Indoor!A106,Output!$T$6:$T$37,Indoor!AX106)","v":0},0.11799999999999999,0.106,0.11199999999999999,{"$f":"(((AZ106*Database!$U$3)+(BA106*Database!$V$3)+(BB106*Database!$W$3))*AY106)","v":0},80,{"$f":"COUNTIFS(Output!$W$5:$W$36,Indoor!A106,Output!$V$6:$V$37,Indoor!BD106)","v":0},0.11799999999999999,0.106,0.11199999999999999,{"$f":"(((BF106*Database!$U$3)+(BG106*Database!$V$3)+(BH106*Database!$W$3))*BE106)","v":0},0]
[{"$f":"Lists!$F$4","v":"Horizontal Ducted"},100,{"$f":"COUNTIFS(Output!$E$5:$E$36,Indoor!A107,Output!$D$6:$D$37,Indoor!B107)","v":0},0.11700000000000001,0.105,0.111,{"$f":"(((D107*Database!$U$3)+(E107*Database!$V$3)+(F107*Database!$W$3))*C107)","v":0},100,{"$f":"COUNTIFS(Output!$G$5:$G$36,Indoor!A107,Output!$F$6:$F$37,Indoor!H107)","v":0},0.11700000000000001,0.105,0.111,{"$f":"(((J107*Database!$U$3)+(K107*Database!$V$3)+(L107*Database!$W$3))*I107)","v":0},100,{"$f":"COUNTIFS(Output!$I$5:$I$36,Indoor!A107,Output!$H$6:$H$37,Indoor!N107)","v":0},0.11700000000000001,0.105,0.111,{"$f":"(((P107*Database!$U$3)+(Q107*Database!$V$3)+(R107*Database!$W$3))*O107)","v":0},100,{"$f":"COUNTIFS(Output!$K$5:$K$36,Indoor!A107,Output!$J$6:$J$37,Indoor!T107)","v":0},0.11700000000000001,0.105,0.111,{"$f":"(((V107*Database!$U$3)+(W107*Database!$V$3)+(X107*Database!$W$3))*U107)","v":0},100,{"$f":"COUNTIFS(Output!$M$5:$M$36,Indoor!A107,Output!$L$6:$L$37,Indoor!Z107)","v":0},0.11700000000000001,0.105,0.111,{"$f":"(((AB107*Database!$U$3)+(AC107*Database!$V$3)+(AD107*Database!$W$3))*AA107)","v":0},100,{"$f":"COUNTIFS(Output!$O$5:$O$36,Indoor!A107,Output!$N$6:$N$37,Indoor!AF107)","v":0},0.11700000000000001,0.105,0.111,{"$f":"(((AH107*Database!$U$3)+(AI107*Database!$V$3)+(AJ107*Database!$W$3))*AG107)","v":0},100,{"$f":"COUNTIFS(Output!$Q$5:$Q$36,Indoor!A107,Output!$P$6:$P$37,Indoor!AL107)","v":0},0.11700000000000001,0.105,0.111,{"$f":"(((AN107*Database!$U$3)+(AO107*Database!$V$3)+(AP107*Database!$W$3))*AM107)","v":0},100,{"$f":"COUNTIFS(Output!$S$5:$S$36,Indoor!A107,Output!$R$6:$R$37,Indoor!AR107)","v":0},0.11700000000000001,0.105,0.111,{"$f":"(((AT107*Database!$U$3)+(AU107*Database!$V$3)+(AV107*Database!$W$3))*AS107)","v":0},100,{"$f":"COUNTIFS(Output!$U$5:$U$36,Indoor!A107,Output!$T$6:$T$37,Indoor!AX107)","v":0},0.11700000000000001,0.105,0.111,{"$f":"(((AZ107*Database!$U$3)+(BA107*Database!$V$3)+(BB107*Database!$W$3))*AY107)","v":0},100,{"$f":"COUNTIFS(Output!$W$5:$W$36,Indoor!A107,Output!$V$6:$V$37,Indoor!BD107)","v":0},0.11700000000000001,0.105,0.111,{"$f":"(((BF107*Database!$U$3)+(BG107*Database!$V$3)+(BH107*Database!$W$3))*BE107)","v":0},0]
[{"$f":"Lists!$F$4","v":"Horizontal Ducted"},125,{"$f":"COUNTIFS(Output!$E$5:$E$36,Indoor!A108,Output!$D$6:$D$37,Indoor!B108)","v":0},0.185,0.17299999999999999,0.17899999999999999,{"$f":"(((D108*Database!$U$3)+(E108*Database!$V$3)+(F108*Database!$W$3))*C108)","v":0},125,{"$f":"COUNTIFS(Output!$G$5:$G$36,Indoor!A108,Output!$F$6:$F$37,Indoor!H108)","v":0},0.185,0.17299999999999999,0.17899999999999999,{"$f":"(((J108*Database!$U$3)+(K108*Database!$V$3)+(L108*Database!$W$3))*I108)","v":0},125,{"$f":"COUNTIFS(Output!$I$5:$I$36,Indoor!A108,Output!$H$6:$H$37,Indoor!N108)","v":0},0.185,0.17299999999999999,0.17899999999999999,{"$f":"(((P108*Database!$U$3)+(Q108*Database!$V$3)+(R108*Database!$W$3))*O108)","v":0},125,{"$f":"COUNTIFS(Output!$K$5:$K$36,Indoor!A108,Output!$J$6:$J$37,Indoor!T108)","v":0},0.185,0.17299999999999999,0.17899999999999999,{"$f":"(((V108*Database!$U$3)+(W108*Database!$V$3)+(X108*Database!$W$3))*U108)","v":0},125,{"$f":"COUNTIFS(Output!$M$5:$M$36,Indoor!A108,Output!$L$6:$L$37,Indoor!Z108)","v":0},0.185,0.17299999999999999,0.17899999999999999,{"$f":"(((AB108*Database!$U$3)+(AC108*Database!$V$3)+(AD108*Database!$W$3))*AA108)","v":0},125,{"$f":"COUNTIFS(Output!$O$5:$O$36,Indoor!A108,Output!$N$6:$N$37,Indoor!AF108)","v":0},0.185,0.17299999999999999,0.17899999999999999,{"$f":"(((AH108*Database!$U$3)+(AI108*Database!$V$3)+(AJ108*Database!$W$3))*AG108)","v":0},125,{"$f":"COUNTIFS(Output!$Q$5:$Q$36,Indoor!A108,Output!$P$6:$P$37,Indoor!AL108)","v":0},0.185,0.17299999999999999,0.17899999999999999,{"$f":"(((AN108*Database!$U$3)+(AO108*Database!$V$3)+(AP108*Database!$W$3))*AM108)","v":0},125,{"$f":"COUNTIFS(Output!$S$5:$S$36,Indoor!A108,Output!$R$6:$R$37,Indoor!AR108)","v":0},0.185,0.17299999999999999,0.17899999999999999,{"$f":"(((AT108*Database!$U$3)+(AU108*Database!$V$3)+(AV108*Database!$W$3))*AS108)","v":0},125,{"$f":"COUNTIFS(Output!$U$5:$U$36,Indoor!A108,Output!$T$6:$T$37,Indoor!AX108)","v":0},0.185,0.17299999999999999,0.17899999999999999,{"$f":"(((AZ108*Database!$U$3)+(BA108*Database!$V$3)+(BB108*Database!$W$3))*AY108)","v":0},125,{"$f":"COUNTIFS(Output!$W$5:$W$36,Indoor!A108,Output!$V$6:$V$37,Indoor!BD108)","v":0},0.185,0.17299999999999999,0.17899999999999999,{"$f":"(((BF108*Database!$U$3)+(BG108*Database!$V$3)+(BH108*Database!$W$3))*BE108)","v":0},0]
[{"$f":"Lists!$F$4","v":"Horizontal Ducted"},200,{"$f":"COUNTIFS(Output!$E$5:$E$36,Indoor!A109,Output!$D$6:$D$37,Indoor!B109)","v":0},null,null,0,{"$f":"(((D109*Database!$U$3)+(E109*Database!$V$3)+(F109*Database!$W$3))*C109)","v":0},200,{"$f":"COUNTIFS(Output!$G$5:$G$36,Indoor!A109,Output!$F$6:$F$37,Indoor!H109)","v":0},0,0,0,{"$f":"(((J109*Database!$U$3)+(K109*Database!$V$3)+(L109*Database!$W$3))*I109)","v":0},200,{"$f":"COUNTIFS(Output!$I$5:$I$36,Indoor!A109,Output!$H$6:$H$37,Indoor!N109)","v":0},0,0,0,{"$f":"(((P109*Database!$U$3)+(Q109*Database!$V$3)+(R109*Database!$W$3))*O109)","v":0},200,{"$f":"COUNTIFS(Output!$K$5:$K$36,Indoor!A109,Output!$J$6:$J$37,Indoor!T109)","v":0},0,0,0,{"$f":"(((V109*Database!$U$3)+(W109*Database!$V$3)+(X109*Database!$W$3))*U109)","v":0},200,{"$f":"COUNTIFS(Output!$M$5:$M$36,Indoor!A109,Output!$L$6:$L$37,Indoor!Z109)","v":0},0,0,0,{"$f":"(((AB109*Database!$U$3)+(AC109*Database!$V$3)+(AD109*Database!$W$3))*AA109)","v":0},200,{"$f":"COUNTIFS(Output!$O$5:$O$36,Indoor!A109,Output!$N$6:$N$37,Indoor!AF109)","v":0},0,0,0,{"$f":"(((AH109*Database!$U$3)+(AI109*Database!$V$3)+(AJ109*Database!$W$3))*AG109)","v":0},200,{"$f":"COUNTIFS(Output!$Q$5:$Q$36,Indoor!A109,Output!$P$6:$P$37,Indoor!AL109)","v":0},0,0,0,{"$f":"(((AN109*Database!$U$3)+(AO109*Database!$V$3)+(AP109*Database!$W$3))*AM109)","v":0},200,{"$f":"COUNTIFS(Output!$S$5:$S$36,Indoor!A109,Output!$R$6:$R$37,Indoor!AR109)","v":0},0,0,0,{"$f":"(((AT109*Database!$U$3)+(AU109*Database!$V$3)+(AV109*Database!$W$3))*AS109)","v":0},200,{"$f":"COUNTIFS(Output!$U$5:$U$36,Indoor!A109,Output!$T$6:$T$37,Indoor!AX109)","v":0},0,0,0,{"$f":"(((AZ109*Database!$U$3)+(BA109*Database!$V$3)+(BB109*Database!$W$3))*AY109)","v":0},200,{"$f":"COUNTIFS(Output!$W$5:$W$36,Indoor!A109,Output!$V$6:$V$37,Indoor!BD109)","v":0},0,0,0,{"$f":"(((BF109*Database!$U$3)+(BG109*Database!$V$3)+(BH109*Database!$W$3))*BE109)","v":0},0]
[{"$f":"Lists!$F$4","v":"Horizontal Ducted"},250,{"$f":"COUNTIFS(Output!$E$5:$E$36,Indoor!A110,Output!$D$6:$D$37,Indoor!B110)","v":0},null,null,0,{"$f":"(((D110*Database!$U$3)+(E110*Database!$V$3)+(F110*Database!$W$3))*C110)","v":0},250,{"$f":"COUNTIFS(Output!$G$5:$G$36,Indoor!A110,Output!$F$6:$F$37,Indoor!H110)","v":0},0,0,0,{"$f":"(((J110*Database!$U$3)+(K110*Database!$V$3)+(L110*Database!$W$3))*I110)","v":0},250,{"$f":"COUNTIFS(Output!$I$5:$I$36,Indoor!A110,Output!$H$6:$H$37,Indoor!N110)","v":0},0,0,0,{"$f":"(((P110*Database!$U$3)+(Q110*Database!$V$3)+(R110*Database!$W$3))*O110)","v":0},250,{"$f":"COUNTIFS(Output!$K$5:$K$36,Indoor!A110,Output!$J$6:$J$37,Indoor!T110)","v":0},0,0,0,{"$f":"(((V110*Database!$U$3)+(W110*Database!$V$3)+(X110*Database!$W$3))*U110)","v":0},250,{"$f":"COUNTIFS(Output!$M$5:$M$36,Indoor!A110,Output!$L$6:$L$37,Indoor!Z110)","v":0},0,0,0,{"$f":"(((AB110*Database!$U$3)+(AC110*Database!$V$3)+(AD110*Database!$W$3))*AA110)","v":0},250,{"$f":"COUNTIFS(Output!$O$5:$O$36,Indoor!A110,Output!$N$6:$N$37,Indoor!AF110)","v":0},0,0,0,{"$f":"(((AH110*Database!$U$3)+(AI110*Database!$V$3)+(AJ110*Database!$W$3))*AG110)","v":0},250,{"$f":"COUNTIFS(Output!$Q$5:$Q$36,Indoor!A110,Output!$P$6:$P$37,Indoor!AL110)","v":0},0,0,0,{"$f":"(((AN110*Database!$U$3)+(AO110*Database!$V$3)+(AP110*Database!$W$3))*AM110)","v":0},250,{"$f":"COUNTIFS(Output!$S$5:$S$36,Indoor!A110,Output!$R$6:$R$37,Indoor!AR110)","v":0},0,0,0,{"$f":"(((AT110*Database!$U$3)+(AU110*Database!$V$3)+(AV110*Database!$W$3))*AS110)","v":0},250,{"$f":"COUNTIFS(Output!$U$5:$U$36,Indoor!A110,Output!$T$6:$T$37,Indoor!AX110)","v":0},0,0,0,{"$f":"(((AZ110*Database!$U$3)+(BA110*Database!$V$3)+(BB110*Database!$W$3))*AY110)","v":0},250,{"$f":"COUNTIFS(Output!$W$5:$W$36,Indoor!A110,Output!$V$6:$V$37,Indoor!BD110)","v":0},0,0,0,{"$f":"(((BF110*Database!$U$3)+(BG110*Database!$V$3)+(BH110*Database!$W$3))*BE110)","v":0},0]
["FXHQ",null,{"$f":"SUM(C100:C110)","v":1},null,null,null,null,null,{"$f":"SUM(I100:I110)","v":0},null,null,null,null,null,{"$f":"SUM(O100:O110)","v":0},null,null,null,null,null,{"$f":"SUM(U100:U110)","v":0},null,null,null,null,null,{"$f":"SUM(AA100:AA110)","v":0},null,null,null,null,null,{"$f":"SUM(AG100:AG110)","v":0},null,null,null,null,null,{"$f":"SUM(AM100:AM110)","v":0},null,null,null,null,null,{"$f":"SUM(AS100:AS110)","v":0},null,null,null,null,null,{"$f":"SUM(AY100:AY110)","v":0},null,null,null,null,null,{"$f":"SUM(BE100:BE110)","v":0}]
[{"$f":"Lists!$F$5","v":"Ceiling Suspended"},20,{"$f":"COUNTIFS(Output!$E$5:$E$36,Indoor!A112,Output!$D$6:$D$37,Indoor!B112)","v":0},null,null,0,{"$f":"(((D112*Database!$U$3)+(E112*Database!$V$3)+(F112*Database!$W$3))*C112)","v":0},20,{"$f":"COUNTIFS(Output!$G$5:$G$36,Indoor!A112,Output!$F$6:$F$37,Indoor!H112)","v":0},{"$f":"D112","v":0},{"$f":"E112","v":0},{"$f":"F112","v":0},{"$f":"(((J112*Database!$U$3)+(K112*Database!$V$3)+(L112*Database!$W$3))*I112)","v":0},20,{"$f":"COUNTIFS(Output!$I$5:$I$36,Indoor!A112,Output!$H$6:$H$37,Indoor!N112)","v":0},{"$f":"D112","v":0},{"$f":"E112","v":0},{"$f":"F112","v":0},{"$f":"(((P112*Database!$U$3)+(Q112*Database!$V$3)+(R112*Database!$W$3))*O112)","v":0},20,{"$f":"COUNTIFS(Output!$K$5:$K$36,Indoor!A112,Output!$J$6:$J$37,Indoor!T112)","v":0},{"$f":"D112","v":0},{"$f":"E112","v":0},{"$f":"F112","v":0},{"$f":"(((V112*Database!$U$3)+(W112*Database!$V$3)+(X112*Database!$W$3))*U112)","v":0},20,{"$f":"COUNTIFS(Output!$M$5:$M$36,Indoor!A112,Output!$L$6:$L$37,Indoor!Z112)","v":0},{"$f":"D112","v":0},{"$f":"E112","v":0},{"$f":"F112","v":0},{"$f":"(((AB112*Database!$U$3)+(AC112*Database!$V$3)+(AD112*Database!$W$3))*AA112)","v":0},20,{"$f":"COUNTIFS(Output!$O$5:$O$36,Indoor!A112,Output!$N$6:$N$37,Indoor!AF112)","v":0},{"$f":"D112","v":0},{"$f":"E112","v":0},{"$f":"F112","v":0},{"$f":"(((AH112*Database!$U$3)+(AI112*Database!$V$3)+(AJ112*Database!$W$3))*AG112)","v":0},20,{"$f":"COUNTIFS(Output!$Q$5:$Q$36,Indoor!A112,Output!$P$6:$P$37,Indoor!AL112)","v":0},{"$f":"D112","v":0},{"$f":"E112","v":0},{"$f":"F112","v":0},{"$f":"(((AN112*Database!$U$3)+(AO112*Database!$V$3)+(AP112*Database!$W$3))*AM112)","v":0},20,{"$f":"COUNTIFS(Output!$S$5:$S$36,Indoor!A112,Output!$R$6:$R$37,Indoor!AR112)","v":0},{"$f":"D112","v":0},{"$f":"E112","v":0},{"$f":"F112","v":0},{"$f":"(((AT112*Database!$U$3)+(AU112*Database!$V$3)+(AV112*Database!$W$3))*AS112)","v":0},20,{"$f":"COUNTIFS(Output!$U$5:$U$36,Indoor!A112,Output!$T$6:$T$37,Indoor!AX112)","v":0},{"$f":"D112","v":0},{"$f":"E112","v":0},{"$f":"F112","v":0},{"$f":"(((AZ112*Database!$U$3)+(BA112*Database!$V$3)+(BB112*Database!$W$3))*AY112)","v":0},20,{"$f":"COUNTIFS(Output!$W$5:$W$36,Indoor!A112,Output!$V$6:$V$37,Indoor!BD112)","v":0},{"$f":"D112","v":0},{"$f":"E112","v":0},{"$f":"F112","v":0},{"$f":"(((BF112*Database!$U$3)+(BG112*Database!$V$3)+(BH112*Database!$W$3))*BE112)","v":0},{"$f":"SUM(BE112+AY112+AS112+AM112+AG112+AA112+U112+O112+I112+C112)","v":0}]
[{"$f":"Lists!$F$5","v":"Ceiling Suspended"},25,{"$f":"COUNTIFS(Output!$E$5:$E$36,Indoor!A113,Output!$D$6:$D$37,Indoor!B113)","v":0},null,null,0,{"$f":"(((D113*Database!$U$3)+(E113*Database!$V$3)+(F113*Database!$W$3))*C113)","v":0},25,{"$f":"COUNTIFS(Output!$G$5:$G$36,Indoor!A113,Output!$F$6:$F$37,Indoor!H113)","v":0},0,0,0,{"$f":"(((J113*Database!$U$3)+(K113*Database!$V$3)+(L113*Database!$W$3))*I113)","v":0},25,{"$f":"COUNTIFS(Output!$I$5:$I$36,Indoor!A113,Output!$H$6:$H$37,Indoor!N113)","v":0},0,0,0,{"$f":"(((P113*Database!$U$3)+(Q113*Database!$V$3)+(R113*Database!$W$3))*O113)","v":0},25,{"$f":"COUNTIFS(Output!$K$5:$K$36,Indoor!A113,Output!$J$6:$J$37,Indoor!T113)","v":0},0,0,0,{"$f":"(((V113*Database!$U$3)+(W113*Database!$V$3)+(X113*Database!$W$3))*U113)","v":0},25,{"$f":"COUNTIFS(Output!$M$5:$M$36,Indoor!A113,Output!$L$6:$L$37,Indoor!Z113)","v":0},0,0,0,{"$f":"(((AB113*Database!$U$3)+(AC113*Database!$V$3)+(AD113*Database!$W$3))*AA113)","v":0},25,{"$f":"COUNTIFS(Output!$O$5:$O$36,Indoor!A113,Output!$N$6:$N$37,Indoor!AF113)","v":0},0,0,0,{"$f":"(((AH113*Database!$U$3)+(AI113*Database!$V$3)+(AJ113*Database!$W$3))*AG113)","v":0},25,{"$f":"COUNTIFS(Output!$Q$5:$Q$36,Indoor!A113,Output!$P$6:$P$37,Indoor!AL113)","v":0},0,0,0,{"$f":"(((AN113*Database!$U$3)+(AO113*Database!$V$3)+(AP113*Database!$W$3))*AM113)","v":0},25,{"$f":"COUNTIFS(Output!$S$5:$S$36,Indoor!A113,Output!$R$6:$R$37,Indoor!AR113)","v":0},0,0,0,{"$f":"(((AT113*Database!$U$3)+(AU113*Database!$V$3)+(AV113*Database!$W$3))*AS113)","v":0},25,{"$f":"COUNTIFS(Output!$U$5:$U$36,Indoor!A113,Output!$T$6:$T$37,Indoor!AX113)","v":0},0,0,0,{"$f":"(((AZ113*Database!$U$3)+(BA113*Database!$V$3)+(BB113*Database!$W$3))*AY113)","v":0},25,{"$f":"COUNTIFS(Output!$W$5:$W$36,Indoor!A113,Output!$V$6:$V$37,Indoor!BD113)","v":0},0,0,0,{"$f":"(((BF113*Database!$U$3)+(BG113*Database!$V$3)+(BH113*Database!$W$3))*BE113)","v":0},0]
[{"$f":"Lists!$F$5","v":"Ceiling Suspended"},31.25,{"$f":"COUNTIFS(Output!$E$5:$E$36,Indoor!A114,Output!$D$6:$D$37,Indoor!B114)","v":0},0.111,0.111,0.111,{"$f":"(((D114*Database!$U$3)+(E114*Database!$V$3)+(F114*Database!$W$3))*C114)","v":0},31.25,{"$f":"COUNTIFS(Output!$G$5:$G$36,Indoor!A114,Output!$F$6:$F$37,Indoor!H114)","v":0},0.111,0.111,0.111,{"$f":"(((J114*Database!$U$3)+(K114*Database!$V$3)+(L114*Database!$W$3))*I114)","v":0},31.25,{"$f":"COUNTIFS(Output!$I$5:$I$36,Indoor!A114,Output!$H$6:$H$37,Indoor!N114)","v":0},0.111,0.111,0.111,{"$f":"(((P114*Database!$U$3)+(Q114*Database!$V$3)+(R114*Database!$W$3))*O114)","v":0},31.25,{"$f":"COUNTIFS(Output!$K$5:$K$36,Indoor!A114,Output!$J$6:$J$37,Indoor!T114)","v":0},0.111,0.111,0.111,{"$f":"(((V114*Database!$U$3)+(W114*Database!$V$3)+(X114*Database!$W$3))*U114)","v":0},31.25,{"$f":"COUNTIFS(Output!$M$5:$M$36,Indoor!A114,Output!$L$6:$L$37,Indoor!Z114)","v":0},0.111,0.111,0.111,{"$f":"(((AB114*Database!$U$3)+(AC114*Database!$V$3)+(AD114*Database!$W$3))*AA114)","v":0},31.25,{"$f":"COUNTIFS(Output!$O$5:$O$36,Indoor!A114,Output!$N$6:$N$37,Indoor!AF114)","v":0},0.111,0.111,0.111,{"$f":"(((AH114*Database!$U$3)+(AI114*Database!$V$3)+(AJ114*Database!$W$3))*AG114)","v":0},31.25,{"$f":"COUNTIFS(Output!$Q$5:$Q$36,Indoor!A114,Output!$P$6:$P$37,Indoor!AL114)","v":0},0.111,0.111,0.111,{"$f":"(((AN114*Database!$U$3)+(AO114*Database!$V$3)+(AP114*Database!$W$3))*AM114)","v":0},31.25,{"$f":"COUNTIFS(Output!$S$5:$S$36,Indoor!A114,Output!$R$6:$R$37,Indoor!AR114)","v":0},0.111,0.111,0.111,{"$f":"(((AT114*Database!$U$3)+(AU114*Database!$V$3)+(AV114*Database!$W$3))*AS114)","v":0},31.25,{"$f":"COUNTIFS(Output!$U$5:$U$36,Indoor!A114,Output!$T$6:$T$37,Indoor!AX114)","v":0},0.111,0.111,0.111,{"$f":"(((AZ114*Database!$U$3)+(BA114*Database!$V$3)+(BB114*Database!$W$3))*AY114)","v":0},31.25,{"$f":"COUNTIFS(Output!$W$5:$W$36,Indoor!A114,Output!$V$6:$V$37,Indoor!BD114)","v":0},0.111,0.111,0.111,{"$f":"(((BF114*Database!$U$3)+(BG114*Database!$V$3)+(BH114*Database!$W$3))*BE114)","v":0},0]
[{"$f":"Lists!$F$5","v":"Ceiling Suspended"},40,{"$f":"COUNTIFS(Output!$E$5:$E$36,Indoor!A115,Output!$D$6:$D$37,Indoor!B115)","v":0},null,null,0,{"$f":"(((D115*Database!$U$3)+(E115*Database!$V$3)+(F115*Database!$W$3))*C115)","v":0},40,{"$f":"COUNTIFS(Output!$G$5:$G$36,Indoor!A115,Output!$F$6:$F$37,Indoor!H115)","v":0},0,0,0,{"$f":"(((J115*Database!$U$3)+(K115*Database!$V$3)+(L115*Database!$W$3))*I115)","v":0},40,{"$f":"COUNTIFS(Output!$I$5:$I$36,Indoor!A115,Output!$H$6:$H$37,Indoor!N115)","v":0},0,0,0,{"$f":"(((P115*Database!$U$3)+(Q115*Database!$V$3)+(R115*Database!$W$3))*O115)","v":0},40,{"$f":"COUNTIFS(Output!$K$5:$K$36,Indoor!A115,Output!$J$6:$J$37,Indoor!T115)","v":0},0,0,0,{"$f":"(((V115*Database!$U$3)+(W115*Database!$V$3)+(X115*Database!$W$3))*U115)","v":0},40,{"$f":"COUNTIFS(Output!$M$5:$M$36,Indoor!A115,Output!$L$6:$L$37,Indoor!Z115)","v":0},0,0,0,{"$f":"(((AB115*Database!$U$3)+(AC115*Database!$V$3)+(AD115*Database!$W$3))*AA115)","v":0},40,{"$f":"COUNTIFS(Output!$O$5:$O$36,Indoor!A115,Output!$N$6:$N$37,Indoor!AF115)","v":0},0,0,0,{"$f":"(((AH115*Database!$U$3)+(AI115*Database!$V$3)+(AJ115*Database!$W$3))*AG115)","v":0},40,{"$f":"COUNTIFS(Output!$Q$5:$Q$36,Indoor!A115,Output!$P$6:$P$37,Indoor!AL115)","v":0},0,0,0,{"$f":"(((AN115*Database!$U$3)+(AO115*Database!$V$3)+(AP115*Database!$W$3))*AM115)","v":0},40,{"$f":"COUNTIFS(Output!$S$5:$S$36,Indoor!A115,Output!$R$6:$R$37,Indoor!AR115)","v":0},0,0,0,{"$f":"(((AT115*Database!$U$3)+(AU115*Database!$V$3)+(AV115*Database!$W$3))*AS115)","v":0},40,{"$f":"COUNTIFS(Output!$U$5:$U$36,Indoor!A115,Output!$T$6:$T$37,Indoor!AX115)","v":0},0,0,0,{"$f":"(((AZ115*Database!$U$3)+(BA115*Database!$V$3)+(BB115*Database!$W$3))*AY115)","v":0},40,{"$f":"COUNTIFS(Output!$W$5:$W$36,Indoor!A115,Output!$V$6:$V$37,Indoor!BD115)","v":0},0,0,0,{"$f":"(((BF115*Database!$U$3)+(BG115*Database!$V$3)+(BH115*Database!$W$3))*BE115)","v":0},0]
[{"$f":"Lists!$F$5","v":"Ceiling Suspended"},50,{"$f":"COUNTIFS(Output!$E$5:$E$36,Indoor!A116,Output!$D$6:$D$37,Indoor!B116)","v":0},null,null,0,{"$f":"(((D116*Database!$U$3)+(E116*Database!$V$3)+(F116*Database!$W$3))*C116)","v":0},50,{"$f":"COUNTIFS(Output!$G$5:$G$36,Indoor!A116,Output!$F$6:$F$37,Indoor!H116)","v":0},0,0,0,{"$f":"(((J116*Database!$U$3)+(K116*Database!$V$3)+(L116*Database!$W$3))*I116)","v":0},50,{"$f":"COUNTIFS(Output!$I$5:$I$36,Indoor!A116,Output!$H$6:$H$37,Indoor!N116)","v":0},0,0,0,{"$f":"(((P116*Database!$U$3)+(Q116*Database!$V$3)+(R116*Database!$W$3))*O116)","v":0},50,{"$f":"COUNTIFS(Output!$K$5:$K$36,Indoor!A116,Output!$J$6:$J$37,Indoor!T116)","v":0},0,0,0,{"$f":"(((V116*Database!$U$3)+(W116*Database!$V$3)+(X116*Database!$W$3))*U116)","v":0},50,{"$f":"COUNTIFS(Output!$M$5:$M$36,Indoor!A116,Output!$L$6:$L$37,Indoor!Z116)","v":0},0,0,0,{"$f":"(((AB116*Database!$U$3)+(AC116*Database!$V$3)+(AD116*Database!$W$3))*AA116)","v":0},50,{"$f":"COUNTIFS(Output!$O$5:$O$36,Indoor!A116,Output!$N$6:$N$37,Indoor!AF116)","v":0},0,0,0,{"$f":"(((AH116*Database!$U$3)+(AI116*Database!$V$3)+(AJ116*Database!$W$3))*AG116)","v":0},50,{"$f":"COUNTIFS(Output!$Q$5:$Q$36,Indoor!A116,Output!$P$6:$P$37,Indoor!AL116)","v":0},0,0,0,{"$f":"(((AN116*Database!$U$3)+(AO116*Database!$V$3)+(AP116*Database!$W$3))*AM116)","v":0},50,{"$f":"COUNTIFS(Output!$S$5:$S$36,Indoor!A116,Output!$R$6:$R$37,Indoor!AR116)","v":0},0,0,0,{"$f":"(((AT116*Database!$U$3)+(AU116*Database!$V$3)+(AV116*Database!$W$3))*AS116)","v":0},50,{"$f":"COUNTIFS(Output!$U$5:$U$36,Indoor!A116,Output!$T$6:$T$37,Indoor!AX116)","v":0},0,0,0,{"$f":"(((AZ116*Database!$U$3)+(BA116*Database!$V$3)+(BB116*Database!$W$3))*AY116)","v":0},50,{"$f":"COUNTIFS(Output!$W$5:$W$36,Indoor!A116,Output!$V$6:$V$37,Indoor!BD116)","v":0},0,0,0,{"$f":"(((BF116*Database!$U$3)+(BG116*Database!$V$3)+(BH116*Database!$W$3))*BE116)","v":0},0]
[{"$f":"Lists!$F$5","v":"Ceiling Suspended"},63,{"$f":"COUNTIFS(Output!$E$5:$E$36,Indoor!A117,Output!$D$6:$D$37,Indoor!B117)","v":1},0.115,0.115,0.115,{"$f":"(((D117*Database!$U$3)+(E117*Database!$V$3)+(F117*Database!$W$3))*C117)","v":103.4425},63,{"$f":"COUNTIFS(Output!$G$5:$G$36,Indoor!A117,Output!$F$6:$F$37,Indoor!H117)","v":0},0.115,0.115,0.115,{"$f":"(((J117*Database!$U$3)+(K117*Database!$V$3)+(L117*Database!$W$3))*I117)","v":0},63,{"$f":"COUNTIFS(Output!$I$5:$I$36,Indoor!A117,Output!$H$6:$H$37,Indoor!N117)","v":0},0.115,0.115,0.115,{"$f":"(((P117*Database!$U$3)+(Q117*Database!$V$3)+(R117*Database!$W$3))*O117)","v":0},63,{"$f":"COUNTIFS(Output!$K$5:$K$36,Indoor!A117,Output!$J$6:$J$37,Indoor!T117)","v":0},0.115,0.115,0.115,{"$f":"(((V117*Database!$U$3)+(W117*Database!$V$3)+(X117*Database!$W$3))*U117)","v":0},63,{"$f":"COUNTIFS(Output!$M$5:$M$36,Indoor!A117,Output!$L$6:$L$37,Indoor!Z117)","v":0},0.115,0.115,0.115,{"$f":"(((AB117*Database!$U$3)+(AC117*Database!$V$3)+(AD117*Database!$W$3))*AA117)","v":0},63,{"$f":"COUNTIFS(Output!$O$5:$O$36,Indoor!A117,Output!$N$6:$N$37,Indoor!AF117)","v":0},0.115,0.115,0.115,{"$f":"(((AH117*Database!$U$3)+(AI117*Database!$V$3)+(AJ117*Database!$W$3))*AG117)","v":0},63,{"$f":"COUNTIFS(Output!$Q$5:$Q$36,Indoor!A117,Output!$P$6:$P$37,Indoor!AL117)","v":0},0.115,0.115,0.115,{"$f":"(((AN117*Database!$U$3)+(AO117*Database!$V$3)+(AP117*Database!$W$3))*AM117)","v":0},63,{"$f":"COUNTIFS(Output!$S$5:$S$36,Indoor!A117,Output!$R$6:$R$37,Indoor!AR117)","v":0},0.115,0.115,0.115,{"$f":"(((AT117*Database!$U$3)+(AU117*Database!$V$3)+(AV117*Database!$W$3))*AS117)","v":0},63,{"$f":"COUNTIFS(Output!$U$5:$U$36,Indoor!A117,Output!$T$6:$T$37,Indoor!AX117)","v":0},0.115,0.115,0.115,{"$f":"(((AZ117*Database!$U$3)+(BA117*Database!$V$3)+(BB117*Database!$W$3))*AY117)","v":0},63,{"$f":"COUNTIFS(Output!$W$5:$W$36,Indoor!A117,Output!$V$6:$V$37,Indoor!BD117)","v":0},0.115,0.115,0.115,{"$f":"(((BF117*Database!$U$3)+(BG117*Database!$V$3)+(BH117*Database!$W$3))*BE117)","v":0},1]
[{"$f":"Lists!$F$5","v":"Ceiling Suspended"},80,{"$f":"COUNTIFS(Output!$E$5:$E$36,Indoor!A118,Output!$D$6:$D$37,Indoor!B118)","v":0},null,null,0,{"$f":"(((D118*Database!$U$3)+(E118*Database!$V$3)+(F118*Database!$W$3))*C118)","v":0},80,{"$f":"COUNTIFS(Output!$G$5:$G$36,Indoor!A118,Output!$F$6:$F$37,Indoor!H118)","v":0},0,0,0,{"$f":"(((J118*Database!$U$3)+(K118*Database!$V$3)+(L118*Database!$W$3))*I118)","v":0},80,{"$f":"COUNTIFS(Output!$I$5:$I$36,Indoor!A118,Output!$H$6:$H$37,Indoor!N118)","v":0},0,0,0,{"$f":"(((P118*Database!$U$3)+(Q118*Database!$V$3)+(R118*Database!$W$3))*O118)","v":0},80,{"$f":"COUNTIFS(Output!$K$5:$K$36,Indoor!A118,Output!$J$6:$J$37,Indoor!T118)","v":0},0,0,0,{"$f":"(((V118*Database!$U$3)+(W118*Database!$V$3)+(X118*Database!$W$3))*U118)","v":0},80,{"$f":"COUNTIFS(Output!$M$5:$M$36,Indoor!A118,Output!$L$6:$L$37,Indoor!Z118)","v":0},0,0,0,{"$f":"(((AB118*Database!$U$3)+(AC118*Database!$V$3)+(AD118*Database!$W$3))*AA118)","v":0},80,{"$f":"COUNTIFS(Output!$O$5:$O$36,Indoor!A118,Output!$N$6:$N$37,Indoor!AF118)","v":0},0,0,0,{"$f":"(((AH118*Database!$U$3)+(AI118*Database!$V$3)+(AJ118*Database!$W$3))*AG118)","v":0},80,{"$f":"COUNTIFS(Output!$Q$5:$Q$36,Indoor!A118,Output!$P$6:$P$37,Indoor!AL118)","v":0},0,0,0,{"$f":"(((AN118*Database!$U$3)+(AO118*Database!$V$3)+(AP118*Database!$W$3))*AM118)","v":0},80,{"$f":"COUNTIFS(Output!$S$5:$S$36,Indoor!A118,Output!$R$6:$R$37,Indoor!AR118)","v":0},0,0,0,{"$f":"(((AT118*Database!$U$3)+(AU118*Database!$V$3)+(AV118*Database!$W$3))*AS118)","v":0},80,{"$f":"COUNTIFS(Output!$U$5:$U$36,Indoor!A118,Output!$T$6:$T$37,Indoor!AX118)","v":0},0,0,0,{"$f":"(((AZ118*Database!$U$3)+(BA118*Database!$V$3)+(BB118*Database!$W$3))*AY118)","v":0},80,{"$f":"COUNTIFS(Output!$W$5:$W$36,Indoor!A118,Output!$V$6:$V$37,Indoor!BD118)","v":0},0,0,0,{"$f":"(((BF118*Database!$U$3)+(BG118*Database!$V$3)+(BH118*Database!$W$3))*BE118)","v":0},0]
[{"$f":"Lists!$F$5","v":"Ceiling Suspended"},100,{"$f":"COUNTIFS(Output!$E$5:$E$36,Indoor!A119,Output!$D$6:$D$37,Indoor!B119)","v":1},0.13500000000000001,0.13500000000000001,0.13500000000000001,{"$f":"(((D119*Database!$U$3)+(E119*Database!$V$3)+(F119*Database!$W$3))*C119)","v":121.4325},100,{"$f":"COUNTIFS(Output!$G$5:$G$36,Indoor!A119,Output!$F$6:$F$37,Indoor!H119)","v":0},0.13500000000000001,0.13500000000000001,0.13500000000000001,{"$f":"(((J119*Database!$U$3)+(K119*Database!$V$3)+(L119*Database!$W$3))*I119)","v":0},100,{"$f":"COUNTIFS(Output!$I$5:$I$36,Indoor!A119,Output!$H$6:$H$37,Indoor!N119)","v":0},0.13500000000000001,0.13500000000000001,0.13500000000000001,{"$f":"(((P119*Database!$U$3)+(Q119*Database!$V$3)+(R119*Database!$W$3))*O119)","v":0},100,{"$f":"COUNTIFS(Output!$K$5:$K$36,Indoor!A119,Output!$J$6:$J$37,Indoor!T119)","v":0},0.13500000000000001,0.13500000000000001,0.13500000000000001,{"$f":"(((V119*Database!$U$3)+(W119*Database!$V$3)+(X119*Database!$W$3))*U119)","v":0},100,{"$f":"COUNTIFS(Output!$M$5:$M$36,Indoor!A119,Output!$L$6:$L$37,Indoor!Z119)","v":0},0.13500000000000001,0.13500000000000001,0.13500000000000001,{"$f":"(((AB119*Database!$U$3)+(AC119*Database!$V$3)+(AD119*Database!$W$3))*AA119)","v":0},100,{"$f":"COUNTIFS(Output!$O$5:$O$36,Indoor!A119,Output!$N$6:$N$37,Indoor!AF119)","v":0},0.13500000000000001,0.13500000000000001,0.13500000000000001,{"$f":"(((AH119*Database!$U$3)+(AI119*Database!$V$3)+(AJ119*Database!$W$3))*AG119)","v":0},100,{"$f":"COUNTIFS(Output!$Q$5:$Q$36,Indoor!A119,Output!$P$6:$P$37,Indoor!AL119)","v":0},0.13500000000000001,0.13500000000000001,0.13500000000000001,{"$f":"(((AN119*Database!$U$3)+(AO119*Database!$V$3)+(AP119*Database!$W$3))*AM119)","v":0},100,{"$f":"COUNTIFS(Output!$S$5:$S$36,Indoor!A119,Output!$R$6:$R$37,Indoor!AR119)","v":0},0.13500000000000001,0.13500000000000001,0.13500000000000001,{"$f":"(((AT119*Database!$U$3)+(AU119*Database!$V$3)+(AV119*Database!$W$3))*AS119)","v":0},100,{"$f":"COUNTIFS(Output!$U$5:$U$36,Indoor!A119,Output!$T$6:$T$37,Indoor!AX119)","v":0},0.13500000000000001,0.13500000000000001,0.13500000000000001,{"$f":"(((AZ119*Database!$U$3)+(BA119*Database!$V$3)+(BB119*Database!$W$3))*AY119)","v":0},100,{"$f":"COUNTIFS(Output!$W$5:$W$36,Indoor!A119,Output!$V$6:$V$37,Indoor!BD119)","v":0},0.13500000000000001,0.13500000000000001,0.13500000000000001,{"$f":"(((BF119*Database!$U$3)+(BG119*Database!$V$3)+(BH119*Database!$W$3))*BE119)","v":0},1]
[{"$f":"Lists!$F$5","v":"Ceiling Suspended"},125,{"$f":"COUNTIFS(Output!$E$5:$E$36,Indoor!A120,Output!$D$6:$D$37,Indoor!B120)","v":0},null,null,0,{"$f":"(((D120*Database!$U$3)+(E120*Database!$V$3)+(F120*Database!$W$3))*C120)","v":0},125,{"$f":"COUNTIFS(Output!$G$5:$G$36,Indoor!A120,Output!$F$6:$F$37,Indoor!H120)","v":0},0,0,0,{"$f":"(((J120*Database!$U$3)+(K120*Database!$V$3)+(L120*Database!$W$3))*I120)","v":0},125,{"$f":"COUNTIFS(Output!$I$5:$I$36,Indoor!A120,Output!$H$6:$H$37,Indoor!N120)","v":0},0,0,0,{"$f":"(((P120*Database!$U$3)+(Q120*Database!$V$3)+(R120*Database!$W$3))*O120)","v":0},125,{"$f":"COUNTIFS(Output!$K$5:$K$36,Indoor!A120,Output!$J$6:$J$37,Indoor!T120)","v":0},0,0,0,{"$f":"(((V120*Database!$U$3)+(W120*Database!$V$3)+(X120*Database!$W$3))*U120)","v":0},125,{"$f":"COUNTIFS(Output!$M$5:$M$36,Indoor!A120,Output!$L$6:$L$37,Indoor!Z120)","v":0},0,0,0,{"$f":"(((AB120*Database!$U$3)+(AC120*Database!$V$3)+(AD120*Database!$W$3))*AA120)","v":0},125,{"$f":"COUNTIFS(Output!$O$5:$O$36,Indoor!A120,Output!$N$6:$N$37,Indoor!AF120)","v":0},0,0,0,{"$f":"(((AH120*Database!$U$3)+(AI120*Database!$V$3)+(AJ120*Database!$W$3))*AG120)","v":0},125,{"$f":"COUNTIFS(Output!$Q$5:$Q$36,Indoor!A120,Output!$P$6:$P$37,Indoor!AL120)","v":0},0,0,0,{"$f":"(((AN120*Database!$U$3)+(AO120*Database!$V$3)+(AP120*Database!$W$3))*AM120)","v":0},125,{"$f":"COUNTIFS(Output!$S$5:$S$36,Indoor!A120,Output!$R$6:$R$37,Indoor!AR120)","v":0},0,0,0,{"$f":"(((AT120*Database!$U$3)+(AU120*Database!$V$3)+(AV120*Database!$W$3))*AS120)","v":0},125,{"$f":"COUNTIFS(Output!$U$5:$U$36,Indoor!A120,Output!$T$6:$T$37,Indoor!AX120)","v":0},0,0,0,{"$f":"(((AZ120*Database!$U$3)+(BA120*Database!$V$3)+(BB120*Database!$W$3))*AY120)","v":0},125,{"$f":"COUNTIFS(Output!$W$5:$W$36,Indoor!A120,Output!$V$6:$V$37,Indoor!BD120)","v":0},0,0,0,{"$f":"(((BF120*Database!$U$3)+(BG120*Database!$V$3)+(BH120*Database!$W$3))*BE120)","v":0},0]
[{"$f":"Lists!$F$5","v":"Ceiling Suspended"},200,{"$f":"COUNTIFS(Output!$E$5:$E$36,Indoor!A121,Output!$D$6:$D$37,Indoor!B121)","v":0},null,null,0,{"$f":"(((D121*Database!$U$3)+(E121*Database!$V$3)+(F121*Database!$W$3))*C121)","v":0},200,{"$f":"COUNTIFS(Output!$G$5:$G$36,Indoor!A121,Output!$F$6:$F$37,Indoor!H121)","v":0},0,0,0,{"$f":"(((J121*Database!$U$3)+(K121*Database!$V$3)+(L121*Database!$W$3))*I121)","v":0},200,{"$f":"COUNTIFS(Output!$I$5:$I$36,Indoor!A121,Output!$H$6:$H$37,Indoor!N121)","v":0},0,0,0,{"$f":"(((P121*Database!$U$3)+(Q121*Database!$V$3)+(R121*Database!$W$3))*O121)","v":0},200,{"$f":"COUNTIFS(Output!$K$5:$K$36,Indoor!A121,Output!$J$6:$J$37,Indoor!T121)","v":0},0,0,0,{"$f":"(((V121*Database!$U$3)+(W121*Database!$V$3)+(X121*Database!$W$3))*U121)","v":0},200,{"$f":"COUNTIFS(Output!$M$5:$M$36,Indoor!A121,Output!$L$6:$L$37,Indoor!Z121)","v":0},0,0,0,{"$f":"(((AB121*Database!$U$3)+(AC121*Database!$V$3)+(AD121*Database!$W$3))*AA121)","v":0},200,{"$f":"COUNTIFS(Output!$O$5:$O$36,Indoor!A121,Output!$N$6:$N$37,Indoor!AF121)","v":0},0,0,0,{"$f":"(((AH121*Database!$U$3)+(AI121*Database!$V$3)+(AJ121*Database!$W$3))*AG121)","v":0},200,{"$f":"COUNTIFS(Output!$Q$5:$Q$36,Indoor!A121,Output!$P$6:$P$37,Indoor!AL121)","v":0},0,0,0,{"$f":"(((AN121*Database!$U$3)+(AO121*Database!$V$3)+(AP121*Database!$W$3))*AM121)","v":0},200,{"$f":"COUNTIFS(Output!$S$5:$S$36,Indoor!A121,Output!$R$6:$R$37,Indoor!AR121)","v":0},0,0,0,{"$f":"(((AT121*Database!$U$3)+(AU121*Database!$V$3)+(AV121*Database!$W$3))*AS121)","v":0},200,{"$f":"COUNTIFS(Output!$U$5:$U$36,Indoor!A121,Output!$T$6:$T$37,Indoor!AX121)","v":0},0,0,0,{"$f":"(((AZ121*Database!$U$3)+(BA121*Database!$V$3)+(BB121*Database!$W$3))*AY121)","v":0},200,{"$f":"COUNTIFS(Output!$W$5:$W$36,Indoor!A121,Output!$V$6:$V$37,Indoor!BD121)","v":0},0,0,0,{"$f":"(((BF121*Database!$U$3)+(BG121*Database!$V$3)+(BH121*Database!$W$3))*BE121)","v":0},0]
[{"$f":"Lists!$F$5","v":"Ceiling Suspended"},250,{"$f":"COUNTIFS(Output!$E$5:$E$36,Indoor!A122,Output!$D$6:$D$37,Indoor!B122)","v":0},null,null,0,{"$f":"(((D122*Database!$U$3)+(E122*Database!$V$3)+(F122*Database!$W$3))*C122)","v":0},250,{"$f":"COUNTIFS(Output!$G$5:$G$36,Indoor!A122,Output!$F$6:$F$37,Indoor!H122)","v":0},0,0,0,{"$f":"(((J122*Database!$U$3)+(K122*Database!$V$3)+(L122*Database!$W$3))*I122)","v":0},250,{"$f":"COUNTIFS(Output!$I$5:$I$36,Indoor!A122,Output!$H$6:$H$37,Indoor!N122)","v":0},0,0,0,{"$f":"(((P122*Database!$U$3)+(Q122*Database!$V$3)+(R122*Database!$W$3))*O122)","v":0},250,{"$f":"COUNTIFS(Output!$K$5:$K$36,Indoor!A122,Output!$J$6:$J$37,Indoor!T122)","v":0},0,0,0,{"$f":"(((V122*Database!$U$3)+(W122*Database!$V$3)+(X122*Database!$W$3))*U122)","v":0},250,{"$f":"COUNTIFS(Output!$M$5:$M$36,Indoor!A122,Output!$L$6:$L$37,Indoor!Z122)","v":0},0,0,0,{"$f":"(((AB122*Database!$U$3)+(AC122*Database!$V$3)+(AD122*Database!$W$3))*AA122)","v":0},250,{"$f":"COUNTIFS(Output!$O$5:$O$36,Indoor!A122,Output!$N$6:$N$37,Indoor!AF122)","v":0},0,0,0,{"$f":"(((AH122*Database!$U$3)+(AI122*Database!$V$3)+(AJ122*Database!$W$3))*AG122)","v":0},250,{"$f":"COUNTIFS(Output!$Q$5:$Q$36,Indoor!A122,Output!$P$6:$P$37,Indoor!AL122)","v":0},0,0,0,{"$f":"(((AN122*Database!$U$3)+(AO122*Database!$V$3)+(AP122*Database!$W$3))*AM122)","v":0},250,{"$f":"COUNTIFS(Output!$S$5:$S$36,Indoor!A122,Output!$R$6:$R$37,Indoor!AR122)","v":0},0,0,0,{"$f":"(((AT122*Database!$U$3)+(AU122*Database!$V$3)+(AV122*Database!$W$3))*AS122)","v":0},250,{"$f":"COUNTIFS(Output!$U$5:$U$36,Indoor!A122,Output!$T$6:$T$37,Indoor!AX122)","v":0},0,0,0,{"$f":"(((AZ122*Database!$U$3)+(BA122*Database!$V$3)+(BB122*Database!$W$3))*AY122)","v":0},250,{"$f":"COUNTIFS(Output!$W$5:$W$36,Indoor!A122,Output!$V$6:$V$37,Indoor!BD122)","v":0},0,0,0,{"$f":"(((BF122*Database!$U$3)+(BG122*Database!$V$3)+(BH122*Database!$W$3))*BE122)","v":0},0]
["FXLQ",null,{"$f":"SUM(C112:C122)","v":2},null,null,null,null,null,{"$f":"SUM(I112:I122)","v":0},null,null,null,null,null,{"$f":"SUM(O112:O122)","v":0},null,null,null,null,null,{"$f":"SUM(U112:U122)","v":0},null,null,null,null,null,{"$f":"SUM(AA112:AA122)","v":0},null,null,null,null,null,{"$f":"SUM(AG112:AG122)","v":0},null,null,null,null,null,{"$f":"SUM(AM112:AM122)","v":0},null,null,null,null,null,{"$f":"SUM(AS112:AS122)","v":0},null,null,null,null,null,{"$f":"SUM(AY112:AY122)","v":0},null,null,null,null,null,{"$f":"SUM(BE112:BE122)","v":0}]
[{"$f":"Lists!$F$7","v":"Floor Standing"},20,{"$f":"COUNTIFS(Output!$E$5:$E$36,Indoor!A124,Output!$D$6:$D$37,Indoor!B124)","v":0},4.9000000000000002E-2,4.9000000000000002E-2,4.9000000000000002E-2,{"$f":"(((D124*Database!$U$3)+(E124*Database!$V$3)+(F124*Database!$W$3))*C124)","v":0},20,{"$f":"COUNTIFS(Output!$G$5:$G$36,Indoor!A124,Output!$F$6:$F$37,Indoor!H124)","v":0},{"$f":"D124","v":4.9000000000000002E-2},{"$f":"E124","v":4.9000000000000002E-2},{"$f":"F124","v":4.9000000000000002E-2},{"$f":"(((J124*Database!$U$3)+(K124*Database!$V$3)+(L124*Database!$W$3))*I124)","v":0},20,{"$f":"COUNTIFS(Output!$I$5:$I$36,Indoor!A124,Output!$H$6:$H$37,Indoor!N124)","v":0},{"$f":"D124","v":4.9000000000000002E-2},{"$f":"E124","v":4.9000000000000002E-2},{"$f":"F124","v":4.9000000000000002E-2},{"$f":"(((P124*Database!$U$3)+(Q124*Database!$V$3)+(R124*Database!$W$3))*O124)","v":0},20,{"$f":"COUNTIFS(Output!$K$5:$K$36,Indoor!A124,Output!$J$6:$J$37,Indoor!T124)","v":0},{"$f":"D124","v":4.9000000000000002E-2},{"$f":"E124","v":4.9000000000000002E-2},{"$f":"F124","v":4.9000000000000002E-2},{"$f":"(((V124*Database!$U$3)+(W124*Database!$V$3)+(X124*Database!$W$3))*U124)","v":0},20,{"$f":"COUNTIFS(Output!$M$5:$M$36,Indoor!A124,Output!$L$6:$L$37,Indoor!Z124)","v":0},{"$f":"D124","v":4.9000000000000002E-2},{"$f":"E124","v":4.9000000000000002E-2},{"$f":"F124","v":4.9000000000000002E-2},{"$f":"(((AB124*Database!$U$3)+(AC124*Database!$V$3)+(AD124*Database!$W$3))*AA124)","v":0},20,{"$f":"COUNTIFS(Output!$O$5:$O$36,Indoor!A124,Output!$N$6:$N$37,Indoor!AF124)","v":0},{"$f":"D124","v":4.9000000000000002E-2},{"$f":"E124","v":4.9000000000000002E-2},{"$f":"F124","v":4.9000000000000002E-2},{"$f":"(((AH124*Database!$U$3)+(AI124*Database!$V$3)+(AJ124*Database!$W$3))*AG124)","v":0},20,{"$f":"COUNTIFS(Output!$Q$5:$Q$36,Indoor!A124,Output!$P$6:$P$37,Indoor!AL124)","v":0},{"$f":"D124","v":4.9000000000000002E-2},{"$f":"E124","v":4.9000000000000002E-2},{"$f":"F124","v":4.9000000000000002E-2},{"$f":"(((AN124*Database!$U$3)+(AO124*Database!$V$3)+(AP124*Database!$W$3))*AM124)","v":0},20,{"$f":"COUNTIFS(Output!$S$5:$S$36,Indoor!A124,Output!$R$6:$R$37,Indoor!AR124)","v":0},{"$f":"D124","v":4.9000000000000002E-2},{"$f":"E124","v":4.9000000000000002E-2},{"$f":"F124","v":4.9000000000000002E-2},{"$f":"(((AT124*Database!$U$3)+(AU124*Database!$V$3)+(AV124*Database!$W$3))*AS124)","v":0},20,{"$f":"COUNTIFS(Output!$U$5:$U$36,Indoor!A124,Output!$T$6:$T$37,Indoor!AX124)","v":0},{"$f":"D124","v":4.9000000000000002E-2},{"$f":"E124","v":4.9000000000000002E-2},{"$f":"F124","v":4.9000000000000002E-2},{"$f":"(((AZ124*Database!$U$3)+(BA124*Database!$V$3)+(BB124*Database!$W$3))*AY124)","v":0},20,{"$f":"COUNTIFS(Output!$W$5:$W$36,Indoor!A124,Output!$V$6:$V$37,Indoor!BD124)","v":0},{"$f":"D124","v":4.9000000000000002E-2},{"$f":"E124","v":4.9000000000000002E-2},{"$f":"F124","v":4.9000000000000002E-2},{"$f":"(((BF124*Database!$U$3)+(BG124*Database!$V$3)+(BH124*Database!$W$3))*BE124)","v":0},{"$f":"SUM(BE124+AY124+AS124+AM124+AG124+AA124+U124+O124+I124+C124)","v":0}]
[{"$f":"Lists!$F$7","v":"Floor Standing"},25,{"$f":"COUNTIFS(Output!$E$5:$E$36,Indoor!A125,Output!$D$6:$D$37,Indoor!B125)","v":0},4.9000000000000002E-2,4.9000000000000002E-2,4.9000000000000002E-2,{"$f":"(((D125*Database!$U$3)+(E125*Database!$V$3)+(F125*Database!$W$3))*C125)","v":0},25,{"$f":"COUNTIFS(Output!$G$5:$G$36,Indoor!A125,Output!$F$6:$F$37,Indoor!H125)","v":0},4.9000000000000002E-2,4.9000000000000002E-2,4.9000000000000002E-2,{"$f":"(((J125*Database!$U$3)+(K125*Database!$V$3)+(L125*Database!$W$3))*I125)","v":0},25,{"$f":"COUNTIFS(Output!$I$5:$I$36,Indoor!A125,Output!$H$6:$H$37,Indoor!N125)","v":0},4.9000000000000002E-2,4.9000000000000002E-2,4.9000000000000002E-2,{"$f":"(((P125*Database!$U$3)+(Q125*Database!$V$3)+(R125*Database!$W$3))*O125)","v":0},25,{"$f":"COUNTIFS(Output!$K$5:$K$36,Indoor!A125,Output!$J$6:$J$37,Indoor!T125)","v":0},4.9000000000000002E-2,4.9000000000000002E-2,4.9000000000000002E-2,{"$f":"(((V125*Database!$U$3)+(W125*Database!$V$3)+(X125*Database!$W$3))*U125)","v":0},25,{"$f":"COUNTIFS(Output!$M$5:$M$36,Indoor!A125,Output!$L$6:$L$37,Indoor!Z125)","v":0},4.9000000000000002E-2,4.9000000000000002E-2,4.9000000000000002E-2,{"$f":"(((AB125*Database!$U$3)+(AC125*Database!$V$3)+(AD125*Database!$W$3))*AA125)","v":0},25,{"$f":"COUNTIFS(Output!$O$5:$O$36,Indoor!A125,Output!$N$6:$N$37,Indoor!AF125)","v":0},4.9000000000000002E-2,4.9000000000000002E-2,4.9000000000000002E-2,{"$f":"(((AH125*Database!$U$3)+(AI125*Database!$V$3)+(AJ125*Database!$W$3))*AG125)","v":0},25,{"$f":"COUNTIFS(Output!$Q$5:$Q$36,Indoor!A125,Output!$P$6:$P$37,Indoor!AL125)","v":0},4.9000000000000002E-2,4.9000000000000002E-2,4.9000000000000002E-2,{"$f":"(((AN125*Database!$U$3)+(AO125*Database!$V$3)+(AP125*Database!$W$3))*AM125)","v":0},25,{"$f":"COUNTIFS(Output!$S$5:$S$36,Indoor!A125,Output!$R$6:$R$37,Indoor!AR125)","v":0},4.9000000000000002E-2,4.9000000000000002E-2,4.9000000000000002E-2,{"$f":"(((AT125*Database!$U$3)+(AU125*Database!$V$3)+(AV125*Database!$W$3))*AS125)","v":0},25,{"$f":"COUNTIFS(Output!$U$5:$U$36,Indoor!A125,Output!$T$6:$T$37,Indoor!AX125)","v":0},4.9000000000000002E-2,4.9000000000000002E-2,4.9000000000000002E-2,{"$f":"(((AZ125*Database!$U$3)+(BA125*Database!$V$3)+(BB125*Database!$W$3))*AY125)","v":0},25,{"$f":"COUNTIFS(Output!$W$5:$W$36,Indoor!A125,Output!$V$6:$V$37,Indoor!BD125)","v":0},4.9000000000000002E-2,4.9000000000000002E-2,4.9000000000000002E-2,{"$f":"(((BF125*Database!$U$3)+(BG125*Database!$V$3)+(BH125*Database!$W$3))*BE125)","v":0},0]
[{"$f":"Lists!$F$7","v":"Floor Standing"},31.25,{"$f":"COUNTIFS(Output!$E$5:$E$36,Indoor!A126,Output!$D$6:$D$37,Indoor!B126)","v":0},0.09,0.09,0.09,{"$f":"(((D126*Database!$U$3)+(E126*Database!$V$3)+(F126*Database!$W$3))*C126)","v":0},31.25,{"$f":"COUNTIFS(Output!$G$5:$G$36,Indoor!A126,Output!$F$6:$F$37,Indoor!H126)","v":0},0.09,0.09,0.09,{"$f":"(((J126*Database!$U$3)+(K126*Database!$V$3)+(L126*Database!$W$3))*I126)","v":0},31.25,{"$f":"COUNTIFS(Output!$I$5:$I$36,Indoor!A126,Output!$H$6:$H$37,Indoor!N126)","v":0},0.09,0.09,0.09,{"$f":"(((P126*Database!$U$3)+(Q126*Database!$V$3)+(R126*Database!$W$3))*O126)","v":0},31.25,{"$f":"COUNTIFS(Output!$K$5:$K$36,Indoor!A126,Output!$J$6:$J$37,Indoor!T126)","v":0},0.09,0.09,0.09,{"$f":"(((V126*Database!$U$3)+(W126*Database!$V$3)+(X126*Database!$W$3))*U126)","v":0},31.25,{"$f":"COUNTIFS(Output!$M$5:$M$36,Indoor!A126,Output!$L$6:$L$37,Indoor!Z126)","v":0},0.09,0.09,0.09,{"$f":"(((AB126*Database!$U$3)+(AC126*Database!$V$3)+(AD126*Database!$W$3))*AA126)","v":0},31.25,{"$f":"COUNTIFS(Output!$O$5:$O$36,Indoor!A126,Output!$N$6:$N$37,Indoor!AF126)","v":0},0.09,0.09,0.09,{"$f":"(((AH126*Database!$U$3)+(AI126*Database!$V$3)+(AJ126*Database!$W$3))*AG126)","v":0},31.25,{"$f":"COUNTIFS(Output!$Q$5:$Q$36,Indoor!A126,Output!$P$6:$P$37,Indoor!AL126)","v":0},0.09,0.09,0.09,{"$f":"(((AN126*Database!$U$3)+(AO126*Database!$V$3)+(AP126*Database!$W$3))*AM126)","v":0},31.25,{"$f":"COUNTIFS(Output!$S$5:$S$36,Indoor!A126,Output!$R$6:$R$37,Indoor!AR126)","v":0},0.09,0.09,0.09,{"$f":"(((AT126*Database!$U$3)+(AU126*Database!$V$3)+(AV126*Database!$W$3))*AS126)","v":0},31.25,{"$f":"COUNTIFS(Output!$U$5:$U$36,Indoor!A126,Output!$T$6:$T$37,Indoor!AX126)","v":0},0.09,0.09,0.09,{"$f":"(((AZ126*Database!$U$3)+(BA126*Database!$V$3)+(BB126*Database!$W$3))*AY126)","v":0},31.25,{"$f":"COUNTIFS(Output!$W$5:$W$36,Indoor!A126,Output!$V$6:$V$37,Indoor!BD126)","v":0},0.09,0.09,0.09,{"$f":"(((BF126*Database!$U$3)+(BG126*Database!$V$3)+(BH126*Database!$W$3))*BE126)","v":0},0]
[{"$f":"Lists!$F$7","v":"Floor Standing"},40,{"$f":"COUNTIFS(Output!$E$5:$E$36,Indoor!A127,Output!$D$6:$D$37,Indoor!B127)","v":0},0.09,0.09,0.09,{"$f":"(((D127*Database!$U$3)+(E127*Database!$V$3)+(F127*Database!$W$3))*C127)","v":0},40,{"$f":"COUNTIFS(Output!$G$5:$G$36,Indoor!A127,Output!$F$6:$F$37,Indoor!H127)","v":0},0.09,0.09,0.09,{"$f":"(((J127*Database!$U$3)+(K127*Database!$V$3)+(L127*Database!$W$3))*I127)","v":0},40,{"$f":"COUNTIFS(Output!$I$5:$I$36,Indoor!A127,Output!$H$6:$H$37,Indoor!N127)","v":0},0.09,0.09,0.09,{"$f":"(((P127*Database!$U$3)+(Q127*Database!$V$3)+(R127*Database!$W$3))*O127)","v":0},40,{"$f":"COUNTIFS(Output!$K$5:$K$36,Indoor!A127,Output!$J$6:$J$37,Indoor!T127)","v":0},0.09,0.09,0.09,{"$f":"(((V127*Database!$U$3)+(W127*Database!$V$3)+(X127*Database!$W$3))*U127)","v":0},40,{"$f":"COUNTIFS(Output!$M$5:$M$36,Indoor!A127,Output!$L$6:$L$37,Indoor!Z127)","v":0},0.09,0.09,0.09,{"$f":"(((AB127*Database!$U$3)+(AC127*Database!$V$3)+(AD127*Database!$W$3))*AA127)","v":0},40,{"$f":"COUNTIFS(Output!$O$5:$O$36,Indoor!A127,Output!$N$6:$N$37,Indoor!AF127)","v":0},0.09,0.09,0.09,{"$f":"(((AH127*Database!$U$3)+(AI127*Database!$V$3)+(AJ127*Database!$W$3))*AG127)","v":0},40,{"$f":"COUNTIFS(Output!$Q$5:$Q$36,Indoor!A127,Output!$P$6:$P$37,Indoor!AL127)","v":0},0.09,0.09,0.09,{"$f":"(((AN127*Database!$U$3)+(AO127*Database!$V$3)+(AP127*Database!$W$3))*AM127)","v":0},40,{"$f":"COUNTIFS(Output!$S$5:$S$36,Indoor!A127,Output!$R$6:$R$37,Indoor!AR127)","v":0},0.09,0.09,0.09,{"$f":"(((AT127*Database!$U$3)+(AU127*Database!$V$3)+(AV127*Database!$W$3))*AS127)","v":0},40,{"$f":"COUNTIFS(Output!$U$5:$U$36,Indoor!A127,Output!$T$6:$T$37,Indoor!AX127)","v":0},0.09,0.09,0.09,{"$f":"(((AZ127*Database!$U$3)+(BA127*Database!$V$3)+(BB127*Database!$W$3))*AY127)","v":0},40,{"$f":"COUNTIFS(Output!$W$5:$W$36,Indoor!A127,Output!$V$6:$V$37,Indoor!BD127)","v":0},0.09,0.09,0.09,{"$f":"(((BF127*Database!$U$3)+(BG127*Database!$V$3)+(BH127*Database!$W$3))*BE127)","v":0},0]
[{"$f":"Lists!$F$7","v":"Floor Standing"},50,{"$f":"COUNTIFS(Output!$E$5:$E$36,Indoor!A128,Output!$D$6:$D$37,Indoor!B128)","v":0},0.11,0.11,0.11,{"$f":"(((D128*Database!$U$3)+(E128*Database!$V$3)+(F128*Database!$W$3))*C128)","v":0},50,{"$f":"COUNTIFS(Output!$G$5:$G$36,Indoor!A128,Output!$F$6:$F$37,Indoor!H128)","v":0},0.11,0.11,0.11,{"$f":"(((J128*Database!$U$3)+(K128*Database!$V$3)+(L128*Database!$W$3))*I128)","v":0},50,{"$f":"COUNTIFS(Output!$I$5:$I$36,Indoor!A128,Output!$H$6:$H$37,Indoor!N128)","v":0},0.11,0.11,0.11,{"$f":"(((P128*Database!$U$3)+(Q128*Database!$V$3)+(R128*Database!$W$3))*O128)","v":0},50,{"$f":"COUNTIFS(Output!$K$5:$K$36,Indoor!A128,Output!$J$6:$J$37,Indoor!T128)","v":0},0.11,0.11,0.11,{"$f":"(((V128*Database!$U$3)+(W128*Database!$V$3)+(X128*Database!$W$3))*U128)","v":0},50,{"$f":"COUNTIFS(Output!$M$5:$M$36,Indoor!A128,Output!$L$6:$L$37,Indoor!Z128)","v":0},0.11,0.11,0.11,{"$f":"(((AB128*Database!$U$3)+(AC128*Database!$V$3)+(AD128*Database!$W$3))*AA128)","v":0},50,{"$f":"COUNTIFS(Output!$O$5:$O$36,Indoor!A128,Output!$N$6:$N$37,Indoor!AF128)","v":0},0.11,0.11,0.11,{"$f":"(((AH128*Database!$U$3)+(AI128*Database!$V$3)+(AJ128*Database!$W$3))*AG128)","v":0},50,{"$f":"COUNTIFS(Output!$Q$5:$Q$36,Indoor!A128,Output!$P$6:$P$37,Indoor!AL128)","v":0},0.11,0.11,0.11,{"$f":"(((AN128*Database!$U$3)+(AO128*Database!$V$3)+(AP128*Database!$W$3))*AM128)","v":0},50,{"$f":"COUNTIFS(Output!$S$5:$S$36,Indoor!A128,Output!$R$6:$R$37,Indoor!AR128)","v":0},0.11,0.11,0.11,{"$f":"(((AT128*Database!$U$3)+(AU128*Database!$V$3)+(AV128*Database!$W$3))*AS128)","v":0},50,{"$f":"COUNTIFS(Output!$U$5:$U$36,Indoor!A128,Output!$T$6:$T$37,Indoor!AX128)","v":0},0.11,0.11,0.11,{"$f":"(((AZ128*Database!$U$3)+(BA128*Database!$V$3)+(BB128*Database!$W$3))*AY128)","v":0},50,{"$f":"COUNTIFS(Output!$W$5:$W$36,Indoor!A128,Output!$V$6:$V$37,Indoor!BD128)","v":0},0.11,0.11,0.11,{"$f":"(((BF128*Database!$U$3)+(BG128*Database!$V$3)+(BH128*Database!$W$3))*BE128)","v":0},0]
[{"$f":"Lists!$F$7","v":"Floor Standing"},63,{"$f":"COUNTIFS(Output!$E$5:$E$36,Indoor!A129,Output!$D$6:$D$37,Indoor!B129)","v":0},0.11,0.11,0.11,{"$f":"(((D129*Database!$U$3)+(E129*Database!$V$3)+(F129*Database!$W$3))*C129)","v":0},63,{"$f":"COUNTIFS(Output!$G$5:$G$36,Indoor!A129,Output!$F$6:$F$37,Indoor!H129)","v":0},0.11,0.11,0.11,{"$f":"(((J129*Database!$U$3)+(K129*Database!$V$3)+(L129*Database!$W$3))*I129)","v":0},63,{"$f":"COUNTIFS(Output!$I$5:$I$36,Indoor!A129,Output!$H$6:$H$37,Indoor!N129)","v":0},0.11,0.11,0.11,{"$f":"(((P129*Database!$U$3)+(Q129*Database!$V$3)+(R129*Database!$W$3))*O129)","v":0},63,{"$f":"COUNTIFS(Output!$K$5:$K$36,Indoor!A129,Output!$J$6:$J$37,Indoor!T129)","v":0},0.11,0.11,0.11,{"$f":"(((V129*Database!$U$3)+(W129*Database!$V$3)+(X129*Database!$W$3))*U129)","v":0},63,{"$f":"COUNTIFS(Output!$M$5:$M$36,Indoor!A129,Output!$L$6:$L$37,Indoor!Z129)","v":0},0.11,0.11,0.11,{"$f":"(((AB129*Database!$U$3)+(AC129*Database!$V$3)+(AD129*Database!$W$3))*AA129)","v":0},63,{"$f":"COUNTIFS(Output!$O$5:$O$36,Indoor!A129,Output!$N$6:$N$37,Indoor!AF129)","v":0},0.11,0.11,0.11,{"$f":"(((AH129*Database!$U$3)+(AI129*Database!$V$3)+(AJ129*Database!$W$3))*AG129)","v":0},63,{"$f":"COUNTIFS(Output!$Q$5:$Q$36,Indoor!A129,Output!$P$6:$P$37,Indoor!AL129)","v":0},0.11,0.11,0.11,{"$f":"(((AN129*Database!$U$3)+(AO129*Database!$V$3)+(AP129*Database!$W$3))*AM129)","v":0},63,{"$f":"COUNTIFS(Output!$S$5:$S$36,Indoor!A129,Output!$R$6:$R$37,Indoor!AR129)","v":0},0.11,0.11,0.11,{"$f":"(((AT129*Database!$U$3)+(AU129*Database!$V$3)+(AV129*Database!$W$3))*AS129)","v":0},63,{"$f":"COUNTIFS(Output!$U$5:$U$36,Indoor!A129,Output!$T$6:$T$37,Indoor!AX129)","v":0},0.11,0.11,0.11,{"$f":"(((AZ129*Database!$U$3)+(BA129*Database!$V$3)+(BB129*Database!$W$3))*AY129)","v":0},63,{"$f":"COUNTIFS(Output!$W$5:$W$36,Indoor!A129,Output!$V$6:$V$37,Indoor!BD129)","v":0},0.11,0.11,0.11,{"$f":"(((BF129*Database!$U$3)+(BG129*Database!$V$3)+(BH129*Database!$W$3))*BE129)","v":0},0]
[{"$f":"Lists!$F$7","v":"Floor Standing"},80,{"$f":"COUNTIFS(Output!$E$5:$E$36,Indoor!A130,Output!$D$6:$D$37,Indoor!B130)","v":0},null,null,0,{"$f":"(((D130*Database!$U$3)+(E130*Database!$V$3)+(F130*Database!$W$3))*C130)","v":0},80,{"$f":"COUNTIFS(Output!$G$5:$G$36,Indoor!A130,Output!$F$6:$F$37,Indoor!H130)","v":0},0,0,0,{"$f":"(((J130*Database!$U$3)+(K130*Database!$V$3)+(L130*Database!$W$3))*I130)","v":0},80,{"$f":"COUNTIFS(Output!$I$5:$I$36,Indoor!A130,Output!$H$6:$H$37,Indoor!N130)","v":0},0,0,0,{"$f":"(((P130*Database!$U$3)+(Q130*Database!$V$3)+(R130*Database!$W$3))*O130)","v":0},80,{"$f":"COUNTIFS(Output!$K$5:$K$36,Indoor!A130,Output!$J$6:$J$37,Indoor!T130)","v":0},0,0,0,{"$f":"(((V130*Database!$U$3)+(W130*Database!$V$3)+(X130*Database!$W$3))*U130)","v":0},80,{"$f":"COUNTIFS(Output!$M$5:$M$36,Indoor!A130,Output!$L$6:$L$37,Indoor!Z130)","v":0},0,0,0,{"$f":"(((AB130*Database!$U$3)+(AC130*Database!$V$3)+(AD130*Database!$W$3))*AA130)","v":0},80,{"$f":"COUNTIFS(Output!$O$5:$O$36,Indoor!A130,Output!$N$6:$N$37,Indoor!AF130)","v":0},0,0,0,{"$f":"(((AH130*Database!$U$3)+(AI130*Database!$V$3)+(AJ130*Database!$W$3))*AG130)","v":0},80,{"$f":"COUNTIFS(Output!$Q$5:$Q$36,Indoor!A130,Output!$P$6:$P$37,Indoor!AL130)","v":0},0,0,0,{"$f":"(((AN130*Database!$U$3)+(AO130*Database!$V$3)+(AP130*Database!$W$3))*AM130)","v":0},80,{"$f":"COUNTIFS(Output!$S$5:$S$36,Indoor!A130,Output!$R$6:$R$37,Indoor!AR130)","v":0},0,0,0,{"$f":"(((AT130*Database!$U$3)+(AU130*Database!$V$3)+(AV130*Database!$W$3))*AS130)","v":0},80,{"$f":"COUNTIFS(Output!$U$5:$U$36,Indoor!A130,Output!$T$6:$T$37,Indoor!AX130)","v":0},0,0,0,{"$f":"(((AZ130*Database!$U$3)+(BA130*Database!$V$3)+(BB130*Database!$W$3))*AY130)","v":0},80,{"$f":"COUNTIFS(Output!$W$5:$W$36,Indoor!A130,Output!$V$6:$V$37,Indoor!BD130)","v":0},0,0,0,{"$f":"(((BF130*Database!$U$3)+(BG130*Database!$V$3)+(BH130*Database!$W$3))*BE130)","v":0},0]
[{"$f":"Lists!$F$7","v":"Floor Standing"},100,{"$f":"COUNTIFS(Output!$E$5:$E$36,Indoor!A131,Output!$D$6:$D$37,Indoor!B131)","v":0},null,null,0,{"$f":"(((D131*Database!$U$3)+(E131*Database!$V$3)+(F131*Database!$W$3))*C131)","v":0},100,{"$f":"COUNTIFS(Output!$G$5:$G$36,Indoor!A131,Output!$F$6:$F$37,Indoor!H131)","v":0},0,0,0,{"$f":"(((J131*Database!$U$3)+(K131*Database!$V$3)+(L131*Database!$W$3))*I131)","v":0},100,{"$f":"COUNTIFS(Output!$I$5:$I$36,Indoor!A131,Output!$H$6:$H$37,Indoor!N131)","v":0},0,0,0,{"$f":"(((P131*Database!$U$3)+(Q131*Database!$V$3)+(R131*Database!$W$3))*O131)","v":0},100,{"$f":"COUNTIFS(Output!$K$5:$K$36,Indoor!A131,Output!$J$6:$J$37,Indoor!T131)","v":0},0,0,0,{"$f":"(((V131*Database!$U$3)+(W131*Database!$V$3)+(X131*Database!$W$3))*U131)","v":0},100,{"$f":"COUNTIFS(Output!$M$5:$M$36,Indoor!A131,Output!$L$6:$L$37,Indoor!Z131)","v":0},0,0,0,{"$f":"(((AB131*Database!$U$3)+(AC131*Database!$V$3)+(AD131*Database!$W$3))*AA131)","v":0},100,{"$f":"COUNTIFS(Output!$O$5:$O$36,Indoor!A131,Output!$N$6:$N$37,Indoor!AF131)","v":0},0,0,0,{"$f":"(((AH131*Database!$U$3)+(AI131*Database!$V$3)+(AJ131*Database!$W$3))*AG131)","v":0},100,{"$f":"COUNTIFS(Output!$Q$5:$Q$36,Indoor!A131,Output!$P$6:$P$37,Indoor!AL131)","v":0},0,0,0,{"$f":"(((AN131*Database!$U$3)+(AO131*Database!$V$3)+(AP131*Database!$W$3))*AM131)","v":0},100,{"$f":"COUNTIFS(Output!$S$5:$S$36,Indoor!A131,Output!$R$6:$R$37,Indoor!AR131)","v":0},0,0,0,{"$f":"(((AT131*Database!$U$3)+(AU131*Database!$V$3)+(AV131*Database!$W$3))*AS131)","v":0},100,{"$f":"COUNTIFS(Output!$U$5:$U$36,Indoor!A131,Output!$T$6:$T$37,Indoor!AX131)","v":0},0,0,0,{"$f":"(((AZ131*Database!$U$3)+(BA131*Database!$V$3)+(BB131*Database!$W$3))*AY131)","v":0},100,{"$f":"COUNTIFS(Output!$W$5:$W$36,Indoor!A131,Output!$V$6:$V$37,Indoor!BD131)","v":0},0,0,0,{"$f":"(((BF131*Database!$U$3)+(BG131*Database!$V$3)+(BH131*Database!$W$3))*BE131)","v":0},0]
[{"$f":"Lists!$F$7","v":"Floor Standing"},125,{"$f":"COUNTIFS(Output!$E$5:$E$36,Indoor!A132,Output!$D$6:$D$37,Indoor!B132)","v":0},null,null,0,{"$f":"(((D132*Database!$U$3)+(E132*Database!$V$3)+(F132*Database!$W$3))*C132)","v":0},125,{"$f":"COUNTIFS(Output!$G$5:$G$36,Indoor!A132,Output!$F$6:$F$37,Indoor!H132)","v":0},0,0,0,{"$f":"(((J132*Database!$U$3)+(K132*Database!$V$3)+(L132*Database!$W$3))*I132)","v":0},125,{"$f":"COUNTIFS(Output!$I$5:$I$36,Indoor!A132,Output!$H$6:$H$37,Indoor!N132)","v":0},0,0,0,{"$f":"(((P132*Database!$U$3)+(Q132*Database!$V$3)+(R132*Database!$W$3))*O132)","v":0},125,{"$f":"COUNTIFS(Output!$K$5:$K$36,Indoor!A132,Output!$J$6:$J$37,Indoor!T132)","v":0},0,0,0,{"$f":"(((V132*Database!$U$3)+(W132*Database!$V$3)+(X132*Database!$W$3))*U132)","v":0},125,{"$f":"COUNTIFS(Output!$M$5:$M$36,Indoor!A132,Output!$L$6:$L$37,Indoor!Z132)","v":0},0,0,0,{"$f":"(((AB132*Database!$U$3)+(AC132*Database!$V$3)+(AD132*Database!$W$3))*AA132)","v":0},125,{"$f":"COUNTIFS(Output!$O$5:$O$36,Indoor!A132,Output!$N$6:$N$37,Indoor!AF132)","v":0},0,0,0,{"$f":"(((AH132*Database!$U$3)+(AI132*Database!$V$3)+(AJ132*Database!$W$3))*AG132)","v":0},125,{"$f":"COUNTIFS(Output!$Q$5:$Q$36,Indoor!A132,Output!$P$6:$P$37,Indoor!AL132)","v":0},0,0,0,{"$f":"(((AN132*Database!$U$3)+(AO132*Database!$V$3)+(AP132*Database!$W$3))*AM132)","v":0},125,{"$f":"COUNTIFS(Output!$S$5:$S$36,Indoor!A132,Output!$R$6:$R$37,Indoor!AR132)","v":0},0,0,0,{"$f":"(((AT132*Database!$U$3)+(AU132*Database!$V$3)+(AV132*Database!$W$3))*AS132)","v":0},125,{"$f":"COUNTIFS(Output!$U$5:$U$36,Indoor!A132,Output!$T$6:$T$37,Indoor!AX132)","v":0},0,0,0,{"$f":"(((AZ132*Database!$U$3)+(BA132*Database!$V$3)+(BB132*Database!$W$3))*AY132)","v":0},125,{"$f":"COUNTIFS(Output!$W$5:$W$36,Indoor!A132,Output!$V$6:$V$37,Indoor!BD132)","v":0},0,0,0,{"$f":"(((BF132*Database!$U$3)+(BG132*Database!$V$3)+(BH132*Database!$W$3))*BE132)","v":0},0]
[{"$f":"Lists!$F$7","v":"Floor Standing"},200,{"$f":"COUNTIFS(Output!$E$5:$E$36,Indoor!A133,Output!$D$6:$D$37,Indoor!B133)","v":0},null,null,0,{"$f":"(((D133*Database!$U$3)+(E133*Database!$V$3)+(F133*Database!$W$3))*C133)","v":0},200,{"$f":"COUNTIFS(Output!$G$5:$G$36,Indoor!A133,Output!$F$6:$F$37,Indoor!H133)","v":0},0,0,0,{"$f":"(((J133*Database!$U$3)+(K133*Database!$V$3)+(L133*Database!$W$3))*I133)","v":0},200,{"$f":"COUNTIFS(Output!$I$5:$I$36,Indoor!A133,Output!$H$6:$H$37,Indoor!N133)","v":0},0,0,0,{"$f":"(((P133*Database!$U$3)+(Q133*Database!$V$3)+(R133*Database!$W$3))*O133)","v":0},200,{"$f":"COUNTIFS(Output!$K$5:$K$36,Indoor!A133,Output!$J$6:$J$37,Indoor!T133)","v":0},0,0,0,{"$f":"(((V133*Database!$U$3)+(W133*Database!$V$3)+(X133*Database!$W$3))*U133)","v":0},200,{"$f":"COUNTIFS(Output!$M$5:$M$36,Indoor!A133,Output!$L$6:$L$37,Indoor!Z133)","v":0},0,0,0,{"$f":"(((AB133*Database!$U$3)+(AC133*Database!$V$3)+(AD133*Database!$W$3))*AA133)","v":0},200,{"$f":"COUNTIFS(Output!$O$5:$O$36,Indoor!A133,Output!$N$6:$N$37,Indoor!AF133)","v":0},0,0,0,{"$f":"(((AH133*Database!$U$3)+(AI133*Database!$V$3)+(AJ133*Database!$W$3))*AG133)","v":0},200,{"$f":"COUNTIFS(Output!$Q$5:$Q$36,Indoor!A133,Output!$P$6:$P$37,Indoor!AL133)","v":0},0,0,0,{"$f":"(((AN133*Database!$U$3)+(AO133*Database!$V$3)+(AP133*Database!$W$3))*AM133)","v":0},200,{"$f":"COUNTIFS(Output!$S$5:$S$36,Indoor!A133,Output!$R$6:$R$37,Indoor!AR133)","v":0},0,0,0,{"$f":"(((AT133*Database!$U$3)+(AU133*Database!$V$3)+(AV133*Database!$W$3))*AS133)","v":0},200,{"$f":"COUNTIFS(Output!$U$5:$U$36,Indoor!A133,Output!$T$6:$T$37,Indoor!AX133)","v":0},0,0,0,{"$f":"(((AZ133*Database!$U$3)+(BA133*Database!$V$3)+(BB133*Database!$W$3))*AY133)","v":0},200,{"$f":"COUNTIFS(Output!$W$5:$W$36,Indoor!A133,Output!$V$6:$V$37,Indoor!BD133)","v":0},0,0,0,{"$f":"(((BF133*Database!$U$3)+(BG133*Database!$V$3)+(BH133*Database!$W$3))*BE133)","v":0},0]
[{"$f":"Lists!$F$7","v":"Floor Standing"},250,{"$f":"COUNTIFS(Output!$E$5:$E$36,Indoor!A134,Output!$D$6:$D$37,Indoor!B134)","v":0},null,null,0,{"$f":"(((D134*Database!$U$3)+(E134*Database!$V$3)+(F134*Database!$W$3))*C134)","v":0},250,{"$f":"COUNTIFS(Output!$G$5:$G$36,Indoor!A134,Output!$F$6:$F$37,Indoor!H134)","v":0},0,0,0,{"$f":"(((J134*Database!$U$3)+(K134*Database!$V$3)+(L134*Database!$W$3))*I134)","v":0},250,{"$f":"COUNTIFS(Output!$I$5:$I$36,Indoor!A134,Output!$H$6:$H$37,Indoor!N134)","v":0},0,0,0,{"$f":"(((P134*Database!$U$3)+(Q134*Database!$V$3)+(R134*Database!$W$3))*O134)","v":0},250,{"$f":"COUNTIFS(Output!$K$5:$K$36,Indoor!A134,Output!$J$6:$J$37,Indoor!T134)","v":0},0,0,0,{"$f":"(((V134*Database!$U$3)+(W134*Database!$V$3)+(X134*Database!$W$3))*U134)","v":0},250,{"$f":"COUNTIFS(Output!$M$5:$M$36,Indoor!A134,Output!$L$6:$L$37,Indoor!Z134)","v":0},0,0,0,{"$f":"(((AB134*Database!$U$3)+(AC134*Database!$V$3)+(AD134*Database!$W$3))*AA134)","v":0},250,{"$f":"COUNTIFS(Output!$O$5:$O$36,Indoor!A134,Output!$N$6:$N$37,Indoor!AF134)","v":0},0,0,0,{"$f":"(((AH134*Database!$U$3)+(AI134*Database!$V$3)+(AJ134*Database!$W$3))*AG134)","v":0},250,{"$f":"COUNTIFS(Output!$Q$5:$Q$36,Indoor!A134,Output!$P$6:$P$37,Indoor!AL134)","v":0},0,0,0,{"$f":"(((AN134*Database!$U$3)+(AO134*Database!$V$3)+(AP134*Database!$W$3))*AM134)","v":0},250,{"$f":"COUNTIFS(Output!$S$5:$S$36,Indoor!A134,Output!$R$6:$R$37,Indoor!AR134)","v":0},0,0,0,{"$f":"(((AT134*Database!$U$3)+(AU134*Database!$V$3)+(AV134*Database!$W$3))*AS134)","v":0},250,{"$f":"COUNTIFS(Output!$U$5:$U$36,Indoor!A134,Output!$T$6:$T$37,Indoor!AX134)","v":0},0,0,0,{"$f":"(((AZ134*Database!$U$3)+(BA134*Database!$V$3)+(BB134*Database!$W$3))*AY134)","v":0},250,{"$f":"COUNTIFS(Output!$W$5:$W$36,Indoor!A134,Output!$V$6:$V$37,Indoor!BD134)","v":0},0,0,0,{"$f":"(((BF134*Database!$U$3)+(BG134*Database!$V$3)+(BH134*Database!$W$3))*BE134)","v":0},0]
["FXNQ",null,{"$f":"SUM(C124:C134)","v":0},null,null,null,null,null,{"$f":"SUM(I124:I134)","v":0},null,null,null,null,null,{"$f":"SUM(O124:O134)","v":0},null,null,null,null,null,{"$f":"SUM(U124:U134)","v":0},null,null,null,null,null,{"$f":"SUM(AA124:AA134)","v":0},null,null,null,null,null,{"$f":"SUM(AG124:AG134)","v":0},null,null,null,null,null,{"$f":"SUM(AM124:AM134)","v":0},null,null,null,null,null,{"$f":"SUM(AS124:AS134)","v":0},null,null,null,null,null,{"$f":"SUM(AY124:AY134)","v":0},null,null,null,null,null,{"$f":"SUM(BE124:BE134)","v":0}]
[{"$f":"Lists!$F$8","v":"Concealed Floor"},20,{"$f":"COUNTIFS(Output!$E$5:$E$36,Indoor!A136,Output!$D$6:$D$37,Indoor!B136)","v":0},4.9000000000000002E-2,4.9000000000000002E-2,4.9000000000000002E-2,{"$f":"(((D136*Database!$U$3)+(E136*Database!$V$3)+(F136*Database!$W$3))*C136)","v":0},20,{"$f":"COUNTIFS(Output!$G$5:$G$36,Indoor!A136,Output!$F$6:$F$37,Indoor!H136)","v":0},{"$f":"D136","v":4.9000000000000002E-2},{"$f":"E136","v":4.9000000000000002E-2},{"$f":"F136","v":4.9000000000000002E-2},{"$f":"(((J136*Database!$U$3)+(K136*Database!$V$3)+(L136*Database!$W$3))*I136)","v":0},20,{"$f":"COUNTIFS(Output!$I$5:$I$36,Indoor!A136,Output!$H$6:$H$37,Indoor!N136)","v":0},{"$f":"D136","v":4.9000000000000002E-2},{"$f":"E136","v":4.9000000000000002E-2},{"$f":"F136","v":4.9000000000000002E-2},{"$f":"(((P136*Database!$U$3)+(Q136*Database!$V$3)+(R136*Database!$W$3))*O136)","v":0},20,{"$f":"COUNTIFS(Output!$K$5:$K$36,Indoor!A136,Output!$J$6:$J$37,Indoor!T136)","v":0},{"$f":"D136","v":4.9000000000000002E-2},{"$f":"E136","v":4.9000000000000002E-2},{"$f":"F136","v":4.9000000000000002E-2},{"$f":"(((V136*Database!$U$3)+(W136*Database!$V$3)+(X136*Database!$W$3))*U136)","v":0},20,{"$f":"COUNTIFS(Output!$M$5:$M$36,Indoor!A136,Output!$L$6:$L$37,Indoor!Z136)","v":0},{"$f":"D136","v":4.9000000000000002E-2},{"$f":"E136","v":4.9000000000000002E-2},{"$f":"F136","v":4.9000000000000002E-2},{"$f":"(((AB136*Database!$U$3)+(AC136*Database!$V$3)+(AD136*Database!$W$3))*AA136)","v":0},20,{"$f":"COUNTIFS(Output!$O$5:$O$36,Indoor!A136,Output!$N$6:$N$37,Indoor!AF136)","v":0},{"$f":"D136","v":4.9000000000000002E-2},{"$f":"E136","v":4.9000000000000002E-2},{"$f":"F136","v":4.9000000000000002E-2},{"$f":"(((AH136*Database!$U$3)+(AI136*Database!$V$3)+(AJ136*Database!$W$3))*AG136)","v":0},20,{"$f":"COUNTIFS(Output!$Q$5:$Q$36,Indoor!A136,Output!$P$6:$P$37,Indoor!AL136)","v":0},{"$f":"D136","v":4.9000000000000002E-2},{"$f":"E136","v":4.9000000000000002E-2},{"$f":"F136","v":4.9000000000000002E-2},{"$f":"(((AN136*Database!$U$3)+(AO136*Database!$V$3)+(AP136*Database!$W$3))*AM136)","v":0},20,{"$f":"COUNTIFS(Output!$S$5:$S$36,Indoor!A136,Output!$R$6:$R$37,Indoor!AR136)","v":0},{"$f":"D136","v":4.9000000000000002E-2},{"$f":"E136","v":4.9000000000000002E-2},{"$f":"F136","v":4.9000000000000002E-2},{"$f":"(((AT136*Database!$U$3)+(AU136*Database!$V$3)+(AV136*Database!$W$3))*AS136)","v":0},20,{"$f":"COUNTIFS(Output!$U$5:$U$36,Indoor!A136,Output!$T$6:$T$37,Indoor!AX136)","v":0},{"$f":"D136","v":4.9000000000000002E-2},{"$f":"E136","v":4.9000000000000002E-2},{"$f":"F136","v":4.9000000000000002E-2},{"$f":"(((AZ136*Database!$U$3)+(BA136*Database!$V$3)+(BB136*Database!$W$3))*AY136)","v":0},20,{"$f":"COUNTIFS(Output!$W$5:$W$36,Indoor!A136,Output!$V$6:$V$37,Indoor!BD136)","v":0},{"$f":"D136","v":4.9000000000000002E-2},{"$f":"E136","v":4.9000000000000002E-2},{"$f":"F136","v":4.9000000000000002E-2},{"$f":"(((BF136*Database!$U$3)+(BG136*Database!$V$3)+(BH136*Database!$W$3))*BE136)","v":0},{"$f":"SUM(BE136+AY136+AS136+AM136+AG136+AA136+U136+O136+I136+C136)","v":0}]
[{"$f":"Lists!$F$8","v":"Concealed Floor"},25,{"$f":"COUNTIFS(Output!$E$5:$E$36,Indoor!A137,Output!$D$6:$D$37,Indoor!B137)","v":0},4.9000000000000002E-2,4.9000000000000002E-2,4.9000000000000002E-2,{"$f":"(((D137*Database!$U$3)+(E137*Database!$V$3)+(F137*Database!$W$3))*C137)","v":0},25,{"$f":"COUNTIFS(Output!$G$5:$G$36,Indoor!A137,Output!$F$6:$F$37,Indoor!H137)","v":0},4.9000000000000002E-2,4.9000000000000002E-2,4.9000000000000002E-2,{"$f":"(((J137*Database!$U$3)+(K137*Database!$V$3)+(L137*Database!$W$3))*I137)","v":0},25,{"$f":"COUNTIFS(Output!$I$5:$I$36,Indoor!A137,Output!$H$6:$H$37,Indoor!N137)","v":0},4.9000000000000002E-2,4.9000000000000002E-2,4.9000000000000002E-2,{"$f":"(((P137*Database!$U$3)+(Q137*Database!$V$3)+(R137*Database!$W$3))*O137)","v":0},25,{"$f":"COUNTIFS(Output!$K$5:$K$36,Indoor!A137,Output!$J$6:$J$37,Indoor!T137)","v":0},4.9000000000000002E-2,4.9000000000000002E-2,4.9000000000000002E-2,{"$f":"(((V137*Database!$U$3)+(W137*Database!$V$3)+(X137*Database!$W$3))*U137)","v":0},25,{"$f":"COUNTIFS(Output!$M$5:$M$36,Indoor!A137,Output!$L$6:$L$37,Indoor!Z137)","v":0},4.9000000000000002E-2,4.9000000000000002E-2,4.9000000000000002E-2,{"$f":"(((AB137*Database!$U$3)+(AC137*Database!$V$3)+(AD137*Database!$W$3))*AA137)","v":0},25,{"$f":"COUNTIFS(Output!$O$5:$O$36,Indoor!A137,Output!$N$6:$N$37,Indoor!AF137)","v":0},4.9000000000000002E-2,4.9000000000000002E-2,4.9000000000000002E-2,{"$f":"(((AH137*Database!$U$3)+(AI137*Database!$V$3)+(AJ137*Database!$W$3))*AG137)","v":0},25,{"$f":"COUNTIFS(Output!$Q$5:$Q$36,Indoor!A137,Output!$P$6:$P$37,Indoor!AL137)","v":0},4.9000000000000002E-2,4.9000000000000002E-2,4.9000000000000002E-2,{"$f":"(((AN137*Database!$U$3)+(AO137*Database!$V$3)+(AP137*Database!$W$3))*AM137)","v":0},25,{"$f":"COUNTIFS(Output!$S$5:$S$36,Indoor!A137,Output!$R$6:$R$37,Indoor!AR137)","v":0},4.9000000000000002E-2,4.9000000000000002E-2,4.9000000000000002E-2,{"$f":"(((AT137*Database!$U$3)+(AU137*Database!$V$3)+(AV137*Database!$W$3))*AS137)","v":0},25,{"$f":"COUNTIFS(Output!$U$5:$U$36,Indoor!A137,Output!$T$6:$T$37,Indoor!AX137)","v":0},4.9000000000000002E-2,4.9000000000000002E-2,4.9000000000000002E-2,{"$f":"(((AZ137*Database!$U$3)+(BA137*Database!$V$3)+(BB137*Database!$W$3))*AY137)","v":0},25,{"$f":"COUNTIFS(Output!$W$5:$W$36,Indoor!A137,Output!$V$6:$V$37,Indoor!BD137)","v":0},4.9000000000000002E-2,4.9000000000000002E-2,4.9000000000000002E-2,{"$f":"(((BF137*Database!$U$3)+(BG137*Database!$V$3)+(BH137*Database!$W$3))*BE137)","v":0},0]
[{"$f":"Lists!$F$8","v":"Concealed Floor"},31.25,{"$f":"COUNTIFS(Output!$E$5:$E$36,Indoor!A138,Output!$D$6:$D$37,Indoor!B138)","v":0},0.09,0.09,0.09,{"$f":"(((D138*Database!$U$3)+(E138*Database!$V$3)+(F138*Database!$W$3))*C138)","v":0},31.25,{"$f":"COUNTIFS(Output!$G$5:$G$36,Indoor!A138,Output!$F$6:$F$37,Indoor!H138)","v":0},0.09,0.09,0.09,{"$f":"(((J138*Database!$U$3)+(K138*Database!$V$3)+(L138*Database!$W$3))*I138)","v":0},31.25,{"$f":"COUNTIFS(Output!$I$5:$I$36,Indoor!A138,Output!$H$6:$H$37,Indoor!N138)","v":0},0.09,0.09,0.09,{"$f":"(((P138*Database!$U$3)+(Q138*Database!$V$3)+(R138*Database!$W$3))*O138)","v":0},31.25,{"$f":"COUNTIFS(Output!$K$5:$K$36,Indoor!A138,Output!$J$6:$J$37,Indoor!T138)","v":0},0.09,0.09,0.09,{"$f":"(((V138*Database!$U$3)+(W138*Database!$V$3)+(X138*Database!$W$3))*U138)","v":0},31.25,{"$f":"COUNTIFS(Output!$M$5:$M$36,Indoor!A138,Output!$L$6:$L$37,Indoor!Z138)","v":0},0.09,0.09,0.09,{"$f":"(((AB138*Database!$U$3)+(AC138*Database!$V$3)+(AD138*Database!$W$3))*AA138)","v":0},31.25,{"$f":"COUNTIFS(Output!$O$5:$O$36,Indoor!A138,Output!$N$6:$N$37,Indoor!AF138)","v":0},0.09,0.09,0.09,{"$f":"(((AH138*Database!$U$3)+(AI138*Database!$V$3)+(AJ138*Database!$W$3))*AG138)","v":0},31.25,{"$f":"COUNTIFS(Output!$Q$5:$Q$36,Indoor!A138,Output!$P$6:$P$37,Indoor!AL138)","v":0},0.09,0.09,0.09,{"$f":"(((AN138*Database!$U$3)+(AO138*Database!$V$3)+(AP138*Database!$W$3))*AM138)","v":0},31.25,{"$f":"COUNTIFS(Output!$S$5:$S$36,Indoor!A138,Output!$R$6:$R$37,Indoor!AR138)","v":0},0.09,0.09,0.09,{"$f":"(((AT138*Database!$U$3)+(AU138*Database!$V$3)+(AV138*Database!$W$3))*AS138)","v":0},31.25,{"$f":"COUNTIFS(Output!$U$5:$U$36,Indoor!A138,Output!$T$6:$T$37,Indoor!AX138)","v":0},0.09,0.09,0.09,{"$f":"(((AZ138*Database!$U$3)+(BA138*Database!$V$3)+(BB138*Database!$W$3))*AY138)","v":0},31.25,{"$f":"COUNTIFS(Output!$W$5:$W$36,Indoor!A138,Output!$V$6:$V$37,Indoor!BD138)","v":0},0.09,0.09,0.09,{"$f":"(((BF138*Database!$U$3)+(BG138*Database!$V$3)+(BH138*Database!$W$3))*BE138)","v":0},0]
[{"$f":"Lists!$F$8","v":"Concealed Floor"},40,{"$f":"COUNTIFS(Output!$E$5:$E$36,Indoor!A139,Output!$D$6:$D$37,Indoor!B139)","v":0},0.09,0.09,0.09,{"$f":"(((D139*Database!$U$3)+(E139*Database!$V$3)+(F139*Database!$W$3))*C139)","v":0},40,{"$f":"COUNTIFS(Output!$G$5:$G$36,Indoor!A139,Output!$F$6:$F$37,Indoor!H139)","v":0},0.09,0.09,0.09,{"$f":"(((J139*Database!$U$3)+(K139*Database!$V$3)+(L139*Database!$W$3))*I139)","v":0},40,{"$f":"COUNTIFS(Output!$I$5:$I$36,Indoor!A139,Output!$H$6:$H$37,Indoor!N139)","v":0},0.09,0.09,0.09,{"$f":"(((P139*Database!$U$3)+(Q139*Database!$V$3)+(R139*Database!$W$3))*O139)","v":0},40,{"$f":"COUNTIFS(Output!$K$5:$K$36,Indoor!A139,Output!$J$6:$J$37,Indoor!T139)","v":0},0.09,0.09,0.09,{"$f":"(((V139*Database!$U$3)+(W139*Database!$V$3)+(X139*Database!$W$3))*U139)","v":0},40,{"$f":"COUNTIFS(Output!$M$5:$M$36,Indoor!A139,Output!$L$6:$L$37,Indoor!Z139)","v":0},0.09,0.09,0.09,{"$f":"(((AB139*Database!$U$3)+(AC139*Database!$V$3)+(AD139*Database!$W$3))*AA139)","v":0},40,{"$f":"COUNTIFS(Output!$O$5:$O$36,Indoor!A139,Output!$N$6:$N$37,Indoor!AF139)","v":0},0.09,0.09,0.09,{"$f":"(((AH139*Database!$U$3)+(AI139*Database!$V$3)+(AJ139*Database!$W$3))*AG139)","v":0},40,{"$f":"COUNTIFS(Output!$Q$5:$Q$36,Indoor!A139,Output!$P$6:$P$37,Indoor!AL139)","v":0},0.09,0.09,0.09,{"$f":"(((AN139*Database!$U$3)+(AO139*Database!$V$3)+(AP139*Database!$W$3))*AM139)","v":0},40,{"$f":"COUNTIFS(Output!$S$5:$S$36,Indoor!A139,Output!$R$6:$R$37,Indoor!AR139)","v":0},0.09,0.09,0.09,{"$f":"(((AT139*Database!$U$3)+(AU139*Database!$V$3)+(AV139*Database!$W$3))*AS139)","v":0},40,{"$f":"COUNTIFS(Output!$U$5:$U$36,Indoor!A139,Output!$T$6:$T$37,Indoor!AX139)","v":0},0.09,0.09,0.09,{"$f":"(((AZ139*Database!$U$3)+(BA139*Database!$V$3)+(BB139*Database!$W$3))*AY139)","v":0},40,{"$f":"COUNTIFS(Output!$W$5:$W$36,Indoor!A139,Output!$V$6:$V$37,Indoor!BD139)","v":0},0.09,0.09,0.09,{"$f":"(((BF139*Database!$U$3)+(BG139*Database!$V$3)+(BH139*Database!$W$3))*BE139)","v":0},0]
[{"$f":"Lists!$F$8","v":"Concealed Floor"},50,{"$f":"COUNTIFS(Output!$E$5:$E$36,Indoor!A140,Output!$D$6:$D$37,Indoor!B140)","v":0},0.11,0.11,0.11,{"$f":"(((D140*Database!$U$3)+(E140*Database!$V$3)+(F140*Database!$W$3))*C140)","v":0},50,{"$f":"COUNTIFS(Output!$G$5:$G$36,Indoor!A140,Output!$F$6:$F$37,Indoor!H140)","v":0},0.11,0.11,0.11,{"$f":"(((J140*Database!$U$3)+(K140*Database!$V$3)+(L140*Database!$W$3))*I140)","v":0},50,{"$f":"COUNTIFS(Output!$I$5:$I$36,Indoor!A140,Output!$H$6:$H$37,Indoor!N140)","v":0},0.11,0.11,0.11,{"$f":"(((P140*Database!$U$3)+(Q140*Database!$V$3)+(R140*Database!$W$3))*O140)","v":0},50,{"$f":"COUNTIFS(Output!$K$5:$K$36,Indoor!A140,Output!$J$6:$J$37,Indoor!T140)","v":0},0.11,0.11,0.11,{"$f":"(((V140*Database!$U$3)+(W140*Database!$V$3)+(X140*Database!$W$3))*U140)","v":0},50,{"$f":"COUNTIFS(Output!$M$5:$M$36,Indoor!A140,Output!$L$6:$L$37,Indoor!Z140)","v":0},0.11,0.11,0.11,{"$f":"(((AB140*Database!$U$3)+(AC140*Database!$V$3)+(AD140*Database!$W$3))*AA140)","v":0},50,{"$f":"COUNTIFS(Output!$O$5:$O$36,Indoor!A140,Output!$N$6:$N$37,Indoor!AF140)","v":0},0.11,0.11,0.11,{"$f":"(((AH140*Database!$U$3)+(AI140*Database!$V$3)+(AJ140*Database!$W$3))*AG140)","v":0},50,{"$f":"COUNTIFS(Output!$Q$5:$Q$36,Indoor!A140,Output!$P$6:$P$37,Indoor!AL140)","v":0},0.11,0.11,0.11,{"$f":"(((AN140*Database!$U$3)+(AO140*Database!$V$3)+(AP140*Database!$W$3))*AM140)","v":0},50,{"$f":"COUNTIFS(Output!$S$5:$S$36,Indoor!A140,Output!$R$6:$R$37,Indoor!AR140)","v":0},0.11,0.11,0.11,{"$f":"(((AT140*Database!$U$3)+(AU140*Database!$V$3)+(AV140*Database!$W$3))*AS140)","v":0},50,{"$f":"COUNTIFS(Output!$U$5:$U$36,Indoor!A140,Output!$T$6:$T$37,Indoor!AX140)","v":0},0.11,0.11,0.11,{"$f":"(((AZ140*Database!$U$3)+(BA140*Database!$V$3)+(BB140*Database!$W$3))*AY140)","v":0},50,{"$f":"COUNTIFS(Output!$W$5:$W$36,Indoor!A140,Output!$V$6:$V$37,Indoor!BD140)","v":0},0.11,0.11,0.11,{"$f":"(((BF140*Database!$U$3)+(BG140*Database!$V$3)+(BH140*Database!$W$3))*BE140)","v":0},0]
[{"$f":"Lists!$F$8","v":"Concealed Floor"},63,{"$f":"COUNTIFS(Output!$E$5:$E$36,Indoor!A141,Output!$D$6:$D$37,Indoor!B141)","v":0},0.11,0.11,{"$f":"(D141+E141)/2","v":0.11},{"$f":"(((D141*Database!$U$3)+(E141*Database!$V$3)+(F141*Database!$W$3))*C141)","v":0},63,{"$f":"COUNTIFS(Output!$G$5:$G$36,Indoor!A141,Output!$F$6:$F$37,Indoor!H141)","v":0},0.11,0.11,0.11,{"$f":"(((J141*Database!$U$3)+(K141*Database!$V$3)+(L141*Database!$W$3))*I141)","v":0},63,{"$f":"COUNTIFS(Output!$I$5:$I$36,Indoor!A141,Output!$H$6:$H$37,Indoor!N141)","v":0},0.11,0.11,0.11,{"$f":"(((P141*Database!$U$3)+(Q141*Database!$V$3)+(R141*Database!$W$3))*O141)","v":0},63,{"$f":"COUNTIFS(Output!$K$5:$K$36,Indoor!A141,Output!$J$6:$J$37,Indoor!T141)","v":0},0.11,0.11,0.11,{"$f":"(((V141*Database!$U$3)+(W141*Database!$V$3)+(X141*Database!$W$3))*U141)","v":0},63,{"$f":"COUNTIFS(Output!$M$5:$M$36,Indoor!A141,Output!$L$6:$L$37,Indoor!Z141)","v":0},0.11,0.11,0.11,{"$f":"(((AB141*Database!$U$3)+(AC141*Database!$V$3)+(AD141*Database!$W$3))*AA141)","v":0},63,{"$f":"COUNTIFS(Output!$O$5:$O$36,Indoor!A141,Output!$N$6:$N$37,Indoor!AF141)","v":0},0.11,0.11,0.11,{"$f":"(((AH141*Database!$U$3)+(AI141*Database!$V$3)+(AJ141*Database!$W$3))*AG141)","v":0},63,{"$f":"COUNTIFS(Output!$Q$5:$Q$36,Indoor!A141,Output!$P$6:$P$37,Indoor!AL141)","v":0},0.11,0.11,0.11,{"$f":"(((AN141*Database!$U$3)+(AO141*Database!$V$3)+(AP141*Database!$W$3))*AM141)","v":0},63,{"$f":"COUNTIFS(Output!$S$5:$S$36,Indoor!A141,Output!$R$6:$R$37,Indoor!AR141)","v":0},0.11,0.11,0.11,{"$f":"(((AT141*Database!$U$3)+(AU141*Database!$V$3)+(AV141*Database!$W$3))*AS141)","v":0},63,{"$f":"COUNTIFS(Output!$U$5:$U$36,Indoor!A141,Output!$T$6:$T$37,Indoor!AX141)","v":0},0.11,0.11,0.11,{"$f":"(((AZ141*Database!$U$3)+(BA141*Database!$V$3)+(BB141*Database!$W$3))*AY141)","v":0},63,{"$f":"COUNTIFS(Output!$W$5:$W$36,Indoor!A141,Output!$V$6:$V$37,Indoor!BD141)","v":0},0.11,0.11,0.11,{"$f":"(((BF141*Database!$U$3)+(BG141*Database!$V$3)+(BH141*Database!$W$3))*BE141)","v":0},0]
[{"$f":"Lists!$F$8","v":"Concealed Floor"},80,{"$f":"COUNTIFS(Output!$E$5:$E$36,Indoor!A142,Output!$D$6:$D$37,Indoor!B142)","v":0},null,null,0,{"$f":"(((D142*Database!$U$3)+(E142*Database!$V$3)+(F142*Database!$W$3))*C142)","v":0},80,{"$f":"COUNTIFS(Output!$G$5:$G$36,Indoor!A142,Output!$F$6:$F$37,Indoor!H142)","v":0},0,0,0,{"$f":"(((J142*Database!$U$3)+(K142*Database!$V$3)+(L142*Database!$W$3))*I142)","v":0},80,{"$f":"COUNTIFS(Output!$I$5:$I$36,Indoor!A142,Output!$H$6:$H$37,Indoor!N142)","v":0},0,0,0,{"$f":"(((P142*Database!$U$3)+(Q142*Database!$V$3)+(R142*Database!$W$3))*O142)","v":0},80,{"$f":"COUNTIFS(Output!$K$5:$K$36,Indoor!A142,Output!$J$6:$J$37,Indoor!T142)","v":0},0,0,0,{"$f":"(((V142*Database!$U$3)+(W142*Database!$V$3)+(X142*Database!$W$3))*U142)","v":0},80,{"$f":"COUNTIFS(Output!$M$5:$M$36,Indoor!A142,Output!$L$6:$L$37,Indoor!Z142)","v":0},0,0,0,{"$f":"(((AB142*Database!$U$3)+(AC142*Database!$V$3)+(AD142*Database!$W$3))*AA142)","v":0},80,{"$f":"COUNTIFS(Output!$O$5:$O$36,Indoor!A142,Output!$N$6:$N$37,Indoor!AF142)","v":0},0,0,0,{"$f":"(((AH142*Database!$U$3)+(AI142*Database!$V$3)+(AJ142*Database!$W$3))*AG142)","v":0},80,{"$f":"COUNTIFS(Output!$Q$5:$Q$36,Indoor!A142,Output!$P$6:$P$37,Indoor!AL142)","v":0},0,0,0,{"$f":"(((AN142*Database!$U$3)+(AO142*Database!$V$3)+(AP142*Database!$W$3))*AM142)","v":0},80,{"$f":"COUNTIFS(Output!$S$5:$S$36,Indoor!A142,Output!$R$6:$R$37,Indoor!AR142)","v":0},0,0,0,{"$f":"(((AT142*Database!$U$3)+(AU142*Database!$V$3)+(AV142*Database!$W$3))*AS142)","v":0},80,{"$f":"COUNTIFS(Output!$U$5:$U$36,Indoor!A142,Output!$T$6:$T$37,Indoor!AX142)","v":0},0,0,0,{"$f":"(((AZ142*Database!$U$3)+(BA142*Database!$V$3)+(BB142*Database!$W$3))*AY142)","v":0},80,{"$f":"COUNTIFS(Output!$W$5:$W$36,Indoor!A142,Output!$V$6:$V$37,Indoor!BD142)","v":0},0,0,0,{"$f":"(((BF142*Database!$U$3)+(BG142*Database!$V$3)+(BH142*Database!$W$3))*BE142)","v":0},0]
[{"$f":"Lists!$F$8","v":"Concealed Floor"},100,{"$f":"COUNTIFS(Output!$E$5:$E$36,Indoor!A143,Output!$D$6:$D$37,Indoor!B143)","v":0},null,null,0,{"$f":"(((D143*Database!$U$3)+(E143*Database!$V$3)+(F143*Database!$W$3))*C143)","v":0},100,{"$f":"COUNTIFS(Output!$G$5:$G$36,Indoor!A143,Output!$F$6:$F$37,Indoor!H143)","v":0},0,0,0,{"$f":"(((J143*Database!$U$3)+(K143*Database!$V$3)+(L143*Database!$W$3))*I143)","v":0},100,{"$f":"COUNTIFS(Output!$I$5:$I$36,Indoor!A143,Output!$H$6:$H$37,Indoor!N143)","v":0},0,0,0,{"$f":"(((P143*Database!$U$3)+(Q143*Database!$V$3)+(R143*Database!$W$3))*O143)","v":0},100,{"$f":"COUNTIFS(Output!$K$5:$K$36,Indoor!A143,Output!$J$6:$J$37,Indoor!T143)","v":0},0,0,0,{"$f":"(((V143*Database!$U$3)+(W143*Database!$V$3)+(X143*Database!$W$3))*U143)","v":0},100,{"$f":"COUNTIFS(Output!$M$5:$M$36,Indoor!A143,Output!$L$6:$L$37,Indoor!Z143)","v":0},0,0,0,{"$f":"(((AB143*Database!$U$3)+(AC143*Database!$V$3)+(AD143*Database!$W$3))*AA143)","v":0},100,{"$f":"COUNTIFS(Output!$O$5:$O$36,Indoor!A143,Output!$N$6:$N$37,Indoor!AF143)","v":0},0,0,0,{"$f":"(((AH143*Database!$U$3)+(AI143*Database!$V$3)+(AJ143*Database!$W$3))*AG143)","v":0},100,{"$f":"COUNTIFS(Output!$Q$5:$Q$36,Indoor!A143,Output!$P$6:$P$37,Indoor!AL143)","v":0},0,0,0,{"$f":"(((AN143*Database!$U$3)+(AO143*Database!$V$3)+(AP143*Database!$W$3))*AM143)","v":0},100,{"$f":"COUNTIFS(Output!$S$5:$S$36,Indoor!A143,Output!$R$6:$R$37,Indoor!AR143)","v":0},0,0,0,{"$f":"(((AT143*Database!$U$3)+(AU143*Database!$V$3)+(AV143*Database!$W$3))*AS143)","v":0},100,{"$f":"COUNTIFS(Output!$U$5:$U$36,Indoor!A143,Output!$T$6:$T$37,Indoor!AX143)","v":0},0,0,0,{"$f":"(((AZ143*Database!$U$3)+(BA143*Database!$V$3)+(BB143*Database!$W$3))*AY143)","v":0},100,{"$f":"COUNTIFS(Output!$W$5:$W$36,Indoor!A143,Output!$V$6:$V$37,Indoor!BD143)","v":0},0,0,0,{"$f":"(((BF143*Database!$U$3)+(BG143*Database!$V$3)+(BH143*Database!$W$3))*BE143)","v":0},0]
[{"$f":"Lists!$F$8","v":"Concealed Floor"},125,{"$f":"COUNTIFS(Output!$E$5:$E$36,Indoor!A144,Output!$D$6:$D$37,Indoor!B144)","v":0},null,null,0,{"$f":"(((D144*Database!$U$3)+(E144*Database!$V$3)+(F144*Database!$W$3))*C144)","v":0},125,{"$f":"COUNTIFS(Output!$G$5:$G$36,Indoor!A144,Output!$F$6:$F$37,Indoor!H144)","v":0},0,0,0,{"$f":"(((J144*Database!$U$3)+(K144*Database!$V$3)+(L144*Database!$W$3))*I144)","v":0},125,{"$f":"COUNTIFS(Output!$I$5:$I$36,Indoor!A144,Output!$H$6:$H$37,Indoor!N144)","v":0},0,0,0,{"$f":"(((P144*Database!$U$3)+(Q144*Database!$V$3)+(R144*Database!$W$3))*O144)","v":0},125,{"$f":"COUNTIFS(Output!$K$5:$K$36,Indoor!A144,Output!$J$6:$J$37,Indoor!T144)","v":0},0,0,0,{"$f":"(((V144*Database!$U$3)+(W144*Database!$V$3)+(X144*Database!$W$3))*U144)","v":0},125,{"$f":"COUNTIFS(Output!$M$5:$M$36,Indoor!A144,Output!$L$6:$L$37,Indoor!Z144)","v":0},0,0,0,{"$f":"(((AB144*Database!$U$3)+(AC144*Database!$V$3)+(AD144*Database!$W$3))*AA144)","v":0},125,{"$f":"COUNTIFS(Output!$O$5:$O$36,Indoor!A144,Output!$N$6:$N$37,Indoor!AF144)","v":0},0,0,0,{"$f":"(((AH144*Database!$U$3)+(AI144*Database!$V$3)+(AJ144*Database!$W$3))*AG144)","v":0},125,{"$f":"COUNTIFS(Output!$Q$5:$Q$36,Indoor!A144,Output!$P$6:$P$37,Indoor!AL144)","v":0},0,0,0,{"$f":"(((AN144*Database!$U$3)+(AO144*Database!$V$3)+(AP144*Database!$W$3))*AM144)","v":0},125,{"$f":"COUNTIFS(Output!$S$5:$S$36,Indoor!A144,Output!$R$6:$R$37,Indoor!AR144)","v":0},0,0,0,{"$f":"(((AT144*Database!$U$3)+(AU144*Database!$V$3)+(AV144*Database!$W$3))*AS144)","v":0},125,{"$f":"COUNTIFS(Output!$U$5:$U$36,Indoor!A144,Output!$T$6:$T$37,Indoor!AX144)","v":0},0,0,0,{"$f":"(((AZ144*Database!$U$3)+(BA144*Database!$V$3)+(BB144*Database!$W$3))*AY144)","v":0},125,{"$f":"COUNTIFS(Output!$W$5:$W$36,Indoor!A144,Output!$V$6:$V$37,Indoor!BD144)","v":0},0,0,0,{"$f":"(((BF144*Database!$U$3)+(BG144*Database!$V$3)+(BH144*Database!$W$3))*BE144)","v":0},0]
[{"$f":"Lists!$F$8","v":"Concealed Floor"},200,{"$f":"COUNTIFS(Output!$E$5:$E$36,Indoor!A145,Output!$D$6:$D$37,Indoor!B145)","v":0},null,null,0,{"$f":"(((D145*Database!$U$3)+(E145*Database!$V$3)+(F145*Database!$W$3))*C145)","v":0},200,{"$f":"COUNTIFS(Output!$G$5:$G$36,Indoor!A145,Output!$F$6:$F$37,Indoor!H145)","v":0},0,0,0,{"$f":"(((J145*Database!$U$3)+(K145*Database!$V$3)+(L145*Database!$W$3))*I145)","v":0},200,{"$f":"COUNTIFS(Output!$I$5:$I$36,Indoor!A145,Output!$H$6:$H$37,Indoor!N145)","v":0},0,0,0,{"$f":"(((P145*Database!$U$3)+(Q145*Database!$V$3)+(R145*Database!$W$3))*O145)","v":0},200,{"$f":"COUNTIFS(Output!$K$5:$K$36,Indoor!A145,Output!$J$6:$J$37,Indoor!T145)","v":0},0,0,0,{"$f":"(((V145*Database!$U$3)+(W145*Database!$V$3)+(X145*Database!$W$3))*U145)","v":0},200,{"$f":"COUNTIFS(Output!$M$5:$M$36,Indoor!A145,Output!$L$6:$L$37,Indoor!Z145)","v":0},0,0,0,{"$f":"(((AB145*Database!$U$3)+(AC145*Database!$V$3)+(AD145*Database!$W$3))*AA145)","v":0},200,{"$f":"COUNTIFS(Output!$O$5:$O$36,Indoor!A145,Output!$N$6:$N$37,Indoor!AF145)","v":0},0,0,0,{"$f":"(((AH145*Database!$U$3)+(AI145*Database!$V$3)+(AJ145*Database!$W$3))*AG145)","v":0},200,{"$f":"COUNTIFS(Output!$Q$5:$Q$36,Indoor!A145,Output!$P$6:$P$37,Indoor!AL145)","v":0},0,0,0,{"$f":"(((AN145*Database!$U$3)+(AO145*Database!$V$3)+(AP145*Database!$W$3))*AM145)","v":0},200,{"$f":"COUNTIFS(Output!$S$5:$S$36,Indoor!A145,Output!$R$6:$R$37,Indoor!AR145)","v":0},0,0,0,{"$f":"(((AT145*Database!$U$3)+(AU145*Database!$V$3)+(AV145*Database!$W$3))*AS145)","v":0},200,{"$f":"COUNTIFS(Output!$U$5:$U$36,Indoor!A145,Output!$T$6:$T$37,Indoor!AX145)","v":0},0,0,0,{"$f":"(((AZ145*Database!$U$3)+(BA145*Database!$V$3)+(BB145*Database!$W$3))*AY145)","v":0},200,{"$f":"COUNTIFS(Output!$W$5:$W$36,Indoor!A145,Output!$V$6:$V$37,Indoor!BD145)","v":0},0,0,0,{"$f":"(((BF145*Database!$U$3)+(BG145*Database!$V$3)+(BH145*Database!$W$3))*BE145)","v":0},0]
[{"$f":"Lists!$F$8","v":"Concealed Floor"},250,{"$f":"COUNTIFS(Output!$E$5:$E$36,Indoor!A146,Output!$D$6:$D$37,Indoor!B146)","v":0},null,null,0,{"$f":"(((D146*Database!$U$3)+(E146*Database!$V$3)+(F146*Database!$W$3))*C146)","v":0},250,{"$f":"COUNTIFS(Output!$G$5:$G$36,Indoor!A146,Output!$F$6:$F$37,Indoor!H146)","v":0},0,0,0,{"$f":"(((J146*Database!$U$3)+(K146*Database!$V$3)+(L146*Database!$W$3))*I146)","v":0},250,{"$f":"COUNTIFS(Output!$I$5:$I$36,Indoor!A146,Output!$H$6:$H$37,Indoor!N146)","v":0},0,0,0,{"$f":"(((P146*Database!$U$3)+(Q146*Database!$V$3)+(R146*Database!$W$3))*O146)","v":0},250,{"$f":"COUNTIFS(Output!$K$5:$K$36,Indoor!A146,Output!$J$6:$J$37,Indoor!T146)","v":0},0,0,0,{"$f":"(((V146*Database!$U$3)+(W146*Database!$V$3)+(X146*Database!$W$3))*U146)","v":0},250,{"$f":"COUNTIFS(Output!$M$5:$M$36,Indoor!A146,Output!$L$6:$L$37,Indoor!Z146)","v":0},0,0,0,{"$f":"(((AB146*Database!$U$3)+(AC146*Database!$V$3)+(AD146*Database!$W$3))*AA146)","v":0},250,{"$f":"COUNTIFS(Output!$O$5:$O$36,Indoor!A146,Output!$N$6:$N$37,Indoor!AF146)","v":0},0,0,0,{"$f":"(((AH146*Database!$U$3)+(AI146*Database!$V$3)+(AJ146*Database!$W$3))*AG146)","v":0},250,{"$f":"COUNTIFS(Output!$Q$5:$Q$36,Indoor!A146,Output!$P$6:$P$37,Indoor!AL146)","v":0},0,0,0,{"$f":"(((AN146*Database!$U$3)+(AO146*Database!$V$3)+(AP146*Database!$W$3))*AM146)","v":0},250,{"$f":"COUNTIFS(Output!$S$5:$S$36,Indoor!A146,Output!$R$6:$R$37,Indoor!AR146)","v":0},0,0,0,{"$f":"(((AT146*Database!$U$3)+(AU146*Database!$V$3)+(AV146*Database!$W$3))*AS146)","v":0},250,{"$f":"COUNTIFS(Output!$U$5:$U$36,Indoor!A146,Output!$T$6:$T$37,Indoor!AX146)","v":0},0,0,0,{"$f":"(((AZ146*Database!$U$3)+(BA146*Database!$V$3)+(BB146*Database!$W$3))*AY146)","v":0},250,{"$f":"COUNTIFS(Output!$W$5:$W$36,Indoor!A146,Output!$V$6:$V$37,Indoor!BD146)","v":0},0,0,0,{"$f":"(((BF146*Database!$U$3)+(BG146*Database!$V$3)+(BH146*Database!$W$3))*BE146)","v":0},0]
[null,null,{"$f":"SUM(C136:C146)","v":0},null,null,null,null,null,{"$f":"SUM(I136:I146)","v":0},null,null,null,null,null,{"$f":"SUM(O136:O146)","v":0},null,null,null,null,null,{"$f":"SUM(U136:U146)","v":0},null,null,null,null,null,{"$f":"SUM(AA136:AA146)","v":0},null,null,null,null,null,{"$f":"SUM(AG136:AG146)","v":0},null,null,null,null,null,{"$f":"SUM(AM136:AM146)","v":0},null,null,null,null,null,{"$f":"SUM(AS136:AS146)","v":0},null,null,null,null,null,{"$f":"SUM(AY136:AY146)","v":0},null,null,null,null,null,{"$f":"SUM(BE136:BE146)","v":0},null,null,null,null,{"$f":"SUM(BJ76:BJ146)","v":3}]
[null,1,{"$f":"F148+G148","v":3262.1890000000003},null,null,{"$f":"VLOOKUP(Output!D5,Database!$A$8:$AR$53,25,FALSE)","v":3003.5635000000002},{"$f":"SUM(G76:G146)","v":258.62549999999999},2,{"$f":"L148+M148","v":0},null,null,{"$f":"IFERROR(VLOOKUP(Output!F5,Database!$A$8:$AR$53,25,FALSE),0)","v":0},{"$f":"SUM(M76:M146)","v":0},3,{"$f":"R148+S148","v":0},null,null,{"$f":"IFERROR(VLOOKUP(Output!H5,Database!$A$8:$AR$53,25,FALSE),0)","v":0},{"$f":"SUM(S76:S146)","v":0},4,{"$f":"X148+Y148","v":0},null,null,{"$f":"IFERROR(VLOOKUP(Output!J5,Database!$A$8:$AR$53,25,FALSE),0)","v":0},{"$f":"SUM(Y76:Y146)","v":0},5,{"$f":"AD148+AE148","v":0},null,null,{"$f":"IFERROR(VLOOKUP(Output!L5,Database!$A$8:$AR$53,25,FALSE),0)","v":0},{"$f":"SUM(AE76:AE146)","v":0},6,{"$f":"AJ148+AH148","v":0},null,null,{"$f":"IFERROR(VLOOKUP(Output!N5,Database!$A$8:$AR$53,25,FALSE),0)","v":0},{"$f":"SUM(AK76:AK146)","v":0},7,{"$f":"AP148+AQ148","v":0},null,null,{"$f":"IFERROR(VLOOKUP(Output!P5,Database!$A$8:$AR$53,25,FALSE),0)","v":0},{"$f":"SUM(AQ76:AQ146)","v":0},8,{"$f":"AV148+AW148","v":0},null,null,{"$f":"IFERROR(VLOOKUP(Output!R5,Database!$A$8:$AR$53,25,FALSE),0)","v":0},{"$f":"SUM(AW76:AW146)","v":0},9,{"$f":"BB148+BC148","v":0},null,null,{"$f":"IFERROR(VLOOKUP(Output!T5,Database!$A$8:$AR$53,25,FALSE),0)","v":0},{"$f":"SUM(BC76:BC146)","v":0},10,{"$f":"BH148+BI148","v":0},null,null,{"$f":"IFERROR(VLOOKUP(Output!V5,Database!$A$8:$AR$53,25,FALSE),0)","v":0},{"$f":"SUM(BI76:BI146)","v":0}]
[]
[]
[]
[null,null,"Outdoor","Indoor","Total"]
["Existing Installation",1,null,null,{"$f":"C74","v":5804.6905000000006},1]
[null,2,null,null,{"$f":"I74","v":{"$error":"#DIV/0!"}},2]
[null,3,null,null,{"$f":"O74","v":{"$error":"#DIV/0!"}},3]
[null,4,null,null,{"$f":"U74","v":{"$error":"#DIV/0!"}},4]
[null,5,null,null,{"$f":"AA74","v":{"$error":"#DIV/0!"}},5]
[null,6,null,null,{"$f":"AG74","v":{"$error":"#DIV/0!"}},6]
[null,7,null,null,{"$f":"AM74","v":{"$error":"#DIV/0!"}},7]
[null,8,null,null,{"$f":"AS74","v":{"$error":"#DIV/0!"}},8]
[null,9,null,null,{"$f":"AY74","v":{"$error":"#DIV/0!"}},9]
[null,10,null,null,{"$f":"BE74","v":{"$error":"#DIV/0!"}},10]
[{"$f":"Results!M6","v":"VRVQ + New IDUs"},1,{"$f":"VLOOKUP(Results!$C$29,Database!$A$8:$AR$54,25,FALSE)/VLOOKUP(Results!$C$29,Database!$A$8:$AR$54,41,FALSE)","v":3003.5635000000002},{"$f":"G148","v":258.62549999999999},{"$f":"SUM(C163:D163)","v":3262.1890000000003},1]
[null,2,{"$f":"VLOOKUP(Results!$C$36,Database!$A$8:$AR$54,25,FALSE)/VLOOKUP(Results!$C$36,Database!$A$8:$AR$54,41,FALSE)","v":{"$error":"#N/A"}},{"$f":"M148","v":0},{"$f":"SUM(C164:D164)","v":{"$error":"#N/A"}},2]
[null,3,{"$f":"VLOOKUP(Results!$C$50,Database!$A$8:$AR$54,25,FALSE)/VLOOKUP(Results!$C$50,Database!$A$8:$AR$54,41,FALSE)","v":{"$error":"#N/A"}},{"$f":"S148","v":0},{"$error":"#N/A"},3]
[null,4,{"$f":"VLOOKUP(Results!$C$57,Database!$A$8:$AR$54,25,FALSE)/VLOOKUP(Results!$C$57,Database!$A$8:$AR$54,41,FALSE)","v":{"$error":"#N/A"}},{"$f":"Y148","v":0},{"$error":"#N/A"},4]
[null,5,{"$f":"VLOOKUP(Results!$C$64,Database!$A$8:$AR$54,25,FALSE)/VLOOKUP(Results!$C$64,Database!$A$8:$AR$54,41,FALSE)","v":{"$error":"#N/A"}},{"$f":"AE148","v":0},{"$error":"#N/A"},5]
[null,6,{"$f":"VLOOKUP(Results!$C$71,Database!$A$8:$AR$54,25,FALSE)/VLOOKUP(Results!$C$71,Database!$A$8:$AR$54,41,FALSE)","v":{"$error":"#N/A"}},{"$f":"AK148","v":0},{"$error":"#N/A"},6]
[null,7,{"$f":"VLOOKUP(Results!$C$78,Database!$A$8:$AR$54,25,FALSE)/VLOOKUP(Results!$C$78,Database!$A$8:$AR$54,41,FALSE)","v":{"$error":"#N/A"}},{"$f":"AQ148","v":0},{"$error":"#N/A"},7]
[null,8,{"$f":"VLOOKUP(Results!$C$85,Database!$A$8:$AR$54,25,FALSE)/VLOOKUP(Results!$C$85,Database!$A$8:$AR$54,41,FALSE)","v":{"$error":"#N/A"}},{"$f":"AW148","v":0},{"$error":"#N/A"},8]
[null,9,{"$f":"VLOOKUP(Results!$C$92,Database!$A$8:$AR$54,25,FALSE)/VLOOKUP(Results!$C$92,Database!$A$8:$AR$54,41,FALSE)","v":{"$error":"#N/A"}},{"$f":"BC148","v":0},{"$error":"#N/A"},9]
[null,10,{"$f":"VLOOKUP(Results!$C$99,Database!$A$8:$AR$54,25,FALSE)/VLOOKUP(Results!$C$99,Database!$A$8:$AR$54,41,FALSE)","v":{"$error":"#N/A"}},{"$f":"BI148","v":0},{"$error":"#N/A"},10]
[{"$f":"Results!I6","v":"VRVQ + Old IDUs"},1,{"$f":"VLOOKUP(Results!$C$29,Database!$A$8:$AR$54,30,FALSE)/VLOOKUP(Results!$C$29,Database!$A$8:$AR$54,41,FALSE)","v":3003.5635000000002},{"$f":"IF(C173=0,0,G74)","v":362.68050000000005},3366.2440000000001,1]
[null,2,{"$f":"VLOOKUP(Results!$C$36,Database!$A$8:$AR$54,30,FALSE)/VLOOKUP(Results!$C$36,Database!$A$8:$AR$54,41,FALSE)","v":{"$error":"#N/A"}},{"$f":"IF(C174=0,0,M74)","v":{"$error":"#N/A"}},{"$error":"#N/A"},2]
[null,3,{"$f":"VLOOKUP(Results!$C$50,Database!$A$8:$AR$54,30,FALSE)/VLOOKUP(Results!$C$50,Database!$A$8:$AR$54,41,FALSE)","v":{"$error":"#N/A"}},{"$f":"IF(C175=0,0,S74)","v":{"$error":"#N/A"}},{"$error":"#N/A"},3]
[null,4,{"$f":"VLOOKUP(Results!$C$57,Database!$A$8:$AR$54,30,FALSE)/VLOOKUP(Results!$C$57,Database!$A$8:$AR$54,41,FALSE)","v":{"$error":"#N/A"}},{"$f":"IF(C176=0,0,Y74)","v":{"$error":"#N/A"}},{"$error":"#N/A"},4]
[null,5,{"$f":"VLOOKUP(Results!$C$64,Database!$A$8:$AR$54,30,FALSE)/VLOOKUP(Results!$C$64,Database!$A$8:$AR$54,41,FALSE)","v":{"$error":"#N/A"}},{"$f":"IF(C177=0,0,AE74)","v":{"$error":"#N/A"}},{"$error":"#N/A"},5]
[null,6,{"$f":"VLOOKUP(Results!$C$71,Database!$A$8:$AR$54,30,FALSE)/VLOOKUP(Results!$C$71,Database!$A$8:$AR$54,41,FALSE)","v":{"$error":"#N/A"}},{"$f":"IF(C178=0,0,AK74)","v":{"$error":"#N/A"}},{"$error":"#N/A"},6]
[null,7,{"$f":"VLOOKUP(Results!$C$78,Database!$A$8:$AR$54,30,FALSE)/VLOOKUP(Results!$C$78,Database!$A$8:$AR$54,41,FALSE)","v":{"$error":"#N/A"}},{"$f":"IF(C179=0,0,AQ74)","v":{"$error":"#N/A"}},{"$error":"#N/A"},7]
[null,8,{"$f":"VLOOKUP(Results!$C$85,Database!$A$8:$AR$54,30,FALSE)/VLOOKUP(Results!$C$85,Database!$A$8:$AR$54,41,FALSE)","v":{"$error":"#N/A"}},{"$f":"IF(C180=0,0,AW74)","v":{"$error":"#N/A"}},{"$error":"#N/A"},8]
[null,9,{"$f":"VLOOKUP(Results!$C$92,Database!$A$8:$AR$54,30,FALSE)/VLOOKUP(Results!$C$92,Database!$A$8:$AR$54,41,FALSE)","v":{"$error":"#N/A"}},{"$f":"IF(C181=0,0,BC74)","v":{"$error":"#N/A"}},{"$error":"#N/A"},9]
[null,10,{"$f":"VLOOKUP(Results!$C$99,Database!$A$8:$AR$54,30,FALSE)/VLOOKUP(Results!$C$99,Database!$A$8:$AR$54,41,FALSE)","v":{"$error":"#N/A"}},{"$f":"IF(C182=0,0,BI74)","v":{"$error":"#N/A"}},{"$error":"#N/A"},10]
[{"$f":"Results!Q6","v":"Based on the latest VRV Systems"},1,{"$f":"VLOOKUP(Results!$C$29,Database!$A$8:$AR$54,35,FALSE)/VLOOKUP(Results!$C$29,Database!$A$8:$AR$54,41,FALSE)","v":3003.5635000000002},{"$f":"D163","v":258.62549999999999},3262.1890000000003,1]
[null,2,{"$f":"VLOOKUP(Results!$C$36,Database!$A$8:$AR$54,35,FALSE)/VLOOKUP(Results!$C$36,Database!$A$8:$AR$54,41,FALSE)","v":{"$error":"#N/A"}},{"$f":"D164","v":0},{"$error":"#N/A"},2]
[null,3,{"$f":"VLOOKUP(Results!$C$50,Database!$A$8:$AR$54,35,FALSE)/VLOOKUP(Results!$C$50,Database!$A$8:$AR$54,41,FALSE)","v":{"$error":"#N/A"}},0,{"$error":"#N/A"},3]
[null,4,{"$f":"VLOOKUP(Results!$C$57,Database!$A$8:$AR$54,35,FALSE)/VLOOKUP(Results!$C$57,Database!$A$8:$AR$54,41,FALSE)","v":{"$error":"#N/A"}},0,{"$error":"#N/A"},4]
[null,5,{"$f":"VLOOKUP(Results!$C$64,Database!$A$8:$AR$54,35,FALSE)/VLOOKUP(Results!$C$64,Database!$A$8:$AR$54,41,FALSE)","v":{"$error":"#N/A"}},0,{"$error":"#N/A"},5]
[null,6,{"$f":"VLOOKUP(Results!$C$71,Database!$A$8:$AR$54,35,FALSE)/VLOOKUP(Results!$C$71,Database!$A$8:$AR$54,41,FALSE)","v":{"$error":"#N/A"}},0,{"$error":"#N/A"},6]
[null,7,{"$f":"VLOOKUP(Results!$C$78,Database!$A$8:$AR$54,35,FALSE)/VLOOKUP(Results!$C$78,Database!$A$8:$AR$54,41,FALSE)","v":{"$error":"#N/A"}},0,{"$error":"#N/A"},7]
[null,8,{"$f":"VLOOKUP(Results!$C$85,Database!$A$8:$AR$54,35,FALSE)/VLOOKUP(Results!$C$85,Database!$A$8:$AR$54,41,FALSE)","v":{"$error":"#N/A"}},0,{"$error":"#N/A"},8]
[null,9,{"$f":"VLOOKUP(Results!$C$92,Database!$A$8:$AR$54,35,FALSE)/VLOOKUP(Results!$C$92,Database!$A$8:$AR$54,41,FALSE)","v":{"$error":"#N/A"}},0,{"$error":"#N/A"},9]
[null,10,{"$f":"VLOOKUP(Results!$C$99,Database!$A$8:$AR$54,35,FALSE)/VLOOKUP(Results!$C$99,Database!$A$8:$AR$54,41,FALSE)","v":{"$error":"#N/A"}},0,{"$error":"#N/A"},10]

{"sheet":"Translation","index":7,"n_rows":16,"n_cols":64,"rows_kept":16,"cut":false,"hidden":true,"merged":[]}
[1,2,3,4,5,6,7,8,9,10,11,12,13,14,15,16,17,18,19,20,21,22,23,24,25,26,27,28,29,30,31,32,33,34,35,36,37,38,39,40,41,42,43,44,45,46,47,48,49,50,51,52,53,54,55,56,57,58,59,60,61,62,63,64]
["English","Boxes coloured like this may be changed by user","Existing ","Unit Name","Quantity","VRV 'Q'  Equivalent","Existing Installation","VRVQ + Old IDUs","Counter","VRVQ + New IDUs","Totally new VRV","New Hi CoP VRVIII ","Counter","Cost of  Electricity (£)","Carbon Equivalent","Replacement System","Annual Running Cost","Saving","Annual CO2 Emission","Existing","Click here >>>","hours/day","days/week","weeks/year","heating weeks","cooling weeks","intermediate weeks","Select Conditions","£/annum","CO2/annum","£/kWh","p/kWh",0.15,"Select the existing ODUs and it will display typical current running costs for a  installation with a mix of indoor units.","A comparison will be given for running costs for direct replacements By VRV Q and VRVIII  using:","new indoor units, existing indoor units and a completely new system","** NOTE: THIS IS NOT TO BE USED AS A DESIGN TOOL BUT FOR AVERAGE COMPARISONS ONLY **","Number of Outdoor Units","Next","Back","Finish","If you start a new selection you will lose all the data relative to the current project.","Back to the current","Start a new selection","Not enough Indoor Units connected","Over capacity: remove some Indoor Units","Your current connection index is:","Project Summary","Show detailed view","You have to use all the available slots for the Outdoor Units. If you want to reduce the size of the project go back to the welcome screen.","Save as PDF","Worst","Average","Best","The following results are based upon nominal conditions and are based on UK average conditions.","Warning! The number of weeks selected is outside the maximum range!","Press \"Start\" to begin your new project. Note: you'll lose all the information related to your last selection.","Insert Project Reference / Customer Name","Select application:","Meeting Room","Office","Restaurant","Shop Floor","Manual Setup"]
["Italiano","Le caselle di questo colore possono essere modificate","Attuale","Nome dell'unitá","Quantitá","VRV 'Q' Equivalente","Installazione esistente","VRVQ + Vecchie IDUs","Contatore","VRVQ + Nuove IDUs","VRV Completamente Nuovo","Hi CoP VRVIII Nuovo",{"$f":"I3","v":"Contatore"},"Prezzo Elettricitá (€)","Conversione CO2","Sistema di ricambio","Costo di esercizio annuale","Risparmio","Emissioni annuali CO2",{"$f":"C3","v":"Attuale"},"Clicca Qui >>>","ore/giorno","giorni/settimana","settimane/anno","settimane di riscaldamento","settimane di condizionamento","settimane intermedie","Seleziona le condizioni","€/anno","CO2/anno","€/kWh","cent./kWh",0.25,"Selezionando le ODU esistenti verrà visualizzato il tipico costo di funzionamento per una installazione con un mix di unità interne a scelta.","Sarà mostrato un confronto dei costi di esercizio per la sostituzione diretta con VRV Q e VRVIII utilizzando:","nuove unità interne, unità interne esistenti e un sistema completamente nuovo","** NOTA: QUESTO FILE NON DEVE ESSERE USATO COME STRUMENTO DI PROGETTAZIONE MA SOLO PER CONFRONTI **","Numero di unitá esterne","Avanti","Indietro","Fine","Ripartendo con una nuova selezione perderai tutti i risultati attuali.","Indietro","Inizia una nuova selezione","Non hai selezionato abbastanza unitá interne","Eccesso di capacità, rimuovere alcune unità interne","L'indice di connessione attuale è:","Riassunto","Mostra risultati completi","Devi usare tutti gli spazi a disposizione per le Unitá Esterne. Per ridurre la dimensione del progetto torna alla schermata iniziale.","Salva come PDF","Peggiore","Medio","Migliore","I seguenti risultati sono basati su condizioni nominali.","Attenzione! Il numero di settimane selezionate non è compreso nell'intervallo massimo!","Premere il tasto \"Start\" per iniziare un nuovo progetto. Nota: perderai tutte le informazioni relative all'ultima selezione effettuata.","Inserire Numero Progetto / Nome Cliente","Seleziona applicazione:","Sala Riunioni","Ufficio","Ristorante","Negozio","Impostazioni Manuali"]
["Español","Cajas de colores como este puede ser cambiado por el usuario","Existente","Nombre de la unidad","Cantidad","Equivalente VRV 'Q' ","Instalación existente","VRVQ + viejo IDUs","Contador","VRVQ + nuevo IDUs","Totalmente nuevo VRV","Nuevo Hi CoP VRVIII ",{"$f":"I4","v":"Contador"},"Coste de la electricidad (€)","Carbono equivalente","Adelgazante","Costo anual de funcionamiento","Ahorro","Las emisiones anuales de CO2",{"$f":"C4","v":"Existente"},"Clic aquí >>>","horas/día","días/semana","semana/año","semanas de calefacción","semanas de refrigeración","semanas intermedias","Seleccionar la condición","€/año","CO2/año","€/kWh","cent./kWh",0.18,"Seleccione los ODUs existentes y se mostrará típicos costos actuales de funcionamiento de una instalación con una combinación de unidades interiores.","La comparación se dará para los gastos de funcionamiento para los reemplazos de particular a VRV Q y VRVIII utilizando:","nuevas unidades interiores, existentes unidades interiores y un sistema completamente nuevo","** NOTA: ESTO NO DEBE SER UTILIZADO COMO HERRAMIENTA DE DISEÑO PERO SOLO PARA COMPARACIONES DE MEDIOS **","Número de unidades exteriores","Próximo","Espalda","Final","A partir de una nueva selección se perderán todos los resultados actuales.",{"$f":"AN4","v":"Espalda"},"Iniciar una nueva selección","No suficientes unidades interiores conectadas","El exceso de capacidad, elimine algunos Unidades interiores","Su índice de conexión actual es:","Resumen del proyecto","Mostrar la vista detallada","Usted tiene que utilizar todos los espacios disponibles para las unidades exteriores. Si desea reducir el tamaño del proyecto se remontan a la pantalla de bienvenida.","Guardar como PDF","Peor","Promedio","Mejor","Los siguientes resultados se basan en condiciones nominales.","¡Advertencia! El número de semanas seleccionados está fuera del rango máximo!","Pulse el botón \"Start\" para iniciar su nuevo proyecto. Nota: si no se pierden toda la información relacionada con su última selección.","Inserte Referencia del Proyecto / Nombre del cliente","Seleccionar la aplicación:","Sala de reuniones","Oficina","Restaurante","Tienda","Configuración manual"]
["Française","Boîtes de couleur comme ça peuvent être changées par l'utilisateur","Existant","Nom de l'unité","Quantité","VRV 'Q' équivalent","Installation existante","VRVQ + vieux IDUs","Compteur","VRVQ + neuf IDUs","Totalement nouveau VRV","Nouveau Hi CoP VRVIII ",{"$f":"I5","v":"Compteur"},"Coût de l'électricité (€)","Carbone équivalent","Système de remplacement","Coûts annuels d'exploitation","épargne","Annuel émissions de CO2",{"$f":"C5","v":"Existant"},"Cliquez ici >>>","heures/jour","jours/semaine","semaines/an","semaines de chauffage","semaine de refroidissement","semaine intermédiaires","Sélectionnez les conditions","€/an","CO2/an","€/kWh","cent./kWh",0.13,"Sélectionnez les ODU existants et il affichera typiques frais de fonctionnement courants pour une installation avec un mélange d'unités intérieures.","Une comparaison sera accordé pour les frais de fonctionnement pour un remplacement direct par VRV Q et VRVIII l'aide:","nouvelles unités intérieures existantes, des unités intérieures et d'un système complètement nouveau","** REMARQUE: IL NE DOIT PAS ÊTRE UTILISÉ COMME UN OUTIL DE CONCEPTION MAIS POUR COMPARAISONS MOYENNE SEULEMENT **","Nombre de parts extérieures","Suivant","Arrière","Fin","À partir de la nouvelle sélection de perdre tous les résultats actuels.",{"$f":"AN5","v":"Arrière"},"Démarrer une nouvelle sélection","Pas assez d'unités intérieures raccordées","Surcapacité, supprimez des unités intérieures","Votre index de connexion actuelle est:","Sommaire du projet","Afficher la vue détaillée","Vous devez utiliser tous les emplacements disponibles pour les unités extérieures. Si vous voulez réduire la taille du projet revenir à l'écran d'accueil.","Enregistrer en tant que PDF","Pire","Moyenne","Meilleur","Les résultats suivants sont basés sur des conditions nominales.","Attention! Le nombre de semaines sélectionnées n'entre pas dans le portée maximum!","Appuyez sur \"Start\" pour commencer votre nouveau projet. Remarque: vous perdrez toutes les informations relatives à votre dernière sélection.","Insérez de référence du projet / Nom du client","Sélectionnez l'application:","Salle de réunion","Bureau","Restaurant","Boutique","Configuration manuelle"]
["Deutsch","Boxen farbigen wie diese können vom Benutzer geändert werden","Vorhanden","Muster","Menge","VRV 'Q' äquivalent","Bestehende Installation","VRVQ + Alt IDUs","Kontern","VRVQ + Neu IDUs","Völlig neue VRV","Neu Hi CoP VRVIII",{"$f":"I6","v":"Kontern"},"Kosten für Strom (€)","Kohlenstoff-Äquivalent","Ersatzsystem","Jährliche Betriebskosten","Einsparung","Jährliche CO2-Emissionen",{"$f":"C6","v":"Vorhanden"},"Klicken Sie hier >>>","Stunden/Tag","Tage/Woche","Wochen/Jahr","Heizung Woche","Kühlung Woche","Zwischen Woche","Bedingungen auswählen","€/jahr","€/jahr","€/kWh","cent./kWh",0.24,"Wählen Sie die vorhandenen ODUs und es werden typische aktuellen laufenden Kosten für eine Installation mit einer Mischung aus Innengeräten anzuzeigen.","Ein Vergleich wird für die laufenden Kosten für den direkten Ersatz von VRV Q und VRVIII mit angegeben werden:","neuen Innengeräte bestehende Innengeräte und ein völlig neues System","** Hinweis: Dies ist nicht als Design-Tool sondern für das durchschnittliche VERGLEICHE nur verwendet werden **","Anzahl der Außengeräte","Nächste","Zurück","Ende","Ab einer neuen Auswahl verliert alle aktuellen Ergebnisse.",{"$f":"AN6","v":"Zurück"},"Starten Sie eine neue Auswahl","Nicht genug Innengeräte angeschlossen","Überkapazitäten, entfernen Sie einige Indoor Units","Ihre aktuelle Verbindung Index:","Zusammenfassung des Projekts","Detaillierte Sicht","Sie haben, um alle verfügbaren Steckplätze für die Außengeräte verwenden. Wenn Sie die Größe des Projekts reduzieren wollen zurück zum Startbildschirm.","Speichern unter PDF","Schlechteste","Durchschnitt","Beste","Die folgenden Ergebnisse basieren auf nominalen Bedingungen.","Warnung! Die Zahl der Woche gewählt ist außerhalb der maximalen Reichweite!","Drücken Sie auf \"Start\", um Ihr neues Projekt zu beginnen. Hinweis: Sie verlieren alle Informationen, die im Zusammenhang mit Ihrer letzten Auswahl.","Legen Project Reference / Customer Name","Anwendung auswählen:","Meeting Room","Büro","Gaststätte","Geschäft","Manual Setup"]
["Lang6"]
["Lang7"]
["Lang8"]
["Lang9"]
["Lang10"]
["Lang11"]
["Lang12"]
["Lang13"]
["Lang14"]
["Lang15"]

{"sheet":"Lists","index":8,"n_rows":47,"n_cols":14,"rows_kept":47,"cut":false,"hidden":true,"merged":[]}
[null,null,null,"Outdoor Unit",null,"Indoor Type","Capacity",null,{"$f":"F3","v":"Ceiling Mounted Cassette"},{"$f":"F5","v":"Ceiling Suspended"},{"$f":"F4","v":"Horizontal Ducted"},{"$f":"F6","v":"Wall Mounted"},{"$f":"F7","v":"Floor Standing"},{"$f":"F8","v":"Concealed Floor"}]
[null,null,null,"RSXY5G/H",null,"Select To Remove Unit",0,null,0,0,0,0,0,0]
[null,null,null,"RSXY8G/H",null,"Ceiling Mounted Cassette","Select",null,32,31.25,20,25,25,25]
[null,null,null,"RSXY10G/H",null,"Horizontal Ducted","the",null,40,63,25,31.25,40,40]
[null,null,null,"RSEY8G/H",null,"Ceiling Suspended","indoor",null,50,100,31.25,40,63,63]
[null,null,null,"RSEY10G/H",null,"Wall Mounted","unit",null,63,null,40,50]
[null,null,null,"RSXY5K7",null,"Floor Standing","first",null,80,null,50,63]
[null,null,null,"RSXY8K7",null,"Concealed Floor",null,null,100,null,63]
[null,null,null,"RSXY10K7",null,null,null,null,125,null,80]
[null,null,null,"RXY16K",null,null,null,null,null,null,100]
[null,null,null,"RXY18K",null,null,null,null,null,null,125]
[null,null,null,"RXY20K"]
[null,null,null,"RXY24K"]
[null,null,null,"RXY26K"]
[null,null,null,"RXY28K"]
[null,null,null,"RXY30K"]
[]
[null,null,null,"RSEY8KL"]
[null,null,null,"RSEY10KL"]
[null,null,null,"REY16K"]
[null,null,null,"REY18K"]
[null,null,null,"REY20K"]
[null,null,null,"REY24K"]
[null,null,null,"REY26K"]
[null,null,null,"REY28K"]
[null,null,null,"REY30K"]
[]
[null,null,null,"RSXYP5K7"]
[null,null,null,"RSXYP8K7"]
[null,null,null,"RSXYP10K7"]
[null,null,null,"RSXYP16J"]
[null,null,null,"RSXYP18J"]
[null,null,null,"RSXYP20J"]
[null,null,null,"RSXYP24J"]
[null,null,null,"RSXYP26J"]
[null,null,null,"RSXYP28J"]
[null,null,null,"RSXYP30J"]
[]
[null,null,null,"RSEYP8KJ"]
[null,null,null,"RSEYP10KJ"]
[null,null,null,"RSEYP16KJ"]
[null,null,null,"RSEYP18KJ"]
[null,null,null,"RSEYP20KJ"]
[null,null,null,"RSEYP24KJ"]
[null,null,null,"RSEYP26KJ"]
[null,null,null,"RSEYP28KJ"]
[null,null,null,"RSEYP30KJ"]

{"sheet":"Conditions","index":9,"n_rows":70,"n_cols":13,"rows_kept":70,"cut":false,"hidden":true,"merged":[[10,0,24,0],[25,0,39,0],[40,0,54,0],[55,0,69,0]]}
["Country",{"$f":"Output!J2","v":"English"}]
["Application",{"$f":"Output!C25","v":"Office"}]
[]
[null,null,"hours/day","days/week","weeks/year","cooling weeks","heating weeks","intermediate weeks","energy price","Carbon Equivalent","Diversity Cooling","Diversity Heating","Diversity Intermediate"]
["Meeting Room",1,{"$f":"VLOOKUP($B$1,$B$11:$J$25,2,FALSE)","v":8},{"$f":"VLOOKUP($B$1,$B$11:$J$25,3,FALSE)","v":6},{"$f":"VLOOKUP($B$1,$B$11:$J$25,4,FALSE)","v":50},{"$f":"VLOOKUP($B$1,$B$11:$J$25,5,FALSE)","v":15},{"$f":"VLOOKUP($B$1,$B$11:$J$25,6,FALSE)","v":16},{"$f":"VLOOKUP($B$1,$B$11:$J$25,7,FALSE)","v":19},{"$f":"VLOOKUP($B$1,$B$11:$J$25,8,FALSE)","v":0.12},{"$f":"VLOOKUP($B$1,$B$11:$J$25,9,FALSE)","v":0.52700000000000002}]
["Office",2,{"$f":"VLOOKUP($B$1,B26:J40,2,FALSE)","v":8},{"$f":"VLOOKUP($B$1,B26:J40,3,FALSE)","v":6},{"$f":"VLOOKUP($B$1,B26:J40,4,FALSE)","v":50},{"$f":"VLOOKUP($B$1,B26:J40,5,FALSE)","v":15},{"$f":"VLOOKUP($B$1,B26:J405,6,FALSE)","v":16},{"$f":"VLOOKUP($B$1,B26:J40,7,FALSE)","v":19},{"$f":"VLOOKUP($B$1,B26:J40,8,FALSE)","v":0.12},{"$f":"VLOOKUP($B$1,B26:J40,9,FALSE)","v":0.52700000000000002}]
["Restaurant",3,{"$f":"VLOOKUP($B$1,B41:J55,2,FALSE)","v":8},{"$f":"VLOOKUP($B$1,B41:J55,3,FALSE)","v":6},{"$f":"VLOOKUP($B$1,B41:J55,4,FALSE)","v":50},{"$f":"VLOOKUP($B$1,B41:J55,5,FALSE)","v":15},{"$f":"VLOOKUP($B$1,B41:J55,6,FALSE)","v":16},{"$f":"VLOOKUP($B$1,B41:J55,7,FALSE)","v":19},{"$f":"VLOOKUP($B$1,B41:J55,8,FALSE)","v":0.12},{"$f":"VLOOKUP($B$1,B41:J55,9,FALSE)","v":0.52700000000000002}]
["Shop Floor",4,{"$f":"VLOOKUP($B$1,B56:J70,2,FALSE)","v":8},{"$f":"VLOOKUP($B$1,B56:J70,3,FALSE)","v":6},{"$f":"VLOOKUP($B$1,B56:J70,4,FALSE)","v":50},{"$f":"VLOOKUP($B$1,B56:J70,5,FALSE)","v":15},{"$f":"VLOOKUP($B$1,B56:J70,6,FALSE)","v":16},{"$f":"VLOOKUP($B$1,B56:J70,7,FALSE)","v":19},{"$f":"VLOOKUP($B$1,B56:J70,8,FALSE)","v":0.12},{"$f":"VLOOKUP($B$1,B56:J70,9,FALSE)","v":0.52700000000000002}]
[]
[null,null,"hours/day","days/week","weeks/year","cooling weeks","heating weeks","intermediate weeks","energy price","Carbon Equivalent"]
[{"$f":"A5","v":"Meeting Room"},{"$f":"Translation!$A$2","v":"English"},8,6,50,15,16,{"$f":"E11-F11-G11","v":19},0.12,0.52700000000000002]
[null,{"$f":"Translation!$A$3","v":"Italiano"},8,6,50,15,16,19,0.12,0.52700000000000002]
[null,{"$f":"Translation!$A$4","v":"Español"},8,6,50,15,16,19,0.12,0.52700000000000002]
[null,{"$f":"Translation!$A$5","v":"Française"},8,6,50,15,16,19,0.12,0.52700000000000002]
[null,{"$f":"Translation!$A$6","v":"Deutsch"},8,6,50,15,16,19,0.12,0.52700000000000002]
[null,{"$f":"Translation!$A$7","v":"Lang6"},8,6,50,15,16,19,0.12,0.52700000000000002]
[null,{"$f":"Translation!$A$8","v":"Lang7"},8,6,50,15,16,19,0.12,0.52700000000000002]
[null,{"$f":"Translation!$A$9","v":"Lang8"},8,6,50,15,16,19,0.12,0.52700000000000002]
[null,{"$f":"Translation!$A$10","v":"Lang9"},8,6,50,15,16,19,0.12,0.52700000000000002]
[null,{"$f":"Translation!$A$11","v":"Lang10"},8,6,50,15,16,19,0.12,0.52700000000000002]
[null,{"$f":"Translation!$A$12","v":"Lang11"},8,6,50,15,16,19,0.12,0.52700000000000002]
[null,{"$f":"Translation!$A$13","v":"Lang12"},8,6,50,15,16,19,0.12,0.52700000000000002]
[null,{"$f":"Translation!$A$14","v":"Lang13"},8,6,50,15,16,19,0.12,0.52700000000000002]
[null,{"$f":"Translation!$A$15","v":"Lang14"},8,6,50,15,16,19,0.12,0.52700000000000002]
[null,{"$f":"Translation!$A$16","v":"Lang15"},8,6,50,15,16,19,0.12,0.52700000000000002]
[{"$f":"A6","v":"Office"},{"$f":"Translation!$A$2","v":"English"},8,6,50,15,16,19,0.12,0.52700000000000002]
[null,{"$f":"Translation!$A$3","v":"Italiano"},8,6,50,15,16,19,0.12,0.52700000000000002]
[null,{"$f":"Translation!$A$4","v":"Español"},8,6,50,15,16,19,0.12,0.52700000000000002]
[null,{"$f":"Translation!$A$5","v":"Française"},8,6,50,15,16,19,0.12,0.52700000000000002]
[null,{"$f":"Translation!$A$6","v":"Deutsch"},8,6,50,15,16,19,0.12,0.52700000000000002]
[null,{"$f":"Translation!$A$7","v":"Lang6"},8,6,50,15,16,19,0.12,0.52700000000000002]
[null,{"$f":"Translation!$A$8","v":"Lang7"},8,6,50,15,16,19,0.12,0.52700000000000002]
[null,{"$f":"Translation!$A$9","v":"Lang8"},8,6,50,15,16,19,0.12,0.52700000000000002]
[null,{"$f":"Translation!$A$10","v":"Lang9"},8,6,50,15,16,19,0.12,0.52700000000000002]
[null,{"$f":"Translation!$A$11","v":"Lang10"},8,6,50,15,16,19,0.12,0.52700000000000002]
[null,{"$f":"Translation!$A$12","v":"Lang11"},8,6,50,15,16,19,0.12,0.52700000000000002]
[null,{"$f":"Translation!$A$13","v":"Lang12"},8,6,50,15,16,19,0.12,0.52700000000000002]
[null,{"$f":"Translation!$A$14","v":"Lang13"},8,6,50,15,16,19,0.12,0.52700000000000002]
[null,{"$f":"Translation!$A$15","v":"Lang14"},8,6,50,15,16,19,0.12,0.52700000000000002]
[null,{"$f":"Translation!$A$16","v":"Lang15"},8,6,50,15,16,19,0.12,0.52700000000000002]
[{"$f":"A7","v":"Restaurant"},{"$f":"Translation!$A$2","v":"English"},8,6,50,15,16,19,0.12,0.52700000000000002]
[null,{"$f":"Translation!$A$3","v":"Italiano"},8,6,50,15,16,19,0.12,0.52700000000000002]
[null,{"$f":"Translation!$A$4","v":"Español"},8,6,50,15,16,{"$f":"E43-F43-G43","v":19},0.12,0.52700000000000002]
[null,{"$f":"Translation!$A$5","v":"Française"},8,6,50,15,16,19,0.12,0.52700000000000002]
[null,{"$f":"Translation!$A$6","v":"Deutsch"},8,6,50,15,16,19,0.12,0.52700000000000002]
[null,{"$f":"Translation!$A$7","v":"Lang6"},8,6,50,15,16,19,0.12,0.52700000000000002]
[null,{"$f":"Translation!$A$8","v":"Lang7"},8,6,50,15,16,19,0.12,0.52700000000000002]
[null,{"$f":"Translation!$A$9","v":"Lang8"},8,6,50,15,16,19,0.12,0.52700000000000002]
[null,{"$f":"Translation!$A$10","v":"Lang9"},8,6,50,15,16,19,0.12,0.52700000000000002]
[null,{"$f":"Translation!$A$11","v":"Lang10"},8,6,50,15,16,19,0.12,0.52700000000000002]
[null,{"$f":"Translation!$A$12","v":"Lang11"},8,6,50,15,16,19,0.12,0.52700000000000002]
[null,{"$f":"Translation!$A$13","v":"Lang12"},8,6,50,15,16,19,0.12,0.52700000000000002]
[null,{"$f":"Translation!$A$14","v":"Lang13"},8,6,50,15,16,19,0.12,0.52700000000000002]
[null,{"$f":"Translation!$A$15","v":"Lang14"},8,6,50,15,16,19,0.12,0.52700000000000002]
[null,{"$f":"Translation!$A$16","v":"Lang15"},8,6,50,15,16,19,0.12,0.52700000000000002]
[{"$f":"A8","v":"Shop Floor"},{"$f":"Translation!$A$2","v":"English"},8,6,50,15,16,19,0.12,0.52700000000000002]
[null,{"$f":"Translation!$A$3","v":"Italiano"},8,6,50,15,16,19,0.12,0.52700000000000002]
[null,{"$f":"Translation!$A$4","v":"Español"},8,6,50,15,16,19,0.12,0.52700000000000002]
[null,{"$f":"Translation!$A$5","v":"Française"},8,6,50,15,16,19,0.12,0.52700000000000002]
[null,{"$f":"Translation!$A$6","v":"Deutsch"},8,6,50,15,16,19,0.12,0.52700000000000002]
[null,{"$f":"Translation!$A$7","v":"Lang6"},8,6,50,15,16,19,0.12,0.52700000000000002]
[null,{"$f":"Translation!$A$8","v":"Lang7"},8,6,50,15,16,19,0.12,0.52700000000000002]
[null,{"$f":"Translation!$A$9","v":"Lang8"},8,6,50,15,16,19,0.12,0.52700000000000002]
[null,{"$f":"Translation!$A$10","v":"Lang9"},8,6,50,15,16,19,0.12,0.52700000000000002]
[null,{"$f":"Translation!$A$11","v":"Lang10"},8,6,50,15,16,19,0.12,0.52700000000000002]
[null,{"$f":"Translation!$A$12","v":"Lang11"},8,6,50,15,16,19,0.12,0.52700000000000002]
[null,{"$f":"Translation!$A$13","v":"Lang12"},8,6,50,15,16,19,0.12,0.52700000000000002]
[null,{"$f":"Translation!$A$14","v":"Lang13"},8,6,50,15,16,19,0.12,0.52700000000000002]
[null,{"$f":"Translation!$A$15","v":"Lang14"},8,6,50,15,16,19,0.12,0.52700000000000002]
[null,{"$f":"Translation!$A$16","v":"Lang15"},8,6,50,15,16,19,0.12,0.52700000000000002]